cxf-notifications mailing list archives

Site index · List index
Message view « Date » · « Thread »
Top « Date » · « Thread »
From Apache Jenkins Server <jenk...@builds.apache.org>
Subject Build failed in Jenkins: CXF-trunk-windows #265
Date Thu, 08 Dec 2011 22:05:06 GMT
See <https://builds.apache.org/job/CXF-trunk-windows/265/changes>

Changes:

[dkulp] Add AES method to https setups so they can run with Java7

[dkulp] [CXF-3895] Support for the Jetty OBF: prefixed passwords

[dkulp] Fix eclipse warning when using jaxws22/java7

[dkulp] On java7, the test methods are executed in a different order and state
in the singleton bookestore leaks across tests and causes failures.
Add a reset that is called after each test to reset the singleton back
to its empty state.

[dkulp] [CXF-3910] Add test cases for thread local request contexts for dispatch
clients

[dkulp] [CXF-3956] Fix problem of Dispatch clients not using the HandlerResolver

[coheigea] [WSS-3960] - Patch for InitiatorSignatureToken Support in WS-Policy definition
 - Patch applied (with some minor modifications), thanks.
 - I added a systest.

[bimargulies] CXF-3964: simplify code. The maven-artifact-resolver is the right API for what
this is trying to do.
This doesn't make the M3 bug disappear, but it makes this code easier to read.

[bimargulies] CXF-3964: Diagnose missing artifact wsdls, and compensate for apparent resolver
bug.

[bimargulies] CXF-3963 set up maven-site-plugin 3.0. Don't work yet.

------------------------------------------
[...truncated 330 lines...]
Downloading: http://repo1.maven.org/maven2/org/sonatype/sisu/sisu-guice/2.1.7/sisu-guice-2.1.7-noaop.jar
Downloaded: http://repo1.maven.org/maven2/org/codehaus/plexus/plexus-interactivity-api/1.0-alpha-6/plexus-interactivity-api-1.0-alpha-6.jar
(12 KB at 5.3 KB/sec)
Downloading: http://repo1.maven.org/maven2/org/codehaus/plexus/plexus-interpolation/1.14/plexus-interpolation-1.14.jar
Downloaded: http://repo1.maven.org/maven2/com/jcraft/jsch/0.1.44-1/jsch-0.1.44-1.jar (209
KB at 78.1 KB/sec)
Downloading: http://repo1.maven.org/maven2/org/codehaus/plexus/plexus-component-annotations/1.5.5/plexus-component-annotations-1.5.5.jar
Downloaded: http://repo1.maven.org/maven2/org/sonatype/aether/aether-util/1.7/aether-util-1.7.jar
(106 KB at 42.2 KB/sec)
Downloading: http://repo1.maven.org/maven2/org/sonatype/plexus/plexus-sec-dispatcher/1.3/plexus-sec-dispatcher-1.3.jar
Downloaded: http://repo1.maven.org/maven2/org/sonatype/sisu/sisu-inject-bean/1.4.2/sisu-inject-bean-1.4.2.jar
(150 KB at 59.3 KB/sec)
Downloading: http://repo1.maven.org/maven2/org/sonatype/plexus/plexus-cipher/1.4/plexus-cipher-1.4.jar
Downloaded: http://repo1.maven.org/maven2/org/codehaus/plexus/plexus-component-annotations/1.5.5/plexus-component-annotations-1.5.5.jar
(5 KB at 2.3 KB/sec)
Downloading: http://repo1.maven.org/maven2/org/apache/maven/doxia/doxia-sink-api/1.2/doxia-sink-api-1.2.jar
Downloaded: http://repo1.maven.org/maven2/org/codehaus/plexus/plexus-interpolation/1.14/plexus-interpolation-1.14.jar
(60 KB at 23.9 KB/sec)
Downloading: http://repo1.maven.org/maven2/org/apache/maven/doxia/doxia-logging-api/1.2/doxia-logging-api-1.2.jar
Downloaded: http://repo1.maven.org/maven2/org/sonatype/sisu/sisu-guice/2.1.7/sisu-guice-2.1.7-noaop.jar
(461 KB at 141.7 KB/sec)
Downloading: http://repo1.maven.org/maven2/org/apache/maven/doxia/doxia-core/1.2/doxia-core-1.2.jar
Downloaded: http://repo1.maven.org/maven2/org/sonatype/plexus/plexus-sec-dispatcher/1.3/plexus-sec-dispatcher-1.3.jar
(28 KB at 12.4 KB/sec)
Downloading: http://repo1.maven.org/maven2/org/apache/httpcomponents/httpclient/4.0.2/httpclient-4.0.2.jar
Downloaded: http://repo1.maven.org/maven2/org/sonatype/plexus/plexus-cipher/1.4/plexus-cipher-1.4.jar
(14 KB at 5.3 KB/sec)
Downloading: http://repo1.maven.org/maven2/org/apache/httpcomponents/httpcore/4.0.1/httpcore-4.0.1.jar
Downloaded: http://repo1.maven.org/maven2/org/apache/maven/doxia/doxia-sink-api/1.2/doxia-sink-api-1.2.jar
(11 KB at 4.4 KB/sec)
Downloading: http://repo1.maven.org/maven2/commons-codec/commons-codec/1.3/commons-codec-1.3.jar
Downloaded: http://repo1.maven.org/maven2/org/apache/maven/doxia/doxia-logging-api/1.2/doxia-logging-api-1.2.jar
(12 KB at 4.4 KB/sec)
Downloading: http://repo1.maven.org/maven2/org/apache/maven/doxia/doxia-module-xhtml/1.2/doxia-module-xhtml-1.2.jar
Downloaded: http://repo1.maven.org/maven2/org/apache/maven/doxia/doxia-core/1.2/doxia-core-1.2.jar
(151 KB at 50.2 KB/sec)
Downloading: http://repo1.maven.org/maven2/org/apache/maven/doxia/doxia-module-apt/1.2/doxia-module-apt-1.2.jar
Downloaded: http://repo1.maven.org/maven2/org/apache/httpcomponents/httpclient/4.0.2/httpclient-4.0.2.jar
(287 KB at 114.0 KB/sec)
Downloading: http://repo1.maven.org/maven2/org/apache/maven/doxia/doxia-module-xdoc/1.2/doxia-module-xdoc-1.2.jar
Downloaded: http://repo1.maven.org/maven2/commons-codec/commons-codec/1.3/commons-codec-1.3.jar
(46 KB at 20.3 KB/sec)
Downloading: http://repo1.maven.org/maven2/org/apache/maven/doxia/doxia-module-fml/1.2/doxia-module-fml-1.2.jar
Downloaded: http://repo1.maven.org/maven2/org/apache/httpcomponents/httpcore/4.0.1/httpcore-4.0.1.jar
(169 KB at 61.3 KB/sec)
Downloading: http://repo1.maven.org/maven2/javax/servlet/servlet-api/2.5/servlet-api-2.5.jar
Downloaded: http://repo1.maven.org/maven2/org/apache/maven/doxia/doxia-module-xhtml/1.2/doxia-module-xhtml-1.2.jar
(15 KB at 5.9 KB/sec)
Downloading: http://repo1.maven.org/maven2/org/apache/maven/doxia/doxia-decoration-model/1.2/doxia-decoration-model-1.2.jar
Downloaded: http://repo1.maven.org/maven2/org/apache/maven/doxia/doxia-module-apt/1.2/doxia-module-apt-1.2.jar
(51 KB at 22.5 KB/sec)
Downloading: http://repo1.maven.org/maven2/org/apache/maven/doxia/doxia-site-renderer/1.2/doxia-site-renderer-1.2.jar
Downloaded: http://repo1.maven.org/maven2/org/apache/maven/doxia/doxia-module-xdoc/1.2/doxia-module-xdoc-1.2.jar
(36 KB at 14.4 KB/sec)
Downloading: http://repo1.maven.org/maven2/org/apache/maven/shared/maven-doxia-tools/1.4/maven-doxia-tools-1.4.jar
Downloaded: http://repo1.maven.org/maven2/org/apache/maven/doxia/doxia-module-fml/1.2/doxia-module-fml-1.2.jar
(37 KB at 16.4 KB/sec)
Downloading: http://repo1.maven.org/maven2/org/codehaus/plexus/plexus-utils/1.5.10/plexus-utils-1.5.10.jar
Downloaded: http://repo1.maven.org/maven2/javax/servlet/servlet-api/2.5/servlet-api-2.5.jar
(103 KB at 41.1 KB/sec)
Downloading: http://repo1.maven.org/maven2/org/mortbay/jetty/jetty/6.1.25/jetty-6.1.25.jar
Downloaded: http://repo1.maven.org/maven2/org/apache/maven/doxia/doxia-decoration-model/1.2/doxia-decoration-model-1.2.jar
(59 KB at 21.2 KB/sec)
Downloading: http://repo1.maven.org/maven2/org/mortbay/jetty/servlet-api/2.5-20081211/servlet-api-2.5-20081211.jar
Downloaded: http://repo1.maven.org/maven2/org/apache/maven/doxia/doxia-site-renderer/1.2/doxia-site-renderer-1.2.jar
(51 KB at 18.5 KB/sec)
Downloading: http://repo1.maven.org/maven2/org/mortbay/jetty/jetty-util/6.1.25/jetty-util-6.1.25.jar
Downloaded: http://repo1.maven.org/maven2/org/apache/maven/shared/maven-doxia-tools/1.4/maven-doxia-tools-1.4.jar
(45 KB at 17.6 KB/sec)
Downloading: http://repo1.maven.org/maven2/commons-lang/commons-lang/2.5/commons-lang-2.5.jar
Downloaded: http://repo1.maven.org/maven2/org/codehaus/plexus/plexus-utils/1.5.10/plexus-utils-1.5.10.jar
(274 KB at 99.0 KB/sec)
Downloaded: http://repo1.maven.org/maven2/org/mortbay/jetty/jetty/6.1.25/jetty-6.1.25.jar
(526 KB at 191.3 KB/sec)
Downloaded: http://repo1.maven.org/maven2/org/mortbay/jetty/servlet-api/2.5-20081211/servlet-api-2.5-20081211.jar
(131 KB at 52.4 KB/sec)
Downloaded: http://repo1.maven.org/maven2/org/mortbay/jetty/jetty-util/6.1.25/jetty-util-6.1.25.jar
(174 KB at 86.5 KB/sec)
Downloaded: http://repo1.maven.org/maven2/commons-lang/commons-lang/2.5/commons-lang-2.5.jar
(273 KB at 155.8 KB/sec)
[INFO] 
[INFO] --- maven-install-plugin:2.3.1:install (default-install) @ cxf ---
[INFO] Installing <https://builds.apache.org/job/CXF-trunk-windows/ws/trunk> with spaces\pom.xml
to <https://builds.apache.org/job/CXF-trunk-windows/ws/.repository\org\apache\cxf\cxf\2.5.1-SNAPSHOT\cxf-2.5.1-SNAPSHOT.pom>
[INFO] Installing <https://builds.apache.org/job/CXF-trunk-windows/ws/trunk> with spaces\target\cxf-2.5.1-SNAPSHOT-site.xml
to <https://builds.apache.org/job/CXF-trunk-windows/ws/.repository\org\apache\cxf\cxf\2.5.1-SNAPSHOT\cxf-2.5.1-SNAPSHOT-site.xml>
[JENKINS] Archiving disabled - not archiving <https://builds.apache.org/job/CXF-trunk-windows/ws/trunk>
with spaces\pom.xml
[JENKINS] Archiving disabled - not archiving <https://builds.apache.org/job/CXF-trunk-windows/ws/trunk>
with spaces\target\cxf-2.5.1-SNAPSHOT-site.xml
[INFO]                                                                         
[INFO] ------------------------------------------------------------------------
[INFO] Building Apache CXF Parent 2.5.1-SNAPSHOT
[INFO] ------------------------------------------------------------------------
[INFO] [INFO] Deleting F:\hudson\hudson-slave\workspace\CXF-trunk-windows\trunk with spaces\parent\target

[INFO] --- maven-clean-plugin:2.4.1:clean (default-clean) @ cxf-parent ---
[INFO] 
[INFO] --- maven-checkstyle-plugin:2.8:checkstyle (validate) @ cxf-parent ---
[INFO] 
[INFO] --- maven-pmd-plugin:2.6:pmd (pmd) @ cxf-parent ---
[JENKINS] Archiving disabled - not archiving F:\hudson\hudson-slave\workspace\CXF-trunk-windows\trunk
with spaces\parent\pom.xml
[INFO] 
[INFO] --- maven-pmd-plugin:2.6:check (validate) @ cxf-parent ---
[INFO] 
[INFO] --- cxf-xml2fastinfoset-plugin:2.4.0:xml2fastinfoset (xml2fastinfoset) @ cxf-parent
---
[INFO] 
[INFO] --- maven-remote-resources-plugin:1.2.1:process (default) @ cxf-parent ---
[INFO] 
[INFO] --- maven-site-plugin:3.0:attach-descriptor (attach-descriptor) @ cxf-parent ---
[INFO] 
[INFO] --- maven-install-plugin:2.3.1:install (default-install) @ cxf-parent ---
[INFO] Installing F:\hudson\hudson-slave\workspace\CXF-trunk-windows\trunk with spaces\parent\pom.xml
to <https://builds.apache.org/job/CXF-trunk-windows/ws/.repository\org\apache\cxf\cxf-parent\2.5.1-SNAPSHOT\cxf-parent-2.5.1-SNAPSHOT.pom>
[JENKINS] Archiving disabled - not archiving F:\hudson\hudson-slave\workspace\CXF-trunk-windows\trunk
with spaces\parent\pom.xml
[INFO]                                                                         
[INFO] ------------------------------------------------------------------------
[INFO] Building Apache CXF Common Utilities 2.5.1-SNAPSHOT
[INFO] ------------------------------------------------------------------------
[INFO] Deleting F:\hudson\hudson-slave\workspace\CXF-trunk-windows\trunk with spaces\common\common\target
[INFO] 
[INFO] --- maven-clean-plugin:2.4.1:clean (default-clean) @ cxf-common-utilities ---
[JENKINS] Archiving disabled - not archiving F:\hudson\hudson-slave\workspace\CXF-trunk-windows\trunk
with spaces\common\common\pom.xml
[INFO] ------------------------------------------------------------------------
[INFO] Reactor Summary:
[INFO] 
[INFO] Apache CXF ........................................ SUCCESS [56.682s]
[INFO] Apache CXF Parent ................................. SUCCESS [4.035s]
[INFO] Apache CXF Common Utilities ....................... FAILURE [1.470s]
[INFO] Apache CXF API .................................... SKIPPED
[INFO] Apache CXF Woodstox/MSV Schema Validation ......... SKIPPED
[INFO] Apache CXF XML Schema Validation with Xerces ...... SKIPPED
[INFO] Apache CXF Common ................................. SKIPPED
[INFO] Apache CXF Runtime Core ........................... SKIPPED
[INFO] Apache CXF Command Line Tools Common .............. SKIPPED
[INFO] Apache CXF Command Line Tools Validator ........... SKIPPED
[INFO] Apache CXF Command Line Tools WSDLTo Core ......... SKIPPED
[INFO] Apache CXF Command Line Tools WSDLTo JAXWS Frontend  SKIPPED
[INFO] Apache CXF WSDL Validator Maven2 Plugin ........... SKIPPED
[INFO] Apache CXF Command Line Tools WSDLTo JAXB Databinding  SKIPPED
[INFO] Apache CXF Code Generation Maven2 Plugins ......... SKIPPED
[INFO] Apache CXF Test Utilities ......................... SKIPPED
[INFO] Apache CXF Runtime JAXB DataBinding ............... SKIPPED
[INFO] Apache CXF Runtime XML Binding .................... SKIPPED
[INFO] Apache CXF Runtime SOAP Binding ................... SKIPPED
[INFO] Apache CXF Runtime Local Transport ................ SKIPPED
[INFO] Apache CXF Runtime Simple Frontend ................ SKIPPED
[INFO] Apache CXF Runtime Transport Common Used Classes .. SKIPPED
[INFO] Apache CXF Runtime HTTP Transport ................. SKIPPED
[INFO] Apache CXF Runtime HTTP Jetty Transport ........... SKIPPED
[INFO] Apache CXF Runtime WS Addressing .................. SKIPPED
[INFO] Apache CXF Runtime JAX-WS Frontend ................ SKIPPED
[INFO] Apache CXF Runtime Aegis Databinding .............. SKIPPED
[INFO] Apache CXF Runtime JavaScript Client Generator .... SKIPPED
[INFO] Apache CXF Command Line Tools WSDL to JavaScript Front End  SKIPPED
[INFO] Apache CXF Runtime Management ..................... SKIPPED
[INFO] Apache CXF Runtime JMS Transport .................. SKIPPED
[INFO] Apache CXF Runtime XmlBeans DataBinding ........... SKIPPED
[INFO] Apache CXF Command Line Tools WSDLTo Test ......... SKIPPED
[INFO] Apache CXF Command Line Tools WSDLTo Misctools .... SKIPPED
[INFO] Apache CXF Command Line Tools ..................... SKIPPED
[INFO] Apache CXF Command Line Tools WSDLTo .............. SKIPPED
[INFO] Apache CXF Command Line Tools JavaTo WS ........... SKIPPED
[INFO] Apache CXF Command Line Tools JavaTo .............. SKIPPED
[INFO] Apache CXF Runtime SDO DataBinding ................ SKIPPED
[INFO] Apache CXF Runtime JAX-RS Frontend ................ SKIPPED
[INFO] Apache CXF Command Line Tools WADLTo JAXRS Frontend  SKIPPED
[INFO] Apache CXF Command Line Tools WADLTo .............. SKIPPED
[INFO] Apache CXF Runtime CORBA Binding .................. SKIPPED
[INFO] Apache CXF Command Line Tools CORBA ............... SKIPPED
[INFO] Apache CXF Runtime JiBX DataBinding ............... SKIPPED
[INFO] Apache CXF Runtime HTTP Binding ................... SKIPPED
[INFO] Apache CXF Runtime Object Binding ................. SKIPPED
[INFO] Apache CXF Runtime Colocated Binding .............. SKIPPED
[INFO] Apache CXF Runtime ................................ SKIPPED
[INFO] Apache CXF Runtime Bindings ....................... SKIPPED
[INFO] Apache CXF Runtime JavaScript Frontend ............ SKIPPED
[INFO] Apache CXF Runtime WS Policy ...................... SKIPPED
[INFO] Apache CXF Runtime WS Reliable Messaging .......... SKIPPED
[INFO] Apache CXF Runtime WS MetadataExchange ............ SKIPPED
[INFO] Apache CXF Runtime WS Security .................... SKIPPED
[INFO] Apache CXF RS XML Security ........................ SKIPPED
[INFO] Apache CXF Runtime RS Security OAuth Parent ....... SKIPPED
[INFO] Apache CXF Runtime OAuth 1.0a ..................... SKIPPED
[INFO] Apache CXF Runtime OAuth 1.0a Test Providers ...... SKIPPED
[INFO] Apache CXF Runtime Web Management ................. SKIPPED
[INFO] Apache CXF JCA Connection ......................... SKIPPED
[INFO] Apache CXF Integration ............................ SKIPPED
[INFO] Apache CXF Java2WS Maven2 Plugin .................. SKIPPED
[INFO] Apache CXF WADL2Java Code Generation Maven2 Plugin  SKIPPED
[INFO] Apache CXF CORBA Tools Maven2 Plugins ............. SKIPPED
[INFO] Apache CXF Archetype - Simple JAX-WS Java First ... SKIPPED
[INFO] cxf-jaxrs-service-archetype ....................... SKIPPED
[INFO] Apache CXF Maven Archetypes ....................... SKIPPED
[INFO] Apache CXF Maven Plugins .......................... SKIPPED
[INFO] Apache CXF STS Core ............................... SKIPPED
[INFO] Apache CXF STS war deployment ..................... SKIPPED
[INFO] Apache CXF STS basic systests ..................... SKIPPED
[INFO] Apache CXF STS advanced systests .................. SKIPPED
[INFO] Apache CXF Runtime ................................ SKIPPED
[INFO] Apache CXF STS service ............................ SKIPPED
[INFO] Apache CXF STS systests ........................... SKIPPED
[INFO] Apache CXF WSN API ................................ SKIPPED
[INFO] Apache CXF WSN Core ............................... SKIPPED
[INFO] Apache CXF WSN OSGi ............................... SKIPPED
[INFO] Apache CXF WSN service ............................ SKIPPED
[INFO] Apache CXF Karaf Parent ........................... SKIPPED
[INFO] Apache CXF Karaf Features ......................... SKIPPED
[INFO] Apache CXF Karaf Commands ......................... SKIPPED
[INFO] Apache CXF Bundle Parent .......................... SKIPPED
[INFO] Apache CXF Bundle Jar ............................. SKIPPED
[INFO] Apache CXF Minimal Bundle Jar ..................... SKIPPED
[INFO] Apache CXF JAX-RS Bundle Jar ...................... SKIPPED
[INFO] Apache CXF Container Integration System Tests ..... SKIPPED
[INFO] Apache CXF Container Integration Test Webapp ...... SKIPPED
[INFO] Apache CXF Uncategorized System Tests ............. SKIPPED
[INFO] Apache CXF Transport System Tests ................. SKIPPED
[INFO] Apache CXF Transport System Tests JMS ............. SKIPPED
[INFO] Apache CXF JAX-WS System Tests .................... SKIPPED
[INFO] Apache CXF Databinding System Tests ............... SKIPPED
[INFO] Apache CXF JAX-RS System Tests .................... SKIPPED
[INFO] Apache CXF WS-* Specifications System Tests ....... SKIPPED
[INFO] Apache CXF WS-Security System Tests ............... SKIPPED
[INFO] Apache CXF JAX-RS System Advanced Security Tests .. SKIPPED
[INFO] Test for writing wsdl to repo ..................... SKIPPED
[INFO] Test for generating code from wsdl in repo ........ SKIPPED
[INFO] Apache CXF System Tests ........................... SKIPPED
[INFO] Apache CXF System Tests for Maven Plugins ......... SKIPPED
[INFO] ------------------------------------------------------------------------
[INFO] BUILD FAILURE
[INFO] ------------------------------------------------------------------------
[INFO] Total time: 1:06.211s
[INFO] Finished at: Thu Dec 08 22:04:57 GMT 2011
[INFO] Final Memory: 46M/170M
[INFO] ------------------------------------------------------------------------
mavenExecutionResult exceptions not empty
message : Failed to execute goal org.apache.maven.plugins:maven-clean-plugin:2.4.1:clean (default-clean)
on project cxf-common-utilities: Failed to clean project: Failed to delete F:\hudson\hudson-slave\workspace\CXF-trunk-windows\trunk
with spaces\common\common\target\cxf-common-utilities-2.5.1-SNAPSHOT.jar
cause : Failed to clean project: Failed to delete F:\hudson\hudson-slave\workspace\CXF-trunk-windows\trunk
with spaces\common\common\target\cxf-common-utilities-2.5.1-SNAPSHOT.jar
Stack trace : 
org.apache.maven.lifecycle.LifecycleExecutionException: Failed to execute goal org.apache.maven.plugins:maven-clean-plugin:2.4.1:clean
(default-clean) on project cxf-common-utilities: Failed to clean project: Failed to delete
F:\hudson\hudson-slave\workspace\CXF-trunk-windows\trunk with spaces\common\common\target\cxf-common-utilities-2.5.1-SNAPSHOT.jar
	at org.apache.maven.lifecycle.internal.MojoExecutor.execute(MojoExecutor.java:217)
	at org.apache.maven.lifecycle.internal.MojoExecutor.execute(MojoExecutor.java:153)
	at org.apache.maven.lifecycle.internal.MojoExecutor.execute(MojoExecutor.java:145)
	at org.apache.maven.lifecycle.internal.LifecycleModuleBuilder.buildProject(LifecycleModuleBuilder.java:84)
	at org.apache.maven.lifecycle.internal.LifecycleModuleBuilder.buildProject(LifecycleModuleBuilder.java:59)
	at org.apache.maven.lifecycle.internal.LifecycleStarter.singleThreadedBuild(LifecycleStarter.java:183)
	at org.apache.maven.lifecycle.internal.LifecycleStarter.execute(LifecycleStarter.java:161)
	at org.apache.maven.DefaultMaven.doExecute(DefaultMaven.java:319)
	at org.apache.maven.DefaultMaven.execute(DefaultMaven.java:156)
	at org.jvnet.hudson.maven3.launcher.Maven3Launcher.main(Maven3Launcher.java:79)
	at sun.reflect.NativeMethodAccessorImpl.invoke0(Native Method)
	at sun.reflect.NativeMethodAccessorImpl.invoke(NativeMethodAccessorImpl.java:39)
	at sun.reflect.DelegatingMethodAccessorImpl.invoke(DelegatingMethodAccessorImpl.java:25)
	at java.lang.reflect.Method.invoke(Method.java:597)
	at org.codehaus.plexus.classworlds.launcher.Launcher.launchStandard(Launcher.java:329)
	at org.codehaus.plexus.classworlds.launcher.Launcher.launch(Launcher.java:239)
	at org.jvnet.hudson.maven3.agent.Maven3Main.launch(Maven3Main.java:158)
	at hudson.maven.Maven3Builder.call(Maven3Builder.java:122)
	at hudson.maven.Maven3Builder.call(Maven3Builder.java:74)
	at hudson.remoting.UserRequest.perform(UserRequest.java:118)
	at hudson.remoting.UserRequest.perform(UserRequest.java:48)
	at hudson.remoting.Request$2.run(Request.java:287)
	at java.util.concurrent.Executors$RunnableAdapter.call(Executors.java:441)
	at java.util.concurrent.FutureTask$Sync.innerRun(FutureTask.java:303)
	at java.util.concurrent.FutureTask.run(FutureTask.java:138)
	at java.util.concurrent.ThreadPoolExecutor$Worker.runTask(ThreadPoolExecutor.java:886)
	at java.util.concurrent.ThreadPoolExecutor$Worker.run(ThreadPoolExecutor.java:908)
	at java.lang.Thread.run(Thread.java:662)
Caused by: org.apache.maven.plugin.MojoExecutionException: Failed to clean project: Failed
to delete F:\hudson\hudson-slave\workspace\CXF-trunk-windows\trunk with spaces\common\common\target\cxf-common-utilities-2.5.1-SNAPSHOT.jar
	at org.apache.maven.plugin.clean.CleanMojo.execute(CleanMojo.java:188)
	at org.apache.maven.plugin.DefaultBuildPluginManager.executeMojo(DefaultBuildPluginManager.java:107)
	at org.apache.maven.lifecycle.internal.MojoExecutor.execute(MojoExecutor.java:209)
	... 27 more
Caused by: java.io.IOException: Failed to delete F:\hudson\hudson-slave\workspace\CXF-trunk-windows\trunk
with spaces\common\common\target\cxf-common-utilities-2.5.1-SNAPSHOT.jar
	at org.apache.maven.plugin.clean.Cleaner.delete(Cleaner.java:227)
	at org.apache.maven.plugin.clean.Cleaner.delete(Cleaner.java:186)
	at org.apache.maven.plugin.clean.Cleaner.delete(Cleaner.java:154)
	at org.apache.maven.plugin.clean.Cleaner.delete(Cleaner.java:115)
	at org.apache.maven.plugin.clean.CleanMojo.execute(CleanMojo.java:168)
	... 29 more
Sending e-mails to: notifications@cxf.apache.org
channel stopped


Mime
View raw message