cxf-notifications mailing list archives

Site index · List index
Message view « Date » · « Thread »
Top « Date » · « Thread »
From Apache Jenkins Server <jenk...@builds.apache.org>
Subject Build failed in Jenkins: CXF-trunk-deploy #708
Date Tue, 15 Nov 2011 06:22:00 GMT
See <https://builds.apache.org/job/CXF-trunk-deploy/708/changes>

Changes:

[bimargulies] Put the archetype back into the build.

[bimargulies] Fix snapshot deps on archetype stuff.

[dkulp] Remove new archtype from build for right now.  Has a couple snapshot
deps that I cannot resolve.

[bimargulies] CXF-3912: add an archetype for JAX-RS.

[bimargulies] CXF-3912 Archetype for JAX-RS

[sergeyb] [CXF-3908] Checking for exception mappers before wrapping IOExceptions

[sergeyb] [CXF-3903] Support for primitive multipart/form-data parameters

[sergeyb] Fixing a failing test

[coheigea] Added a system test for a SAML Token as a SignedEncryptedSupportingToken

[sergeyb] [CXF-3900] Checking Sets when reading the beans

[gmazza] Removed unused cxf-servlet.xml files (CXF-3831)

------------------------------------------
[...truncated 7069 lines...]
[WARNING] <https://builds.apache.org/job/CXF-trunk-deploy/ws/trunk/maven-plugins/corba/src/main/java/org/apache/cxf/maven_plugin/corba/maven/plugins/WSDLToIDLPlugin.java>:47:
warning - @threadSafe is an unknown tag.
[INFO] Building jar: <https://builds.apache.org/job/CXF-trunk-deploy/ws/trunk/maven-plugins/corba/target/cxf-corbatools-maven-plugin-2.5.1-SNAPSHOT-javadoc.jar>
[INFO] [install:install {execution: default-install}]
[INFO] Installing <https://builds.apache.org/job/CXF-trunk-deploy/ws/trunk/maven-plugins/corba/target/cxf-corbatools-maven-plugin-2.5.1-SNAPSHOT.jar>
to <https://builds.apache.org/job/CXF-trunk-deploy/ws/.repository/org/apache/cxf/cxf-corbatools-maven-plugin/2.5.1-SNAPSHOT/cxf-corbatools-maven-plugin-2.5.1-SNAPSHOT.jar>
[INFO] Installing <https://builds.apache.org/job/CXF-trunk-deploy/ws/trunk/maven-plugins/corba/target/cxf-corbatools-maven-plugin-2.5.1-SNAPSHOT-sources.jar>
to <https://builds.apache.org/job/CXF-trunk-deploy/ws/.repository/org/apache/cxf/cxf-corbatools-maven-plugin/2.5.1-SNAPSHOT/cxf-corbatools-maven-plugin-2.5.1-SNAPSHOT-sources.jar>
[INFO] Installing <https://builds.apache.org/job/CXF-trunk-deploy/ws/trunk/maven-plugins/corba/target/cxf-corbatools-maven-plugin-2.5.1-SNAPSHOT-javadoc.jar>
to <https://builds.apache.org/job/CXF-trunk-deploy/ws/.repository/org/apache/cxf/cxf-corbatools-maven-plugin/2.5.1-SNAPSHOT/cxf-corbatools-maven-plugin-2.5.1-SNAPSHOT-javadoc.jar>
[INFO] [deploy:deploy {execution: default-deploy}]
[INFO] Retrieving previous build number from apache.snapshots.https
Uploading: https://repository.apache.org/content/repositories/snapshots/org/apache/cxf/cxf-corbatools-maven-plugin/2.5.1-SNAPSHOT/cxf-corbatools-maven-plugin-2.5.1-20111115.060200-11.jar
17K uploaded  (cxf-corbatools-maven-plugin-2.5.1-20111115.060200-11.jar)
[INFO] Retrieving previous metadata from apache.snapshots.https
[INFO] Uploading repository metadata for: 'snapshot org.apache.cxf:cxf-corbatools-maven-plugin:2.5.1-SNAPSHOT'
[INFO] Retrieving previous metadata from apache.snapshots.https
[INFO] Uploading repository metadata for: 'artifact org.apache.cxf:cxf-corbatools-maven-plugin'
[INFO] Retrieving previous metadata from apache.snapshots.https
[INFO] Uploading repository metadata for: 'org.apache.cxf'
[INFO] Uploading project information for cxf-corbatools-maven-plugin 2.5.1-20111115.060200-11
[INFO] Retrieving previous build number from apache.snapshots.https
Uploading: https://repository.apache.org/content/repositories/snapshots/org/apache/cxf/cxf-corbatools-maven-plugin/2.5.1-SNAPSHOT/cxf-corbatools-maven-plugin-2.5.1-20111115.060200-11-sources.jar
12K uploaded  (cxf-corbatools-maven-plugin-2.5.1-20111115.060200-11-sources.jar)
[INFO] Retrieving previous build number from apache.snapshots.https
Uploading: https://repository.apache.org/content/repositories/snapshots/org/apache/cxf/cxf-corbatools-maven-plugin/2.5.1-SNAPSHOT/cxf-corbatools-maven-plugin-2.5.1-20111115.060200-11-javadoc.jar
40K uploaded  (cxf-corbatools-maven-plugin-2.5.1-20111115.060200-11-javadoc.jar)
[JENKINS] Archiving <https://builds.apache.org/job/CXF-trunk-deploy/ws/trunk/maven-plugins/corba/target/cxf-corbatools-maven-plugin-2.5.1-SNAPSHOT.jar>
to /home/hudson/hudson/jobs/CXF-trunk-deploy/modules/org.apache.cxf$cxf-corbatools-maven-plugin/builds/2011-11-15_06-01-15/archive/org.apache.cxf/cxf-corbatools-maven-plugin/2.5.1-20111115.060200-11/cxf-corbatools-maven-plugin-2.5.1-20111115.060200-11.jar
[JENKINS] Archiving <https://builds.apache.org/job/CXF-trunk-deploy/ws/trunk/maven-plugins/corba/target/cxf-corbatools-maven-plugin-2.5.1-SNAPSHOT-sources.jar>
to /home/hudson/hudson/jobs/CXF-trunk-deploy/modules/org.apache.cxf$cxf-corbatools-maven-plugin/builds/2011-11-15_06-01-15/archive/org.apache.cxf/cxf-corbatools-maven-plugin/2.5.1-20111115.060200-11/cxf-corbatools-maven-plugin-2.5.1-20111115.060200-11-sources.jar
[JENKINS] Archiving <https://builds.apache.org/job/CXF-trunk-deploy/ws/trunk/maven-plugins/corba/target/cxf-corbatools-maven-plugin-2.5.1-SNAPSHOT-javadoc.jar>
to /home/hudson/hudson/jobs/CXF-trunk-deploy/modules/org.apache.cxf$cxf-corbatools-maven-plugin/builds/2011-11-15_06-01-15/archive/org.apache.cxf/cxf-corbatools-maven-plugin/2.5.1-20111115.060200-11/cxf-corbatools-maven-plugin-2.5.1-20111115.060200-11-javadoc.jar
[INFO] ------------------------------------------------------------------------
[INFO] Building Apache CXF Archetype - Simple JAX-WS Java First
[INFO]    task-segment: [clean, deploy]
[INFO] ------------------------------------------------------------------------
[INFO] [clean:clean {execution: default-clean}]
[INFO] Deleting <https://builds.apache.org/job/CXF-trunk-deploy/ws/trunk/maven-plugins/archetypes/cxf-jaxws-javafirst/target>
[INFO] [cxf-xml2fastinfoset:xml2fastinfoset {execution: xml2fastinfoset}]
[INFO] [remote-resources:process {execution: default}]
[debug] execute contextualize
[INFO] [resources:resources {execution: default-resources}]
[INFO] Using 'UTF-8' encoding to copy filtered resources.
[INFO] Copying 6 resources
[INFO] Copying 3 resources
[INFO] [compiler:compile {execution: default-compile}]
[INFO] No sources to compile
[debug] execute contextualize
[INFO] [resources:testResources {execution: default-testResources}]
[INFO] Using 'UTF-8' encoding to copy filtered resources.
[INFO] skip non existing resourceDirectory <https://builds.apache.org/job/CXF-trunk-deploy/ws/trunk/maven-plugins/archetypes/cxf-jaxws-javafirst/src/test/java>
[INFO] skip non existing resourceDirectory <https://builds.apache.org/job/CXF-trunk-deploy/ws/trunk/maven-plugins/archetypes/cxf-jaxws-javafirst/src/test/resources>
[INFO] skip non existing resourceDirectory <https://builds.apache.org/job/CXF-trunk-deploy/ws/trunk/maven-plugins/archetypes/cxf-jaxws-javafirst/target/generated/src/test/resources>
[INFO] Copying 3 resources
[INFO] [compiler:testCompile {execution: default-testCompile}]
[INFO] Not compiling test sources
[INFO] [surefire:test {execution: default-test}]
[INFO] Tests are skipped.
[INFO] [jar:jar {execution: default-jar}]
[INFO] Building jar: <https://builds.apache.org/job/CXF-trunk-deploy/ws/trunk/maven-plugins/archetypes/cxf-jaxws-javafirst/target/cxf-jaxws-javafirst-2.5.1-SNAPSHOT.jar>
[INFO] Preparing source:jar
[WARNING] Removing: jar from forked lifecycle, to prevent recursive invocation.
[JENKINS] Archiving <https://builds.apache.org/job/CXF-trunk-deploy/ws/trunk/maven-plugins/archetypes/cxf-jaxws-javafirst/pom.xml>
to /home/hudson/hudson/jobs/CXF-trunk-deploy/modules/org.apache.cxf.archetype$cxf-jaxws-javafirst/builds/2011-11-15_06-01-15/archive/org.apache.cxf.archetype/cxf-jaxws-javafirst/2.5.1-SNAPSHOT/cxf-jaxws-javafirst-2.5.1-SNAPSHOT.pom
[JENKINS] Archiving <https://builds.apache.org/job/CXF-trunk-deploy/ws/trunk/maven-plugins/archetypes/cxf-jaxws-javafirst/target/cxf-jaxws-javafirst-2.5.1-SNAPSHOT.jar>
to /home/hudson/hudson/jobs/CXF-trunk-deploy/modules/org.apache.cxf.archetype$cxf-jaxws-javafirst/builds/2011-11-15_06-01-15/archive/org.apache.cxf.archetype/cxf-jaxws-javafirst/2.5.1-SNAPSHOT/cxf-jaxws-javafirst-2.5.1-SNAPSHOT.jar
[INFO] [cxf-xml2fastinfoset:xml2fastinfoset {execution: xml2fastinfoset}]
[INFO] [source:jar {execution: attach-sources}]
[INFO] META-INF already added, skipping
[INFO] META-INF already added, skipping
[INFO] META-INF/LICENSE already added, skipping
[INFO] META-INF/NOTICE already added, skipping
[INFO] META-INF/DEPENDENCIES already added, skipping
[INFO] Building jar: <https://builds.apache.org/job/CXF-trunk-deploy/ws/trunk/maven-plugins/archetypes/cxf-jaxws-javafirst/target/cxf-jaxws-javafirst-2.5.1-SNAPSHOT-sources.jar>
[INFO] META-INF already added, skipping
[INFO] META-INF already added, skipping
[INFO] META-INF/LICENSE already added, skipping
[INFO] META-INF/NOTICE already added, skipping
[INFO] META-INF/DEPENDENCIES already added, skipping
[INFO] [javadoc:jar {execution: attach-javadocs}]
[INFO] [install:install {execution: default-install}]
[INFO] Installing <https://builds.apache.org/job/CXF-trunk-deploy/ws/trunk/maven-plugins/archetypes/cxf-jaxws-javafirst/target/cxf-jaxws-javafirst-2.5.1-SNAPSHOT.jar>
to <https://builds.apache.org/job/CXF-trunk-deploy/ws/.repository/org/apache/cxf/archetype/cxf-jaxws-javafirst/2.5.1-SNAPSHOT/cxf-jaxws-javafirst-2.5.1-SNAPSHOT.jar>
[INFO] Installing <https://builds.apache.org/job/CXF-trunk-deploy/ws/trunk/maven-plugins/archetypes/cxf-jaxws-javafirst/target/cxf-jaxws-javafirst-2.5.1-SNAPSHOT-sources.jar>
to <https://builds.apache.org/job/CXF-trunk-deploy/ws/.repository/org/apache/cxf/archetype/cxf-jaxws-javafirst/2.5.1-SNAPSHOT/cxf-jaxws-javafirst-2.5.1-SNAPSHOT-sources.jar>
[INFO] [deploy:deploy {execution: default-deploy}]
[INFO] Retrieving previous build number from apache.snapshots.https
Uploading: https://repository.apache.org/content/repositories/snapshots/org/apache/cxf/archetype/cxf-jaxws-javafirst/2.5.1-SNAPSHOT/cxf-jaxws-javafirst-2.5.1-20111115.060200-11.jar
12K uploaded  (cxf-jaxws-javafirst-2.5.1-20111115.060200-11.jar)
[INFO] Retrieving previous metadata from apache.snapshots.https
[INFO] Uploading repository metadata for: 'artifact org.apache.cxf.archetype:cxf-jaxws-javafirst'
[INFO] Uploading project information for cxf-jaxws-javafirst 2.5.1-20111115.060200-11
[INFO] Retrieving previous metadata from apache.snapshots.https
[INFO] Uploading repository metadata for: 'snapshot org.apache.cxf.archetype:cxf-jaxws-javafirst:2.5.1-SNAPSHOT'
[INFO] Retrieving previous build number from apache.snapshots.https
Uploading: https://repository.apache.org/content/repositories/snapshots/org/apache/cxf/archetype/cxf-jaxws-javafirst/2.5.1-SNAPSHOT/cxf-jaxws-javafirst-2.5.1-20111115.060200-11-sources.jar
10K uploaded  (cxf-jaxws-javafirst-2.5.1-20111115.060200-11-sources.jar)
[JENKINS] Archiving <https://builds.apache.org/job/CXF-trunk-deploy/ws/trunk/maven-plugins/archetypes/cxf-jaxws-javafirst/target/cxf-jaxws-javafirst-2.5.1-SNAPSHOT.jar>
to /home/hudson/hudson/jobs/CXF-trunk-deploy/modules/org.apache.cxf.archetype$cxf-jaxws-javafirst/builds/2011-11-15_06-01-15/archive/org.apache.cxf.archetype/cxf-jaxws-javafirst/2.5.1-20111115.060200-11/cxf-jaxws-javafirst-2.5.1-20111115.060200-11.jar
[JENKINS] Archiving <https://builds.apache.org/job/CXF-trunk-deploy/ws/trunk/maven-plugins/archetypes/cxf-jaxws-javafirst/target/cxf-jaxws-javafirst-2.5.1-SNAPSHOT-sources.jar>
to /home/hudson/hudson/jobs/CXF-trunk-deploy/modules/org.apache.cxf.archetype$cxf-jaxws-javafirst/builds/2011-11-15_06-01-15/archive/org.apache.cxf.archetype/cxf-jaxws-javafirst/2.5.1-20111115.060200-11/cxf-jaxws-javafirst-2.5.1-20111115.060200-11-sources.jar
[INFO] ------------------------------------------------------------------------
[INFO] Building cxf-jaxrs-simple-sample-archetype
[INFO]    task-segment: [clean, deploy]
[INFO] ------------------------------------------------------------------------
[INFO] [clean:clean {execution: default-clean}]
Downloading: http://repo1.maven.org/maven2/org/apache/maven/plugins/maven-archetype-plugin/2.1/maven-archetype-plugin-2.1.pom

Downloading: http://repo1.maven.org/maven2/org/apache/maven/plugins/maven-archetype-plugin/2.1/maven-archetype-plugin-2.1.jar

[INFO] [resources:resources {execution: default-resources}]
[WARNING] Using platform encoding (ANSI_X3.4-1968 actually) to copy filtered resources, i.e.
build is platform dependent!
[INFO] Copying 8 resources
[INFO] [resources:testResources {execution: default-testResources}]
[WARNING] Using platform encoding (ANSI_X3.4-1968 actually) to copy filtered resources, i.e.
build is platform dependent!
[INFO] Copying 2 resources
Downloading: http://repo1.maven.org/maven2/org/apache/maven/archetype/archetype-catalog/2.1/archetype-catalog-2.1.pom

Downloading: http://repo1.maven.org/maven2/org/apache/maven/archetype/archetype-models/2.1/archetype-models-2.1.pom

Downloading: http://repo1.maven.org/maven2/org/apache/maven/archetype/archetype-descriptor/2.1/archetype-descriptor-2.1.pom

Downloading: http://repo1.maven.org/maven2/org/apache/maven/archetype/archetype-registry/2.1/archetype-registry-2.1.pom

Downloading: http://repo1.maven.org/maven2/org/apache/maven/archetype/archetype-common/2.1/archetype-common-2.1.pom

Downloading: http://repo1.maven.org/maven2/net/sourceforge/jchardet/jchardet/1.0/jchardet-1.0.pom

Downloading: http://repo1.maven.org/maven2/org/apache/maven/shared/maven-invoker/2.0.10/maven-invoker-2.0.10.pom

Downloading: http://repo1.maven.org/maven2/org/apache/maven/wagon/wagon-file/1.0/wagon-file-1.0.pom

Downloading: http://repo1.maven.org/maven2/org/apache/maven/wagon/wagon-providers/1.0/wagon-providers-1.0.pom

Downloading: http://repo1.maven.org/maven2/org/apache/maven/wagon/wagon/1.0/wagon-1.0.pom

Downloading: http://repo1.maven.org/maven2/org/apache/maven/wagon/wagon-provider-api/1.0/wagon-provider-api-1.0.pom

Downloading: http://repo1.maven.org/maven2/org/codehaus/plexus/plexus-interactivity-api/1.0-alpha-5/plexus-interactivity-api-1.0-alpha-5.pom

Downloading: http://repo1.maven.org/maven2/org/codehaus/plexus/plexus-interactivity/1.0-alpha-5/plexus-interactivity-1.0-alpha-5.pom

Downloading: http://repo1.maven.org/maven2/net/sourceforge/jchardet/jchardet/1.0/jchardet-1.0.jar
Downloading: http://repo1.maven.org/maven2/org/apache/maven/archetype/archetype-catalog/2.1/archetype-catalog-2.1.jar
Downloading: http://repo1.maven.org/maven2/org/apache/maven/shared/maven-invoker/2.0.10/maven-invoker-2.0.10.jar



Downloading: http://repo1.maven.org/maven2/org/apache/maven/archetype/archetype-descriptor/2.1/archetype-descriptor-2.1.jar

Downloading: http://repo1.maven.org/maven2/org/apache/maven/archetype/archetype-registry/2.1/archetype-registry-2.1.jar

Downloading: http://repo1.maven.org/maven2/org/apache/maven/archetype/archetype-common/2.1/archetype-common-2.1.jar

[INFO] [archetype:jar {execution: default-jar}]
[INFO] Building archetype jar: <https://builds.apache.org/job/CXF-trunk-deploy/ws/trunk/maven-plugins/archetypes/cxf-jaxrs-service/target/cxf-jaxrs-simple-sample-archetype-1.0-SNAPSHOT>
[INFO] [archetype:integration-test {execution: default-integration-test}]
[INFO] Processing Archetype IT project: basic
[INFO] ----------------------------------------------------------------------------
[INFO] Using following parameters for creating project from Archetype: cxf-jaxrs-simple-sample-archetype:1.0-SNAPSHOT
[INFO] ----------------------------------------------------------------------------
[INFO] Parameter: groupId, Value: archetype.it
[INFO] Parameter: artifactId, Value: basic
[INFO] Parameter: version, Value: 0.1-SNAPSHOT
[INFO] Parameter: package, Value: it.pkg
[INFO] Parameter: packageInPathFormat, Value: it/pkg
[INFO] Parameter: version, Value: 0.1-SNAPSHOT
[INFO] Parameter: package, Value: it.pkg
[INFO] Parameter: cxf-version, Value: 2.5.0
[INFO] Parameter: groupId, Value: archetype.it
[INFO] Parameter: artifactId, Value: basic
[INFO] project created from Archetype in dir: <https://builds.apache.org/job/CXF-trunk-deploy/ws/trunk/maven-plugins/archetypes/cxf-jaxrs-service/target/test-classes/projects/basic/project/basic>
[INFO] No post-archetype-generation goals to invoke.
[INFO] [install:install {execution: default-install}]
[INFO] Installing <https://builds.apache.org/job/CXF-trunk-deploy/ws/trunk/maven-plugins/archetypes/cxf-jaxrs-service/target/cxf-jaxrs-simple-sample-archetype-1.0-SNAPSHOT.jar>
to <https://builds.apache.org/job/CXF-trunk-deploy/ws/.repository/org/apache/cxf/cxf-jaxrs-simple-sample-archetype/1.0-SNAPSHOT/cxf-jaxrs-simple-sample-archetype-1.0-SNAPSHOT.jar>
[INFO] [archetype:update-local-catalog {execution: default-update-local-catalog}]
[JENKINS] Archiving <https://builds.apache.org/job/CXF-trunk-deploy/ws/trunk/maven-plugins/archetypes/cxf-jaxrs-service/pom.xml>
to /home/hudson/hudson/jobs/CXF-trunk-deploy/modules/org.apache.cxf$cxf-jaxrs-simple-sample-archetype/builds/2011-11-15_06-01-15/archive/org.apache.cxf/cxf-jaxrs-simple-sample-archetype/1.0-SNAPSHOT/cxf-jaxrs-simple-sample-archetype-1.0-SNAPSHOT.pom
[JENKINS] Archiving <https://builds.apache.org/job/CXF-trunk-deploy/ws/trunk/maven-plugins/archetypes/cxf-jaxrs-service/target/cxf-jaxrs-simple-sample-archetype-1.0-SNAPSHOT.jar>
to /home/hudson/hudson/jobs/CXF-trunk-deploy/modules/org.apache.cxf$cxf-jaxrs-simple-sample-archetype/builds/2011-11-15_06-01-15/archive/org.apache.cxf/cxf-jaxrs-simple-sample-archetype/1.0-SNAPSHOT/cxf-jaxrs-simple-sample-archetype-1.0-SNAPSHOT.jar
[INFO] ------------------------------------------------------------------------
[ERROR] BUILD ERROR
[INFO] ------------------------------------------------------------------------
[INFO] Failed to configure plugin parameters for: org.apache.maven.plugins:maven-deploy-plugin:2.4

check that the following section of the pom.xml is present and correct:

<distributionManagement>
  <!-- use the following if you're not using a snapshot version. -->
  <repository>
    <id>repo</id>
    <name>Repository Name</name>
    <url>scp://host/path/to/repo</url>
  </repository>
  <!-- use the following if you ARE using a snapshot version. -->
  <snapshotRepository>
    <id>repo</id>
    <name>Repository Name</name>
    <url>scp://host/path/to/repo</url>
  </snapshotRepository>
</distributionManagement>

Cause: Class 'org.apache.maven.artifact.repository.ArtifactRepository' cannot be instantiated
[INFO] ------------------------------------------------------------------------
[INFO] Trace
org.apache.maven.lifecycle.LifecycleExecutionException: Error configuring: org.apache.maven.plugins:maven-deploy-plugin.
Reason: Unable to parse the created DOM for plugin configuration
	at org.apache.maven.lifecycle.DefaultLifecycleExecutor.executeGoals(DefaultLifecycleExecutor.java:723)
	at org.apache.maven.lifecycle.DefaultLifecycleExecutor.executeGoalWithLifecycle(DefaultLifecycleExecutor.java:556)
	at org.apache.maven.lifecycle.DefaultLifecycleExecutor.executeGoal(DefaultLifecycleExecutor.java:535)
	at org.apache.maven.lifecycle.DefaultLifecycleExecutor.executeGoalAndHandleFailures(DefaultLifecycleExecutor.java:387)
	at org.apache.maven.lifecycle.DefaultLifecycleExecutor.executeTaskSegments(DefaultLifecycleExecutor.java:348)
	at org.apache.maven.lifecycle.DefaultLifecycleExecutor.execute(DefaultLifecycleExecutor.java:180)
	at org.apache.maven.lifecycle.LifecycleExecutorInterceptor.execute(LifecycleExecutorInterceptor.java:65)
	at org.apache.maven.DefaultMaven.doExecute(DefaultMaven.java:328)
	at org.apache.maven.DefaultMaven.execute(DefaultMaven.java:138)
	at org.apache.maven.cli.MavenCli.main(MavenCli.java:362)
	at sun.reflect.NativeMethodAccessorImpl.invoke0(Native Method)
	at sun.reflect.NativeMethodAccessorImpl.invoke(NativeMethodAccessorImpl.java:39)
	at sun.reflect.DelegatingMethodAccessorImpl.invoke(DelegatingMethodAccessorImpl.java:25)
	at java.lang.reflect.Method.invoke(Method.java:592)
	at org.codehaus.classworlds.Launcher.launchEnhanced(Launcher.java:315)
	at org.codehaus.classworlds.Launcher.launch(Launcher.java:255)
	at hudson.maven.agent.Main.launch(Main.java:185)
	at hudson.maven.MavenBuilder.call(MavenBuilder.java:160)
	at hudson.maven.MavenModuleSetBuild$Builder.call(MavenModuleSetBuild.java:1059)
	at hudson.maven.MavenModuleSetBuild$Builder.call(MavenModuleSetBuild.java:990)
	at hudson.remoting.UserRequest.perform(UserRequest.java:118)
	at hudson.remoting.UserRequest.perform(UserRequest.java:48)
	at hudson.remoting.Request$2.run(Request.java:287)
	at java.util.concurrent.Executors$RunnableAdapter.call(Executors.java:417)
	at java.util.concurrent.FutureTask$Sync.innerRun(FutureTask.java:269)
	at java.util.concurrent.FutureTask.run(FutureTask.java:123)
	at java.util.concurrent.ThreadPoolExecutor$Worker.runTask(ThreadPoolExecutor.java:651)
	at java.util.concurrent.ThreadPoolExecutor$Worker.run(ThreadPoolExecutor.java:676)
	at java.lang.Thread.run(Thread.java:595)
Caused by: org.apache.maven.plugin.PluginConfigurationException: Error configuring: org.apache.maven.plugins:maven-deploy-plugin.
Reason: Unable to parse the created DOM for plugin configuration
	at org.apache.maven.plugin.DefaultPluginManager.populatePluginFields(DefaultPluginManager.java:1363)
	at org.apache.maven.plugin.DefaultPluginManager.getConfiguredMojo(DefaultPluginManager.java:724)
	at org.apache.maven.plugin.DefaultPluginManager.executeMojo(DefaultPluginManager.java:468)
	at hudson.maven.agent.PluginManagerInterceptor.executeMojo(PluginManagerInterceptor.java:182)
	at org.apache.maven.lifecycle.DefaultLifecycleExecutor.executeGoals(DefaultLifecycleExecutor.java:694)
	... 28 more
Caused by: org.codehaus.plexus.component.configurator.ComponentConfigurationException: Class
'org.apache.maven.artifact.repository.ArtifactRepository' cannot be instantiated
	at org.codehaus.plexus.component.configurator.converters.AbstractConfigurationConverter.instantiateObject(AbstractConfigurationConverter.java:121)
	at org.codehaus.plexus.component.configurator.converters.composite.ObjectWithFieldsConverter.fromConfiguration(ObjectWithFieldsConverter.java:88)
	at org.codehaus.plexus.component.configurator.converters.ComponentValueSetter.configure(ComponentValueSetter.java:247)
	at org.codehaus.plexus.component.configurator.converters.composite.ObjectWithFieldsConverter.processConfiguration(ObjectWithFieldsConverter.java:137)
	at org.codehaus.plexus.component.configurator.BasicComponentConfigurator.configureComponent(BasicComponentConfigurator.java:56)
	at hudson.maven.agent.ComponentConfiguratorFilter.configureComponent(ComponentConfiguratorFilter.java:49)
	at hudson.maven.agent.PluginManagerInterceptor$MojoIntercepter.configureComponent(PluginManagerInterceptor.java:146)
	at org.apache.maven.plugin.DefaultPluginManager.populatePluginFields(DefaultPluginManager.java:1357)
	... 32 more
Caused by: java.lang.InstantiationException: org.apache.maven.artifact.repository.ArtifactRepository
	at java.lang.Class.newInstance0(Class.java:335)
	at java.lang.Class.newInstance(Class.java:303)
	at org.codehaus.plexus.component.configurator.converters.AbstractConfigurationConverter.instantiateObject(AbstractConfigurationConverter.java:111)
	... 39 more
[INFO] ------------------------------------------------------------------------
[INFO] Total time: 20 minutes 16 seconds
[INFO] Finished at: Tue Nov 15 06:21:57 UTC 2011
[INFO] Final Memory: 262M/394M
[INFO] ------------------------------------------------------------------------
channel stopped


Mime
View raw message