cxf-notifications mailing list archives

Site index · List index
Message view « Date » · « Thread »
Top « Date » · « Thread »
From Apache Jenkins Server <jenk...@builds.apache.org>
Subject Build failed in Jenkins: CXF-trunk-deploy #684
Date Mon, 17 Oct 2011 06:35:41 GMT
See <https://builds.apache.org/job/CXF-trunk-deploy/684/changes>

Changes:

[sergeyb] Updating jsr311 api bundle version to 1.1.1

------------------------------------------
[...truncated 20648 lines...]
[INFO] ------------------------------------------------------------------------
[INFO] Building Apache CXF Karaf Features
[INFO]    task-segment: [clean, deploy]
[INFO] ------------------------------------------------------------------------
[INFO] [clean:clean {execution: default-clean}]
[INFO] [cxf-xml2fastinfoset:xml2fastinfoset {execution: xml2fastinfoset}]
[INFO] [remote-resources:process {execution: default}]
Downloading: http://repo1.maven.org/maven2/org/ops4j/pax/logging/pax-logging-api/1.6.0/pax-logging-api-1.6.0.pom

Downloading: http://repo1.maven.org/maven2/org/ops4j/pax/logging/1.6.0/logging-1.6.0.pom

Downloading: http://repo1.maven.org/maven2/org/ops4j/pax/master/3.1.3/master-3.1.3.pom

Downloading: http://repo1.maven.org/maven2/org/ops4j/master/1.0.8/master-1.0.8.pom

Downloading: http://repo1.maven.org/maven2/org/ops4j/pax/logging/pax-logging-service/1.6.0/pax-logging-service-1.6.0.pom

Downloading: http://repo1.maven.org/maven2/org/apache/felix/org.apache.felix.framework/2.0.5/org.apache.felix.framework-2.0.5.pom

Downloading: http://repo1.maven.org/maven2/org/apache/felix/felix-parent/1.2.0/felix-parent-1.2.0.pom

Downloading: http://repo1.maven.org/maven2/org/apache/felix/org.apache.felix.configadmin/1.2.4/org.apache.felix.configadmin-1.2.4.pom

Downloading: http://repository.ops4j.org/maven2/org/apache/felix/org.osgi.compendium/1.0.0/org.osgi.compendium-1.0.0.pom
[INFO] Unable to find resource 'org.apache.felix:org.osgi.compendium:pom:1.0.0' in repository
ops4j (http://repository.ops4j.org/maven2)
Downloading: http://www.aqute.biz/repo/org/apache/felix/org.osgi.compendium/1.0.0/org.osgi.compendium-1.0.0.pom
[INFO] Unable to find resource 'org.apache.felix:org.osgi.compendium:pom:1.0.0' in repository
aqute (http://www.aqute.biz/repo)
Downloading: http://repo1.maven.org/maven2/org/apache/felix/org.osgi.compendium/1.0.0/org.osgi.compendium-1.0.0.pom

Downloading: http://repository.ops4j.org/maven2/org/apache/felix/javax.servlet/1.0.0/javax.servlet-1.0.0.pom
[INFO] Unable to find resource 'org.apache.felix:javax.servlet:pom:1.0.0' in repository ops4j
(http://repository.ops4j.org/maven2)
Downloading: http://www.aqute.biz/repo/org/apache/felix/javax.servlet/1.0.0/javax.servlet-1.0.0.pom
[INFO] Unable to find resource 'org.apache.felix:javax.servlet:pom:1.0.0' in repository aqute
(http://www.aqute.biz/repo)
Downloading: http://repo1.maven.org/maven2/org/apache/felix/javax.servlet/1.0.0/javax.servlet-1.0.0.pom

Downloading: http://repository.ops4j.org/maven2/org/apache/felix/org.osgi.foundation/1.0.0/org.osgi.foundation-1.0.0.pom
[INFO] Unable to find resource 'org.apache.felix:org.osgi.foundation:pom:1.0.0' in repository
ops4j (http://repository.ops4j.org/maven2)
Downloading: http://www.aqute.biz/repo/org/apache/felix/org.osgi.foundation/1.0.0/org.osgi.foundation-1.0.0.pom
[INFO] Unable to find resource 'org.apache.felix:org.osgi.foundation:pom:1.0.0' in repository
aqute (http://www.aqute.biz/repo)
Downloading: http://repo1.maven.org/maven2/org/apache/felix/org.osgi.foundation/1.0.0/org.osgi.foundation-1.0.0.pom

Downloading: http://repository.ops4j.org/maven2/org/apache/felix/felix/1.0.1/felix-1.0.1.pom
[INFO] Unable to find resource 'org.apache.felix:felix:pom:1.0.1' in repository ops4j (http://repository.ops4j.org/maven2)
Downloading: http://www.aqute.biz/repo/org/apache/felix/felix/1.0.1/felix-1.0.1.pom
[INFO] Unable to find resource 'org.apache.felix:felix:pom:1.0.1' in repository aqute (http://www.aqute.biz/repo)
Downloading: http://repo1.maven.org/maven2/org/apache/felix/felix/1.0.1/felix-1.0.1.pom

Downloading: http://repo1.maven.org/maven2/org/apache/aries/blueprint/org.apache.aries.blueprint/0.3.1/org.apache.aries.blueprint-0.3.1.pom

[INFO] snapshot org.apache.karaf.shell:org.apache.karaf.shell.console:2.2.4-SNAPSHOT: checking
for updates from apache.snapshots
Downloading: http://repository.apache.org/snapshots/org/apache/karaf/shell/org.apache.karaf.shell.console/2.2.4-SNAPSHOT/org.apache.karaf.shell.console-2.2.4-SNAPSHOT.pom
[INFO] Unable to find resource 'org.apache.karaf.shell:org.apache.karaf.shell.console:pom:2.2.4-SNAPSHOT'
in repository apache.snapshots (http://repository.apache.org/snapshots/)
Downloading: http://repo1.maven.org/maven2/org/ops4j/pax/logging/pax-logging-api/1.6.0/pax-logging-api-1.6.0.jar
Downloading: http://repository.apache.org/snapshots/org/apache/karaf/shell/org.apache.karaf.shell.console/2.2.4-SNAPSHOT/org.apache.karaf.shell.console-2.2.4-SNAPSHOT.jar
Downloading: http://repo1.maven.org/maven2/org/apache/aries/blueprint/org.apache.aries.blueprint/0.3.1/org.apache.aries.blueprint-0.3.1.jar
Downloading: http://repo1.maven.org/maven2/org/apache/felix/org.apache.felix.framework/2.0.5/org.apache.felix.framework-2.0.5.jar
[INFO] Unable to find resource 'org.apache.karaf.shell:org.apache.karaf.shell.console:jar:2.2.4-SNAPSHOT'
in repository apache.snapshots (http://repository.apache.org/snapshots/)


Downloading: http://repo1.maven.org/maven2/org/ops4j/pax/logging/pax-logging-service/1.6.0/pax-logging-service-1.6.0.jar

Downloading: http://repo1.maven.org/maven2/org/apache/felix/org.apache.felix.configadmin/1.2.4/org.apache.felix.configadmin-1.2.4.jar


Downloading: http://repository.ops4j.org/maven2/org/apache/felix/org.osgi.compendium/1.0.0/org.osgi.compendium-1.0.0.jar
[INFO] Unable to find resource 'org.apache.felix:org.osgi.compendium:jar:1.0.0' in repository
ops4j (http://repository.ops4j.org/maven2)
Downloading: http://www.aqute.biz/repo/org/apache/felix/org.osgi.compendium/1.0.0/org.osgi.compendium-1.0.0.jar
[INFO] Unable to find resource 'org.apache.felix:org.osgi.compendium:jar:1.0.0' in repository
aqute (http://www.aqute.biz/repo)
Downloading: http://repo1.maven.org/maven2/org/apache/felix/org.osgi.compendium/1.0.0/org.osgi.compendium-1.0.0.jar

Downloading: http://repository.ops4j.org/maven2/org/apache/felix/javax.servlet/1.0.0/javax.servlet-1.0.0.jar
[INFO] Unable to find resource 'org.apache.felix:javax.servlet:jar:1.0.0' in repository ops4j
(http://repository.ops4j.org/maven2)
Downloading: http://www.aqute.biz/repo/org/apache/felix/javax.servlet/1.0.0/javax.servlet-1.0.0.jar
[INFO] Unable to find resource 'org.apache.felix:javax.servlet:jar:1.0.0' in repository aqute
(http://www.aqute.biz/repo)
Downloading: http://repo1.maven.org/maven2/org/apache/felix/javax.servlet/1.0.0/javax.servlet-1.0.0.jar

Downloading: http://repository.ops4j.org/maven2/org/apache/felix/org.osgi.foundation/1.0.0/org.osgi.foundation-1.0.0.jar
[INFO] Unable to find resource 'org.apache.felix:org.osgi.foundation:jar:1.0.0' in repository
ops4j (http://repository.ops4j.org/maven2)
Downloading: http://www.aqute.biz/repo/org/apache/felix/org.osgi.foundation/1.0.0/org.osgi.foundation-1.0.0.jar
[INFO] Unable to find resource 'org.apache.felix:org.osgi.foundation:jar:1.0.0' in repository
aqute (http://www.aqute.biz/repo)
Downloading: http://repo1.maven.org/maven2/org/apache/felix/org.osgi.foundation/1.0.0/org.osgi.foundation-1.0.0.jar

[JENKINS] Archiving <https://builds.apache.org/job/CXF-trunk-deploy/ws/trunk/osgi/karaf/features/pom.xml>
to /home/hudson/hudson/jobs/CXF-trunk-deploy/modules/org.apache.cxf.karaf$apache-cxf/builds/2011-10-17_06-01-42/archive/org.apache.cxf.karaf/apache-cxf/2.5.0-SNAPSHOT/apache-cxf-2.5.0-SNAPSHOT.pom
[INFO] ------------------------------------------------------------------------
[ERROR] BUILD ERROR
[INFO] ------------------------------------------------------------------------
[INFO] Failed to resolve artifact.

Missing:
----------
1) org.apache.karaf.shell:org.apache.karaf.shell.console:jar:2.2.4-SNAPSHOT

  Try downloading the file manually from the project website.

  Then, install it using the command: 
      mvn install:install-file -DgroupId=org.apache.karaf.shell -DartifactId=org.apache.karaf.shell.console
-Dversion=2.2.4-SNAPSHOT -Dpackaging=jar -Dfile=/path/to/file

  Alternatively, if you host your own repository you can deploy the file there: 
      mvn deploy:deploy-file -DgroupId=org.apache.karaf.shell -DartifactId=org.apache.karaf.shell.console
-Dversion=2.2.4-SNAPSHOT -Dpackaging=jar -Dfile=/path/to/file -Durl=[url] -DrepositoryId=[id]

  Path to dependency: 
  	1) org.apache.cxf.karaf:apache-cxf:pom:2.5.0-SNAPSHOT
  	2) org.apache.karaf.shell:org.apache.karaf.shell.console:jar:2.2.4-SNAPSHOT

----------
1 required artifact is missing.

for artifact: 
  org.apache.cxf.karaf:apache-cxf:pom:2.5.0-SNAPSHOT

from the specified remote repositories:
  central (http://repo1.maven.org/maven2),
  Nexus (http://repository.apache.org/snapshots)



[INFO] ------------------------------------------------------------------------
[INFO] Trace
org.apache.maven.lifecycle.LifecycleExecutionException: Failed to resolve dependencies for
one or more projects in the reactor. Reason: Missing:
----------
1) org.apache.karaf.shell:org.apache.karaf.shell.console:jar:2.2.4-SNAPSHOT

  Try downloading the file manually from the project website.

  Then, install it using the command: 
      mvn install:install-file -DgroupId=org.apache.karaf.shell -DartifactId=org.apache.karaf.shell.console
-Dversion=2.2.4-SNAPSHOT -Dpackaging=jar -Dfile=/path/to/file

  Alternatively, if you host your own repository you can deploy the file there: 
      mvn deploy:deploy-file -DgroupId=org.apache.karaf.shell -DartifactId=org.apache.karaf.shell.console
-Dversion=2.2.4-SNAPSHOT -Dpackaging=jar -Dfile=/path/to/file -Durl=[url] -DrepositoryId=[id]

  Path to dependency: 
  	1) org.apache.cxf.karaf:apache-cxf:pom:2.5.0-SNAPSHOT
  	2) org.apache.karaf.shell:org.apache.karaf.shell.console:jar:2.2.4-SNAPSHOT

----------
1 required artifact is missing.

for artifact: 
  org.apache.cxf.karaf:apache-cxf:pom:2.5.0-SNAPSHOT

from the specified remote repositories:
  central (http://repo1.maven.org/maven2),
  Nexus (http://repository.apache.org/snapshots)


	at org.apache.maven.lifecycle.DefaultLifecycleExecutor.executeGoals(DefaultLifecycleExecutor.java:719)
	at org.apache.maven.lifecycle.DefaultLifecycleExecutor.executeGoalWithLifecycle(DefaultLifecycleExecutor.java:556)
	at org.apache.maven.lifecycle.DefaultLifecycleExecutor.executeGoal(DefaultLifecycleExecutor.java:535)
	at org.apache.maven.lifecycle.DefaultLifecycleExecutor.executeGoalAndHandleFailures(DefaultLifecycleExecutor.java:387)
	at org.apache.maven.lifecycle.DefaultLifecycleExecutor.executeTaskSegments(DefaultLifecycleExecutor.java:348)
	at org.apache.maven.lifecycle.DefaultLifecycleExecutor.execute(DefaultLifecycleExecutor.java:180)
	at org.apache.maven.lifecycle.LifecycleExecutorInterceptor.execute(LifecycleExecutorInterceptor.java:65)
	at org.apache.maven.DefaultMaven.doExecute(DefaultMaven.java:328)
	at org.apache.maven.DefaultMaven.execute(DefaultMaven.java:138)
	at org.apache.maven.cli.MavenCli.main(MavenCli.java:362)
	at sun.reflect.NativeMethodAccessorImpl.invoke0(Native Method)
	at sun.reflect.NativeMethodAccessorImpl.invoke(NativeMethodAccessorImpl.java:39)
	at sun.reflect.DelegatingMethodAccessorImpl.invoke(DelegatingMethodAccessorImpl.java:25)
	at java.lang.reflect.Method.invoke(Method.java:592)
	at org.codehaus.classworlds.Launcher.launchEnhanced(Launcher.java:315)
	at org.codehaus.classworlds.Launcher.launch(Launcher.java:255)
	at hudson.maven.agent.Main.launch(Main.java:185)
	at hudson.maven.MavenBuilder.call(MavenBuilder.java:160)
	at hudson.maven.MavenModuleSetBuild$Builder.call(MavenModuleSetBuild.java:1059)
	at hudson.maven.MavenModuleSetBuild$Builder.call(MavenModuleSetBuild.java:990)
	at hudson.remoting.UserRequest.perform(UserRequest.java:118)
	at hudson.remoting.UserRequest.perform(UserRequest.java:48)
	at hudson.remoting.Request$2.run(Request.java:287)
	at java.util.concurrent.Executors$RunnableAdapter.call(Executors.java:417)
	at java.util.concurrent.FutureTask$Sync.innerRun(FutureTask.java:269)
	at java.util.concurrent.FutureTask.run(FutureTask.java:123)
	at java.util.concurrent.ThreadPoolExecutor$Worker.runTask(ThreadPoolExecutor.java:651)
	at java.util.concurrent.ThreadPoolExecutor$Worker.run(ThreadPoolExecutor.java:676)
	at java.lang.Thread.run(Thread.java:595)
Caused by: org.apache.maven.plugin.MojoExecutionException: Failed to resolve dependencies
for one or more projects in the reactor. Reason: Missing:
----------
1) org.apache.karaf.shell:org.apache.karaf.shell.console:jar:2.2.4-SNAPSHOT

  Try downloading the file manually from the project website.

  Then, install it using the command: 
      mvn install:install-file -DgroupId=org.apache.karaf.shell -DartifactId=org.apache.karaf.shell.console
-Dversion=2.2.4-SNAPSHOT -Dpackaging=jar -Dfile=/path/to/file

  Alternatively, if you host your own repository you can deploy the file there: 
      mvn deploy:deploy-file -DgroupId=org.apache.karaf.shell -DartifactId=org.apache.karaf.shell.console
-Dversion=2.2.4-SNAPSHOT -Dpackaging=jar -Dfile=/path/to/file -Durl=[url] -DrepositoryId=[id]

  Path to dependency: 
  	1) org.apache.cxf.karaf:apache-cxf:pom:2.5.0-SNAPSHOT
  	2) org.apache.karaf.shell:org.apache.karaf.shell.console:jar:2.2.4-SNAPSHOT

----------
1 required artifact is missing.

for artifact: 
  org.apache.cxf.karaf:apache-cxf:pom:2.5.0-SNAPSHOT

from the specified remote repositories:
  central (http://repo1.maven.org/maven2),
  Nexus (http://repository.apache.org/snapshots)


	at org.apache.maven.plugin.resources.remote.ProcessRemoteResourcesMojo.resolveProjectArtifacts(ProcessRemoteResourcesMojo.java:721)
	at org.apache.maven.plugin.resources.remote.ProcessRemoteResourcesMojo.getProjects(ProcessRemoteResourcesMojo.java:621)
	at org.apache.maven.plugin.resources.remote.ProcessRemoteResourcesMojo.configureVelocityContext(ProcessRemoteResourcesMojo.java:988)
	at org.apache.maven.plugin.resources.remote.ProcessRemoteResourcesMojo.execute(ProcessRemoteResourcesMojo.java:511)
	at org.apache.maven.plugin.DefaultPluginManager.executeMojo(DefaultPluginManager.java:490)
	at hudson.maven.agent.PluginManagerInterceptor.executeMojo(PluginManagerInterceptor.java:182)
	at org.apache.maven.lifecycle.DefaultLifecycleExecutor.executeGoals(DefaultLifecycleExecutor.java:694)
	... 28 more
Caused by: org.apache.maven.artifact.resolver.MultipleArtifactsNotFoundException: Missing:
----------
1) org.apache.karaf.shell:org.apache.karaf.shell.console:jar:2.2.4-SNAPSHOT

  Try downloading the file manually from the project website.

  Then, install it using the command: 
      mvn install:install-file -DgroupId=org.apache.karaf.shell -DartifactId=org.apache.karaf.shell.console
-Dversion=2.2.4-SNAPSHOT -Dpackaging=jar -Dfile=/path/to/file

  Alternatively, if you host your own repository you can deploy the file there: 
      mvn deploy:deploy-file -DgroupId=org.apache.karaf.shell -DartifactId=org.apache.karaf.shell.console
-Dversion=2.2.4-SNAPSHOT -Dpackaging=jar -Dfile=/path/to/file -Durl=[url] -DrepositoryId=[id]

  Path to dependency: 
  	1) org.apache.cxf.karaf:apache-cxf:pom:2.5.0-SNAPSHOT
  	2) org.apache.karaf.shell:org.apache.karaf.shell.console:jar:2.2.4-SNAPSHOT

----------
1 required artifact is missing.

for artifact: 
  org.apache.cxf.karaf:apache-cxf:pom:2.5.0-SNAPSHOT

from the specified remote repositories:
  central (http://repo1.maven.org/maven2),
  Nexus (http://repository.apache.org/snapshots)


	at org.apache.maven.artifact.resolver.DefaultArtifactResolver.resolveTransitively(DefaultArtifactResolver.java:360)
	at org.apache.maven.artifact.resolver.DefaultArtifactResolver.resolveTransitively(DefaultArtifactResolver.java:304)
	at org.apache.maven.shared.artifact.resolver.DefaultProjectDependenciesResolver.resolve(DefaultProjectDependenciesResolver.java:140)
	at org.apache.maven.shared.artifact.resolver.DefaultProjectDependenciesResolver.resolve(DefaultProjectDependenciesResolver.java:187)
	at org.apache.maven.plugin.resources.remote.ProcessRemoteResourcesMojo.resolveProjectArtifacts(ProcessRemoteResourcesMojo.java:716)
	... 34 more
[INFO] ------------------------------------------------------------------------
[INFO] Total time: 33 minutes 28 seconds
[INFO] Finished at: Mon Oct 17 06:35:36 UTC 2011
[INFO] Final Memory: 255M/417M
[INFO] ------------------------------------------------------------------------
Sending e-mails to: notifications@cxf.apache.org
channel stopped


Mime
View raw message