cxf-notifications mailing list archives

Site index · List index
Message view « Date » · « Thread »
Top « Date » · « Thread »
From Apache Jenkins Server <jenk...@builds.apache.org>
Subject Build failed in Jenkins: CXF-trunk-deploy #675
Date Sat, 08 Oct 2011 06:51:11 GMT
See <https://builds.apache.org/job/CXF-trunk-deploy/675/changes>

Changes:

[coheigea] [CXF-2850] - SAML and UsernameToken validation should validate the realm of the
incoming token against cached tokens
 - Patch applied, thanks

[coheigea] Updating the Claims class to make it Serializable

[gnodet] [CXF-3848] Add a jdk15 profile for wsn

[gnodet] [CXF-3848] [wsn] use cxf-parent, disable checkstyle, fix pmd violations

[coheigea] Add support to the STS for certificate constraints + pluggable realm retrieval
on the validation side

[gnodet] [CXF-3848] WS-Notification service implementation

------------------------------------------
[...truncated 7223 lines...]
[INFO] Compiling 65 source files to <https://builds.apache.org/job/CXF-trunk-deploy/ws/trunk/services/sts/sts-core/target/classes>
[debug] execute contextualize
[INFO] [resources:testResources {execution: default-testResources}]
[INFO] Using 'UTF-8' encoding to copy filtered resources.
[INFO] Copying 0 resource
[INFO] Copying 7 resources
[INFO] skip non existing resourceDirectory <https://builds.apache.org/job/CXF-trunk-deploy/ws/trunk/services/sts/sts-core/target/generated/src/test/resources>
[INFO] Copying 3 resources
[INFO] [compiler:testCompile {execution: default-testCompile}]
[INFO] Compiling 45 source files to <https://builds.apache.org/job/CXF-trunk-deploy/ws/trunk/services/sts/sts-core/target/test-classes>
[INFO] [surefire:test {execution: default-test}]
[INFO] Tests are skipped.
[INFO] [bundle:bundle {execution: default-bundle}]
[WARNING] Warning building bundle org.apache.cxf.services.sts:cxf-services-sts-core:bundle:2.5.0-SNAPSHOT
: Did not find matching referal for !org.apache.cxf.sts.*
[WARNING] Warning building bundle org.apache.cxf.services.sts:cxf-services-sts-core:bundle:2.5.0-SNAPSHOT
: Did not find matching referal for org.apache.cxf.sts.provider.*
[INFO] Preparing source:jar
[WARNING] Removing: jar from forked lifecycle, to prevent recursive invocation.
[JENKINS] Archiving <https://builds.apache.org/job/CXF-trunk-deploy/ws/trunk/services/sts/sts-core/pom.xml>
to /home/hudson/hudson/jobs/CXF-trunk-deploy/modules/org.apache.cxf.services.sts$cxf-services-sts-core/builds/2011-10-08_06-20-12/archive/org.apache.cxf.services.sts/cxf-services-sts-core/2.5.0-SNAPSHOT/cxf-services-sts-core-2.5.0-SNAPSHOT.pom
[JENKINS] Archiving <https://builds.apache.org/job/CXF-trunk-deploy/ws/trunk/services/sts/sts-core/target/cxf-services-sts-core-2.5.0-SNAPSHOT.jar>
to /home/hudson/hudson/jobs/CXF-trunk-deploy/modules/org.apache.cxf.services.sts$cxf-services-sts-core/builds/2011-10-08_06-20-12/archive/org.apache.cxf.services.sts/cxf-services-sts-core/2.5.0-SNAPSHOT/cxf-services-sts-core-2.5.0-SNAPSHOT.jar
[INFO] [dependency:copy {execution: create-endorsed-dir}]
[INFO] Configured Artifact: xerces:xercesImpl:?:jar
[INFO] Configured Artifact: xml-apis:xml-apis:1.3.04:jar
[INFO] xerces:xercesImpl:2.9.1:jar already exists in <https://builds.apache.org/job/CXF-trunk-deploy/ws/trunk/services/sts/sts-core/target/endorsed>
[INFO] xml-apis:xml-apis:1.3.04:jar already exists in <https://builds.apache.org/job/CXF-trunk-deploy/ws/trunk/services/sts/sts-core/target/endorsed>
[INFO] [cxf-xml2fastinfoset:xml2fastinfoset {execution: xml2fastinfoset}]
[INFO] [source:jar {execution: attach-sources}]
[INFO] org already added, skipping
[INFO] org/apache already added, skipping
[INFO] org/apache/cxf already added, skipping
[INFO] org/apache/cxf/sts already added, skipping
[INFO] org/apache/cxf/sts/interceptor already added, skipping
[INFO] org/apache/cxf/sts/operation already added, skipping
[INFO] org/apache/cxf/sts/claims already added, skipping
[INFO] org/apache/cxf/sts/request already added, skipping
[INFO] org/apache/cxf/sts/service already added, skipping
[INFO] org/apache/cxf/sts/cache already added, skipping
[INFO] org/apache/cxf/sts/token already added, skipping
[INFO] org/apache/cxf/sts/token/realm already added, skipping
[INFO] org/apache/cxf/sts/token/canceller already added, skipping
[INFO] org/apache/cxf/sts/token/validator already added, skipping
[INFO] org/apache/cxf/sts/token/provider already added, skipping
[INFO] META-INF already added, skipping
[INFO] META-INF/LICENSE already added, skipping
[INFO] META-INF/NOTICE already added, skipping
[INFO] META-INF/DEPENDENCIES already added, skipping
[INFO] Building jar: <https://builds.apache.org/job/CXF-trunk-deploy/ws/trunk/services/sts/sts-core/target/cxf-services-sts-core-2.5.0-SNAPSHOT-sources.jar>
[INFO] org already added, skipping
[INFO] org/apache already added, skipping
[INFO] org/apache/cxf already added, skipping
[INFO] org/apache/cxf/sts already added, skipping
[INFO] org/apache/cxf/sts/interceptor already added, skipping
[INFO] org/apache/cxf/sts/operation already added, skipping
[INFO] org/apache/cxf/sts/claims already added, skipping
[INFO] org/apache/cxf/sts/request already added, skipping
[INFO] org/apache/cxf/sts/service already added, skipping
[INFO] org/apache/cxf/sts/cache already added, skipping
[INFO] org/apache/cxf/sts/token already added, skipping
[INFO] org/apache/cxf/sts/token/realm already added, skipping
[INFO] org/apache/cxf/sts/token/canceller already added, skipping
[INFO] org/apache/cxf/sts/token/validator already added, skipping
[INFO] org/apache/cxf/sts/token/provider already added, skipping
[INFO] META-INF already added, skipping
[INFO] META-INF/LICENSE already added, skipping
[INFO] META-INF/NOTICE already added, skipping
[INFO] META-INF/DEPENDENCIES already added, skipping
[INFO] [javadoc:jar {execution: attach-javadocs}]
[INFO] 
3 warnings
[WARNING] Javadoc Warnings
[WARNING] <https://builds.apache.org/job/CXF-trunk-deploy/ws/trunk/services/sts/sts-core/src/main/java/org/apache/cxf/sts/StaticSTSProperties.java>:182:
warning - @param argument "signaturePropertiesFile" is not a parameter name.
[WARNING] <https://builds.apache.org/job/CXF-trunk-deploy/ws/trunk/services/sts/sts-core/src/main/java/org/apache/cxf/sts/token/provider/TokenProviderResponse.java>:134:
warning - @param argument "attachtedReference" is not a parameter name.
[WARNING] <https://builds.apache.org/job/CXF-trunk-deploy/ws/trunk/services/sts/sts-core/src/main/java/org/apache/cxf/sts/token/provider/TokenProviderResponse.java>:150:
warning - @param argument "unAttachedReference" is not a parameter name.
[INFO] Building jar: <https://builds.apache.org/job/CXF-trunk-deploy/ws/trunk/services/sts/sts-core/target/cxf-services-sts-core-2.5.0-SNAPSHOT-javadoc.jar>
[INFO] [install:install {execution: default-install}]
[INFO] Installing <https://builds.apache.org/job/CXF-trunk-deploy/ws/trunk/services/sts/sts-core/target/cxf-services-sts-core-2.5.0-SNAPSHOT.jar>
to <https://builds.apache.org/job/CXF-trunk-deploy/ws/.repository/org/apache/cxf/services/sts/cxf-services-sts-core/2.5.0-SNAPSHOT/cxf-services-sts-core-2.5.0-SNAPSHOT.jar>
[INFO] Installing <https://builds.apache.org/job/CXF-trunk-deploy/ws/trunk/services/sts/sts-core/target/cxf-services-sts-core-2.5.0-SNAPSHOT-sources.jar>
to <https://builds.apache.org/job/CXF-trunk-deploy/ws/.repository/org/apache/cxf/services/sts/cxf-services-sts-core/2.5.0-SNAPSHOT/cxf-services-sts-core-2.5.0-SNAPSHOT-sources.jar>
[INFO] Installing <https://builds.apache.org/job/CXF-trunk-deploy/ws/trunk/services/sts/sts-core/target/cxf-services-sts-core-2.5.0-SNAPSHOT-javadoc.jar>
to <https://builds.apache.org/job/CXF-trunk-deploy/ws/.repository/org/apache/cxf/services/sts/cxf-services-sts-core/2.5.0-SNAPSHOT/cxf-services-sts-core-2.5.0-SNAPSHOT-javadoc.jar>
[INFO] [bundle:install {execution: default-install}]
[INFO] Installing org/apache/cxf/services/sts/cxf-services-sts-core/2.5.0-SNAPSHOT/cxf-services-sts-core-2.5.0-SNAPSHOT.jar
[INFO] Writing OBR metadata
[INFO] [deploy:deploy {execution: default-deploy}]
[INFO] Retrieving previous build number from apache.snapshots.https
Uploading: https://repository.apache.org/content/repositories/snapshots/org/apache/cxf/services/sts/cxf-services-sts-core/2.5.0-SNAPSHOT/cxf-services-sts-core-2.5.0-20111008.062120-10.jar
123K uploaded  (cxf-services-sts-core-2.5.0-20111008.062120-10.jar)
[INFO] Retrieving previous metadata from apache.snapshots.https
[INFO] Uploading repository metadata for: 'artifact org.apache.cxf.services.sts:cxf-services-sts-core'
[INFO] Retrieving previous metadata from apache.snapshots.https
[INFO] Uploading repository metadata for: 'snapshot org.apache.cxf.services.sts:cxf-services-sts-core:2.5.0-SNAPSHOT'
[INFO] Uploading project information for cxf-services-sts-core 2.5.0-20111008.062120-10
[INFO] Retrieving previous build number from apache.snapshots.https
Uploading: https://repository.apache.org/content/repositories/snapshots/org/apache/cxf/services/sts/cxf-services-sts-core/2.5.0-SNAPSHOT/cxf-services-sts-core-2.5.0-20111008.062120-10-sources.jar
104K uploaded  (cxf-services-sts-core-2.5.0-20111008.062120-10-sources.jar)
[INFO] Retrieving previous build number from apache.snapshots.https
Uploading: https://repository.apache.org/content/repositories/snapshots/org/apache/cxf/services/sts/cxf-services-sts-core/2.5.0-SNAPSHOT/cxf-services-sts-core-2.5.0-20111008.062120-10-javadoc.jar
399K uploaded  (cxf-services-sts-core-2.5.0-20111008.062120-10-javadoc.jar)
[INFO] [bundle:deploy {execution: default-deploy}]
[INFO] Remote OBR update disabled (enable with -DremoteOBR)
[JENKINS] Archiving <https://builds.apache.org/job/CXF-trunk-deploy/ws/trunk/services/sts/sts-core/target/cxf-services-sts-core-2.5.0-SNAPSHOT.jar>
to /home/hudson/hudson/jobs/CXF-trunk-deploy/modules/org.apache.cxf.services.sts$cxf-services-sts-core/builds/2011-10-08_06-20-12/archive/org.apache.cxf.services.sts/cxf-services-sts-core/2.5.0-20111008.062120-10/cxf-services-sts-core-2.5.0-20111008.062120-10.jar
[JENKINS] Archiving <https://builds.apache.org/job/CXF-trunk-deploy/ws/trunk/services/sts/sts-core/target/cxf-services-sts-core-2.5.0-SNAPSHOT-sources.jar>
to /home/hudson/hudson/jobs/CXF-trunk-deploy/modules/org.apache.cxf.services.sts$cxf-services-sts-core/builds/2011-10-08_06-20-12/archive/org.apache.cxf.services.sts/cxf-services-sts-core/2.5.0-20111008.062120-10/cxf-services-sts-core-2.5.0-20111008.062120-10-sources.jar
[JENKINS] Archiving <https://builds.apache.org/job/CXF-trunk-deploy/ws/trunk/services/sts/sts-core/target/cxf-services-sts-core-2.5.0-SNAPSHOT-javadoc.jar>
to /home/hudson/hudson/jobs/CXF-trunk-deploy/modules/org.apache.cxf.services.sts$cxf-services-sts-core/builds/2011-10-08_06-20-12/archive/org.apache.cxf.services.sts/cxf-services-sts-core/2.5.0-20111008.062120-10/cxf-services-sts-core-2.5.0-20111008.062120-10-javadoc.jar
[INFO] ------------------------------------------------------------------------
[INFO] Building Apache CXF STS service
[INFO]    task-segment: [clean, deploy]
[INFO] ------------------------------------------------------------------------
[INFO] [clean:clean {execution: default-clean}]
[INFO] [site:attach-descriptor {execution: default-attach-descriptor}]
[INFO] Preparing source:jar
[WARNING] Removing: jar from forked lifecycle, to prevent recursive invocation.
[INFO] No goals needed for project - skipping
[INFO] [source:jar {execution: attach-sources}]
[INFO] [javadoc:jar {execution: attach-javadocs}]
[INFO] Not executing Javadoc as the project is not a Java classpath-capable package
[INFO] [install:install {execution: default-install}]
[INFO] Installing <https://builds.apache.org/job/CXF-trunk-deploy/ws/trunk/services/sts/pom.xml>
to <https://builds.apache.org/job/CXF-trunk-deploy/ws/.repository/org/apache/cxf/cxf-services-sts/2.5.0-SNAPSHOT/cxf-services-sts-2.5.0-SNAPSHOT.pom>
[INFO] [deploy:deploy {execution: default-deploy}]
[INFO] Retrieving previous build number from apache.snapshots.https
Uploading: https://repository.apache.org/content/repositories/snapshots/org/apache/cxf/cxf-services-sts/2.5.0-SNAPSHOT/cxf-services-sts-2.5.0-20111008.062120-18.pom
1K uploaded  (cxf-services-sts-2.5.0-20111008.062120-18.pom)
[INFO] Retrieving previous metadata from apache.snapshots.https
[INFO] Uploading repository metadata for: 'snapshot org.apache.cxf:cxf-services-sts:2.5.0-SNAPSHOT'
[INFO] Retrieving previous metadata from apache.snapshots.https
[INFO] Uploading repository metadata for: 'artifact org.apache.cxf:cxf-services-sts'
[JENKINS] Archiving <https://builds.apache.org/job/CXF-trunk-deploy/ws/trunk/services/sts/pom.xml>
to /home/hudson/hudson/jobs/CXF-trunk-deploy/modules/org.apache.cxf$cxf-services-sts/builds/2011-10-08_06-20-12/archive/org.apache.cxf/cxf-services-sts/2.5.0-SNAPSHOT/cxf-services-sts-2.5.0-SNAPSHOT.pom
[JENKINS] Archiving <https://builds.apache.org/job/CXF-trunk-deploy/ws/.repository/org/apache/cxf/cxf-services-sts/2.5.0-SNAPSHOT/cxf-services-sts-2.5.0-SNAPSHOT.pom>
to /home/hudson/hudson/jobs/CXF-trunk-deploy/modules/org.apache.cxf$cxf-services-sts/builds/2011-10-08_06-20-12/archive/org.apache.cxf/cxf-services-sts/2.5.0-20111008.062120-18/cxf-services-sts-2.5.0-20111008.062120-18.pom
[INFO] ------------------------------------------------------------------------
[INFO] Building Apache CXF WSN service
[INFO]    task-segment: [clean, deploy]
[INFO] ------------------------------------------------------------------------
[INFO] [clean:clean {execution: default-clean}]
[INFO] [cxf-xml2fastinfoset:xml2fastinfoset {execution: xml2fastinfoset}]
Downloading: http://repo1.maven.org/maven2/org/slf4j/slf4j-api/1.6.1/slf4j-api-1.6.1.pom

Downloading: http://repo1.maven.org/maven2/org/apache/activemq/activemq-core/5.5.0/activemq-core-5.5.0.pom

Downloading: http://repo1.maven.org/maven2/org/apache/activemq/activemq-parent/5.5.0/activemq-parent-5.5.0.pom

Downloading: http://repository.springsource.com/maven/bundles/external/org/apache/activemq/kahadb/5.5.0/kahadb-5.5.0.pom
[INFO] Unable to find resource 'org.apache.activemq:kahadb:pom:5.5.0' in repository com.springsource.repository.bundles.external
(http://repository.springsource.com/maven/bundles/external)
Downloading: http://repo1.maven.org/maven2/org/apache/activemq/kahadb/5.5.0/kahadb-5.5.0.pom

Downloading: http://repository.springsource.com/maven/bundles/external/org/jasypt/jasypt/1.7/jasypt-1.7.pom
[INFO] Unable to find resource 'org.jasypt:jasypt:pom:1.7' in repository com.springsource.repository.bundles.external
(http://repository.springsource.com/maven/bundles/external)
Downloading: http://repo1.maven.org/maven2/org/jasypt/jasypt/1.7/jasypt-1.7.pom

Downloading: http://repo1.maven.org/maven2/org/slf4j/slf4j-log4j12/1.6.1/slf4j-log4j12-1.6.1.pom

Downloading: http://repo1.maven.org/maven2/org/apache/activemq/activemq-core/5.5.0/activemq-core-5.5.0.jar
Downloading: http://repo1.maven.org/maven2/org/slf4j/slf4j-api/1.6.1/slf4j-api-1.6.1.jar
Downloading: http://repository.springsource.com/maven/bundles/external/org/jasypt/jasypt/1.7/jasypt-1.7.jar
[INFO] Unable to find resource 'org.jasypt:jasypt:jar:1.7' in repository com.springsource.repository.bundles.external
(http://repository.springsource.com/maven/bundles/external)
Downloading: http://repo1.maven.org/maven2/org/jasypt/jasypt/1.7/jasypt-1.7.jar

Downloading: http://repo1.maven.org/maven2/org/slf4j/slf4j-log4j12/1.6.1/slf4j-log4j12-1.6.1.jar



Downloading: http://repository.springsource.com/maven/bundles/external/org/apache/activemq/kahadb/5.5.0/kahadb-5.5.0.jar
[INFO] Unable to find resource 'org.apache.activemq:kahadb:jar:5.5.0' in repository com.springsource.repository.bundles.external
(http://repository.springsource.com/maven/bundles/external)
Downloading: http://repo1.maven.org/maven2/org/apache/activemq/kahadb/5.5.0/kahadb-5.5.0.jar

[INFO] [cxf-codegen:wsdl2java {execution: default}]
Loading FrontEnd jaxws ...
Loading DataBinding jaxb ...
wsdl2java -d <https://builds.apache.org/job/CXF-trunk-deploy/ws/trunk/services/wsn/target/jaxws>
-verbose <https://builds.apache.org/job/CXF-trunk-deploy/ws/trunk/services/wsn/src/main/resources/org/apache/cxf/wsn/wsn.wsdl>
wsdl2java - Apache CXF 2.5.0-SNAPSHOT

[INFO] [remote-resources:process {execution: default}]
[debug] execute contextualize
[INFO] [resources:resources {execution: default-resources}]
[INFO] Using 'UTF-8' encoding to copy filtered resources.
[INFO] Copying 0 resource
[INFO] Copying 17 resources
[INFO] skip non existing resourceDirectory <https://builds.apache.org/job/CXF-trunk-deploy/ws/trunk/services/wsn/src/main/resources-filtered>
[INFO] skip non existing resourceDirectory <https://builds.apache.org/job/CXF-trunk-deploy/ws/trunk/services/wsn/target/generated/src/main/resources>
[INFO] Copying 3 resources
[INFO] [compiler:compile {execution: default-compile}]
[INFO] Compiling 188 source files to <https://builds.apache.org/job/CXF-trunk-deploy/ws/trunk/services/wsn/target/classes>
[INFO] -------------------------------------------------------------
[ERROR] COMPILATION ERROR : 
[INFO] -------------------------------------------------------------
[ERROR] <https://builds.apache.org/job/CXF-trunk-deploy/ws/trunk/services/wsn/src/main/java/org/apache/cxf/wsn/jms/JmsPublisher.java>:[34,-1]
cannot access org.apache.activemq.advisory.ConsumerEvent
bad class file: <https://builds.apache.org/job/CXF-trunk-deploy/ws/.repository/org/apache/activemq/activemq-core/5.5.0/activemq-core-5.5.0.jar(org/apache/activemq/advisory/ConsumerEvent.class)>
class file has wrong version 50.0, should be 49.0
[INFO] 1 error
[INFO] -------------------------------------------------------------
[JENKINS] Archiving <https://builds.apache.org/job/CXF-trunk-deploy/ws/trunk/services/wsn/pom.xml>
to /home/hudson/hudson/jobs/CXF-trunk-deploy/modules/org.apache.cxf$cxf-services-wsn/builds/2011-10-08_06-20-12/archive/org.apache.cxf/cxf-services-wsn/2.5.0-SNAPSHOT/cxf-services-wsn-2.5.0-SNAPSHOT.pom
[INFO] ------------------------------------------------------------------------
[ERROR] BUILD FAILURE
[INFO] ------------------------------------------------------------------------
[INFO] Compilation failure
<https://builds.apache.org/job/CXF-trunk-deploy/ws/trunk/services/wsn/src/main/java/org/apache/cxf/wsn/jms/JmsPublisher.java>:[34,-1]
cannot access org.apache.activemq.advisory.ConsumerEvent
bad class file: <https://builds.apache.org/job/CXF-trunk-deploy/ws/.repository/org/apache/activemq/activemq-core/5.5.0/activemq-core-5.5.0.jar(org/apache/activemq/advisory/ConsumerEvent.class)>
class file has wrong version 50.0, should be 49.0

[INFO] ------------------------------------------------------------------------
[INFO] Trace
org.apache.maven.BuildFailureException: Compilation failure
<https://builds.apache.org/job/CXF-trunk-deploy/ws/trunk/services/wsn/src/main/java/org/apache/cxf/wsn/jms/JmsPublisher.java>:[34,-1]
cannot access org.apache.activemq.advisory.ConsumerEvent
bad class file: <https://builds.apache.org/job/CXF-trunk-deploy/ws/.repository/org/apache/activemq/activemq-core/5.5.0/activemq-core-5.5.0.jar(org/apache/activemq/advisory/ConsumerEvent.class)>
class file has wrong version 50.0, should be 49.0

	at org.apache.maven.lifecycle.DefaultLifecycleExecutor.executeGoals(DefaultLifecycleExecutor.java:715)
	at org.apache.maven.lifecycle.DefaultLifecycleExecutor.executeGoalWithLifecycle(DefaultLifecycleExecutor.java:556)
	at org.apache.maven.lifecycle.DefaultLifecycleExecutor.executeGoal(DefaultLifecycleExecutor.java:535)
	at org.apache.maven.lifecycle.DefaultLifecycleExecutor.executeGoalAndHandleFailures(DefaultLifecycleExecutor.java:387)
	at org.apache.maven.lifecycle.DefaultLifecycleExecutor.executeTaskSegments(DefaultLifecycleExecutor.java:348)
	at org.apache.maven.lifecycle.DefaultLifecycleExecutor.execute(DefaultLifecycleExecutor.java:180)
	at org.apache.maven.lifecycle.LifecycleExecutorInterceptor.execute(LifecycleExecutorInterceptor.java:65)
	at org.apache.maven.DefaultMaven.doExecute(DefaultMaven.java:328)
	at org.apache.maven.DefaultMaven.execute(DefaultMaven.java:138)
	at org.apache.maven.cli.MavenCli.main(MavenCli.java:362)
	at sun.reflect.NativeMethodAccessorImpl.invoke0(Native Method)
	at sun.reflect.NativeMethodAccessorImpl.invoke(NativeMethodAccessorImpl.java:39)
	at sun.reflect.DelegatingMethodAccessorImpl.invoke(DelegatingMethodAccessorImpl.java:25)
	at java.lang.reflect.Method.invoke(Method.java:592)
	at org.codehaus.classworlds.Launcher.launchEnhanced(Launcher.java:315)
	at org.codehaus.classworlds.Launcher.launch(Launcher.java:255)
	at hudson.maven.agent.Main.launch(Main.java:185)
	at hudson.maven.MavenBuilder.call(MavenBuilder.java:160)
	at hudson.maven.MavenModuleSetBuild$Builder.call(MavenModuleSetBuild.java:1059)
	at hudson.maven.MavenModuleSetBuild$Builder.call(MavenModuleSetBuild.java:990)
	at hudson.remoting.UserRequest.perform(UserRequest.java:118)
	at hudson.remoting.UserRequest.perform(UserRequest.java:48)
	at hudson.remoting.Request$2.run(Request.java:287)
	at java.util.concurrent.Executors$RunnableAdapter.call(Executors.java:417)
	at java.util.concurrent.FutureTask$Sync.innerRun(FutureTask.java:269)
	at java.util.concurrent.FutureTask.run(FutureTask.java:123)
	at java.util.concurrent.ThreadPoolExecutor$Worker.runTask(ThreadPoolExecutor.java:651)
	at java.util.concurrent.ThreadPoolExecutor$Worker.run(ThreadPoolExecutor.java:676)
	at java.lang.Thread.run(Thread.java:595)
Caused by: org.apache.maven.plugin.CompilationFailureException: Compilation failure
<https://builds.apache.org/job/CXF-trunk-deploy/ws/trunk/services/wsn/src/main/java/org/apache/cxf/wsn/jms/JmsPublisher.java>:[34,-1]
cannot access org.apache.activemq.advisory.ConsumerEvent
bad class file: <https://builds.apache.org/job/CXF-trunk-deploy/ws/.repository/org/apache/activemq/activemq-core/5.5.0/activemq-core-5.5.0.jar(org/apache/activemq/advisory/ConsumerEvent.class)>
class file has wrong version 50.0, should be 49.0

	at org.apache.maven.plugin.AbstractCompilerMojo.execute(AbstractCompilerMojo.java:656)
	at org.apache.maven.plugin.CompilerMojo.execute(CompilerMojo.java:128)
	at org.apache.maven.plugin.DefaultPluginManager.executeMojo(DefaultPluginManager.java:490)
	at hudson.maven.agent.PluginManagerInterceptor.executeMojo(PluginManagerInterceptor.java:182)
	at org.apache.maven.lifecycle.DefaultLifecycleExecutor.executeGoals(DefaultLifecycleExecutor.java:694)
	... 28 more
[INFO] ------------------------------------------------------------------------
[INFO] Total time: 29 minutes 43 seconds
[INFO] Finished at: Sat Oct 08 06:50:40 UTC 2011
[INFO] Final Memory: 265M/396M
[INFO] ------------------------------------------------------------------------
Waiting for Jenkins to finish collecting data
Sending e-mails to: notifications@cxf.apache.org
channel stopped


Mime
View raw message