cxf-notifications mailing list archives

Site index · List index
Message view « Date » · « Thread »
Top « Date » · « Thread »
From Apache Jenkins Server <jenk...@builds.apache.org>
Subject Build failed in Jenkins: CXF-trunk-deploy #661
Date Mon, 26 Sep 2011 07:33:29 GMT
See <https://builds.apache.org/job/CXF-trunk-deploy/661/changes>

Changes:

[ffang] [CXF-3824]CLI tool -help should be able to list all switch in toolspec

[ningjiang] CXF-3823 cxf-rt-transport-http-jetty should have the dependency of servlet API
2.5 instead of 3.0

------------------------------------------
[...truncated 15332 lines...]
[INFO] Installing <https://builds.apache.org/job/CXF-trunk-deploy/ws/trunk/distribution/src/main/release/samples/wsdl_first_rpclit/target/wsdl_first_rpclit-2.5.0-SNAPSHOT.jar>
to <https://builds.apache.org/job/CXF-trunk-deploy/ws/.repository/org/apache/cxf/samples/wsdl_first_rpclit/2.5.0-SNAPSHOT/wsdl_first_rpclit-2.5.0-SNAPSHOT.jar>
[INFO] [deploy:deploy {execution: default-deploy}]
[INFO]  skipping artifact deployement 
[JENKINS] Archiving <https://builds.apache.org/job/CXF-trunk-deploy/ws/trunk/distribution/src/main/release/samples/wsdl_first_rpclit/pom.xml>
to /home/hudson/hudson/jobs/CXF-trunk-deploy/modules/org.apache.cxf.samples$wsdl_first_rpclit/builds/2011-09-26_06-02-14/archive/org.apache.cxf.samples/wsdl_first_rpclit/2.5.0-SNAPSHOT/wsdl_first_rpclit-2.5.0-SNAPSHOT.pom
[JENKINS] Archiving <https://builds.apache.org/job/CXF-trunk-deploy/ws/trunk/distribution/src/main/release/samples/wsdl_first_rpclit/target/wsdl_first_rpclit-2.5.0-SNAPSHOT.jar>
to /home/hudson/hudson/jobs/CXF-trunk-deploy/modules/org.apache.cxf.samples$wsdl_first_rpclit/builds/2011-09-26_06-02-14/archive/org.apache.cxf.samples/wsdl_first_rpclit/2.5.0-SNAPSHOT/wsdl_first_rpclit-2.5.0-SNAPSHOT.jar
[INFO] ------------------------------------------------------------------------
[INFO] Building JMS Transport Publish/Subscribe Demo using Document-Literal Style
[INFO]    task-segment: [clean, deploy]
[INFO] ------------------------------------------------------------------------
[INFO] [clean:clean {execution: default-clean}]
[INFO] Deleting directory <https://builds.apache.org/job/CXF-trunk-deploy/ws/trunk/distribution/src/main/release/samples/jms_pubsub/target>
[INFO] [cxf-codegen:wsdl2java {execution: generate-sources}]
[INFO] [resources:resources {execution: default-resources}]
[INFO] Using 'UTF-8' encoding to copy filtered resources.
[INFO] skip non existing resourceDirectory <https://builds.apache.org/job/CXF-trunk-deploy/ws/trunk/distribution/src/main/release/samples/jms_pubsub/src/main/resources>
[INFO] [compiler:compile {execution: default-compile}]
[INFO] Compiling 9 source files to <https://builds.apache.org/job/CXF-trunk-deploy/ws/trunk/distribution/src/main/release/samples/jms_pubsub/target/classes>
[INFO] [resources:testResources {execution: default-testResources}]
[INFO] Using 'UTF-8' encoding to copy filtered resources.
[INFO] skip non existing resourceDirectory <https://builds.apache.org/job/CXF-trunk-deploy/ws/trunk/distribution/src/main/release/samples/jms_pubsub/src/test/resources>
[INFO] [compiler:testCompile {execution: default-testCompile}]
[INFO] No sources to compile
[INFO] [surefire:test {execution: default-test}]
[INFO] Tests are skipped.
[INFO] [jar:jar {execution: default-jar}]
[INFO] Building jar: <https://builds.apache.org/job/CXF-trunk-deploy/ws/trunk/distribution/src/main/release/samples/jms_pubsub/target/jms_pubsub-2.5.0-SNAPSHOT.jar>
[INFO] [install:install {execution: default-install}]
[INFO] Installing <https://builds.apache.org/job/CXF-trunk-deploy/ws/trunk/distribution/src/main/release/samples/jms_pubsub/target/jms_pubsub-2.5.0-SNAPSHOT.jar>
to <https://builds.apache.org/job/CXF-trunk-deploy/ws/.repository/org/apache/cxf/samples/jms_pubsub/2.5.0-SNAPSHOT/jms_pubsub-2.5.0-SNAPSHOT.jar>
[INFO] [deploy:deploy {execution: default-deploy}]
[INFO]  skipping artifact deployement 
[JENKINS] Archiving <https://builds.apache.org/job/CXF-trunk-deploy/ws/trunk/distribution/src/main/release/samples/jms_pubsub/pom.xml>
to /home/hudson/hudson/jobs/CXF-trunk-deploy/modules/org.apache.cxf.samples$jms_pubsub/builds/2011-09-26_06-02-14/archive/org.apache.cxf.samples/jms_pubsub/2.5.0-SNAPSHOT/jms_pubsub-2.5.0-SNAPSHOT.pom
[JENKINS] Archiving <https://builds.apache.org/job/CXF-trunk-deploy/ws/trunk/distribution/src/main/release/samples/jms_pubsub/target/jms_pubsub-2.5.0-SNAPSHOT.jar>
to /home/hudson/hudson/jobs/CXF-trunk-deploy/modules/org.apache.cxf.samples$jms_pubsub/builds/2011-09-26_06-02-14/archive/org.apache.cxf.samples/jms_pubsub/2.5.0-SNAPSHOT/jms_pubsub-2.5.0-SNAPSHOT.jar
[INFO] ------------------------------------------------------------------------
[INFO] Building JAX-RS Spring Security Demo
[INFO]    task-segment: [clean, deploy]
[INFO] ------------------------------------------------------------------------
[INFO] [clean:clean {execution: default-clean}]
[INFO] Deleting directory <https://builds.apache.org/job/CXF-trunk-deploy/ws/trunk/distribution/src/main/release/samples/jax_rs/spring_security/target>
[INFO] [antrun:run {execution: copyxmlfiles}]
project.artifactId
[INFO] Executing tasks
     [copy] Copying 1 file to <https://builds.apache.org/job/CXF-trunk-deploy/ws/trunk/distribution/src/main/release/samples/jax_rs/spring_security/target/classes/demo/jaxrs/client>
     [copy] Copying 1 file to <https://builds.apache.org/job/CXF-trunk-deploy/ws/trunk/distribution/src/main/release/samples/jax_rs/spring_security/target/classes/demo/jaxrs/client>
[INFO] Executed tasks
[INFO] [resources:resources {execution: default-resources}]
[INFO] Using 'UTF-8' encoding to copy filtered resources.
[INFO] skip non existing resourceDirectory <https://builds.apache.org/job/CXF-trunk-deploy/ws/trunk/distribution/src/main/release/samples/jax_rs/spring_security/src/main/resources>
[INFO] [compiler:compile {execution: default-compile}]
[INFO] Compiling 11 source files to <https://builds.apache.org/job/CXF-trunk-deploy/ws/trunk/distribution/src/main/release/samples/jax_rs/spring_security/target/classes>
[INFO] [resources:testResources {execution: default-testResources}]
[INFO] Using 'UTF-8' encoding to copy filtered resources.
[INFO] skip non existing resourceDirectory <https://builds.apache.org/job/CXF-trunk-deploy/ws/trunk/distribution/src/main/release/samples/jax_rs/spring_security/src/test/resources>
[INFO] [compiler:testCompile {execution: default-testCompile}]
[INFO] No sources to compile
[INFO] [surefire:test {execution: default-test}]
[INFO] Tests are skipped.
[INFO] [jar:jar {execution: default-jar}]
[INFO] Building jar: <https://builds.apache.org/job/CXF-trunk-deploy/ws/trunk/distribution/src/main/release/samples/jax_rs/spring_security/target/jax_rs_spring_security-2.5.0-SNAPSHOT.jar>
[INFO] [install:install {execution: default-install}]
[INFO] Installing <https://builds.apache.org/job/CXF-trunk-deploy/ws/trunk/distribution/src/main/release/samples/jax_rs/spring_security/target/jax_rs_spring_security-2.5.0-SNAPSHOT.jar>
to <https://builds.apache.org/job/CXF-trunk-deploy/ws/.repository/org/apache/cxf/samples/jax_rs_spring_security/2.5.0-SNAPSHOT/jax_rs_spring_security-2.5.0-SNAPSHOT.jar>
[INFO] [deploy:deploy {execution: default-deploy}]
[INFO]  skipping artifact deployement 
[JENKINS] Archiving <https://builds.apache.org/job/CXF-trunk-deploy/ws/trunk/distribution/src/main/release/samples/jax_rs/spring_security/pom.xml>
to /home/hudson/hudson/jobs/CXF-trunk-deploy/modules/org.apache.cxf.samples$jax_rs_spring_security/builds/2011-09-26_06-02-14/archive/org.apache.cxf.samples/jax_rs_spring_security/2.5.0-SNAPSHOT/jax_rs_spring_security-2.5.0-SNAPSHOT.pom
[JENKINS] Archiving <https://builds.apache.org/job/CXF-trunk-deploy/ws/trunk/distribution/src/main/release/samples/jax_rs/spring_security/target/jax_rs_spring_security-2.5.0-SNAPSHOT.jar>
to /home/hudson/hudson/jobs/CXF-trunk-deploy/modules/org.apache.cxf.samples$jax_rs_spring_security/builds/2011-09-26_06-02-14/archive/org.apache.cxf.samples/jax_rs_spring_security/2.5.0-SNAPSHOT/jax_rs_spring_security-2.5.0-SNAPSHOT.jar
[INFO] ------------------------------------------------------------------------
[INFO] Building Apache CXF STS issue operation
[INFO]    task-segment: [clean, deploy]
[INFO] ------------------------------------------------------------------------
[INFO] [clean:clean {execution: default-clean}]
[INFO] Deleting directory <https://builds.apache.org/job/CXF-trunk-deploy/ws/trunk/distribution/src/main/release/samples/sts_issue_operation/target>
[INFO] [resources:resources {execution: default-resources}]
[INFO] Using 'UTF-8' encoding to copy filtered resources.
[INFO] Copying 1 resource
[INFO] [compiler:compile {execution: default-compile}]
[INFO] Compiling 12 source files to <https://builds.apache.org/job/CXF-trunk-deploy/ws/trunk/distribution/src/main/release/samples/sts_issue_operation/target/classes>
[INFO] [resources:testResources {execution: default-testResources}]
[INFO] Using 'UTF-8' encoding to copy filtered resources.
[INFO] skip non existing resourceDirectory <https://builds.apache.org/job/CXF-trunk-deploy/ws/trunk/distribution/src/main/release/samples/sts_issue_operation/src/test/resources>
[INFO] [compiler:testCompile {execution: default-testCompile}]
[INFO] Compiling 1 source file to <https://builds.apache.org/job/CXF-trunk-deploy/ws/trunk/distribution/src/main/release/samples/sts_issue_operation/target/test-classes>
[INFO] [surefire:test {execution: default-test}]
[INFO] Tests are skipped.
[INFO] [war:war {execution: default-war}]
[INFO] Packaging webapp
[INFO] Assembling webapp [sample-issue-operation] in [<https://builds.apache.org/job/CXF-trunk-deploy/ws/trunk/distribution/src/main/release/samples/sts_issue_operation/target/sts]>
[INFO] Processing war project
[INFO] Copying webapp resources [<https://builds.apache.org/job/CXF-trunk-deploy/ws/trunk/distribution/src/main/release/samples/sts_issue_operation/src/main/webapp]>
[INFO] Webapp assembled in [152 msecs]
[INFO] Building war: <https://builds.apache.org/job/CXF-trunk-deploy/ws/trunk/distribution/src/main/release/samples/sts_issue_operation/target/sts.war>
[INFO] WEB-INF/web.xml already added, skipping
[INFO] [install:install {execution: default-install}]
[INFO] Installing <https://builds.apache.org/job/CXF-trunk-deploy/ws/trunk/distribution/src/main/release/samples/sts_issue_operation/target/sts.war>
to <https://builds.apache.org/job/CXF-trunk-deploy/ws/.repository/org/apache/cxf/samples/sample-issue-operation/2.5.0-SNAPSHOT/sample-issue-operation-2.5.0-SNAPSHOT.war>
[INFO] [deploy:deploy {execution: default-deploy}]
[INFO]  skipping artifact deployement 
[JENKINS] Archiving <https://builds.apache.org/job/CXF-trunk-deploy/ws/trunk/distribution/src/main/release/samples/sts_issue_operation/pom.xml>
to /home/hudson/hudson/jobs/CXF-trunk-deploy/modules/org.apache.cxf.samples$sample-issue-operation/builds/2011-09-26_06-02-14/archive/org.apache.cxf.samples/sample-issue-operation/2.5.0-SNAPSHOT/sample-issue-operation-2.5.0-SNAPSHOT.pom
[JENKINS] Archiving <https://builds.apache.org/job/CXF-trunk-deploy/ws/trunk/distribution/src/main/release/samples/sts_issue_operation/target/sts.war>
to /home/hudson/hudson/jobs/CXF-trunk-deploy/modules/org.apache.cxf.samples$sample-issue-operation/builds/2011-09-26_06-02-14/archive/org.apache.cxf.samples/sample-issue-operation/2.5.0-SNAPSHOT/sample-issue-operation-2.5.0-SNAPSHOT.war
[INFO] ------------------------------------------------------------------------
[INFO] Building LogBrowser
[INFO]    task-segment: [clean, deploy]
[INFO] ------------------------------------------------------------------------
[INFO] [clean:clean {execution: default-clean}]
[INFO] Deleting directory <https://builds.apache.org/job/CXF-trunk-deploy/ws/trunk/distribution/src/main/release/samples/logbrowser/target>
[INFO] [resources:resources {execution: default-resources}]
[INFO] Using 'UTF-8' encoding to copy filtered resources.
[INFO] skip non existing resourceDirectory <https://builds.apache.org/job/CXF-trunk-deploy/ws/trunk/distribution/src/main/release/samples/logbrowser/src/main/resources>
[INFO] [compiler:compile {execution: default-compile}]
[INFO] Compiling 4 source files to <https://builds.apache.org/job/CXF-trunk-deploy/ws/trunk/distribution/src/main/release/samples/logbrowser/target/classes>
[INFO] [resources:testResources {execution: default-testResources}]
[INFO] Using 'UTF-8' encoding to copy filtered resources.
[INFO] skip non existing resourceDirectory <https://builds.apache.org/job/CXF-trunk-deploy/ws/trunk/distribution/src/main/release/samples/logbrowser/src/test/resources>
[INFO] [compiler:testCompile {execution: default-testCompile}]
[INFO] No sources to compile
[INFO] [surefire:test {execution: default-test}]
[INFO] Tests are skipped.
[INFO] [jar:jar {execution: default-jar}]
[INFO] Building jar: <https://builds.apache.org/job/CXF-trunk-deploy/ws/trunk/distribution/src/main/release/samples/logbrowser/target/logbrowser-2.5.0-SNAPSHOT.jar>
[INFO] [install:install {execution: default-install}]
[INFO] Installing <https://builds.apache.org/job/CXF-trunk-deploy/ws/trunk/distribution/src/main/release/samples/logbrowser/target/logbrowser-2.5.0-SNAPSHOT.jar>
to <https://builds.apache.org/job/CXF-trunk-deploy/ws/.repository/org/apache/cxf/samples/logbrowser/2.5.0-SNAPSHOT/logbrowser-2.5.0-SNAPSHOT.jar>
[INFO] [deploy:deploy {execution: default-deploy}]
[INFO]  skipping artifact deployement 
[JENKINS] Archiving <https://builds.apache.org/job/CXF-trunk-deploy/ws/trunk/distribution/src/main/release/samples/logbrowser/pom.xml>
to /home/hudson/hudson/jobs/CXF-trunk-deploy/modules/org.apache.cxf.samples$logbrowser/builds/2011-09-26_06-02-14/archive/org.apache.cxf.samples/logbrowser/2.5.0-SNAPSHOT/logbrowser-2.5.0-SNAPSHOT.pom
[JENKINS] Archiving <https://builds.apache.org/job/CXF-trunk-deploy/ws/trunk/distribution/src/main/release/samples/logbrowser/target/logbrowser-2.5.0-SNAPSHOT.jar>
to /home/hudson/hudson/jobs/CXF-trunk-deploy/modules/org.apache.cxf.samples$logbrowser/builds/2011-09-26_06-02-14/archive/org.apache.cxf.samples/logbrowser/2.5.0-SNAPSHOT/logbrowser-2.5.0-SNAPSHOT.jar
[INFO] ------------------------------------------------------------------------
[INFO] Building Apache CXF Distribution
[INFO]    task-segment: [clean, deploy]
[INFO] ------------------------------------------------------------------------
[INFO] [clean:clean {execution: default-clean}]
[INFO] Deleting <https://builds.apache.org/job/CXF-trunk-deploy/ws/trunk/distribution/target>
[INFO] [checkstyle:checkstyle {execution: validate}]
[INFO] [cxf-xml2fastinfoset:xml2fastinfoset {execution: xml2fastinfoset}]
[INFO] [dependency:copy {execution: add-jars}]
[INFO] Configured Artifact: org.apache.cxf:cxf-integration-jca:2.5.0-SNAPSHOT:jar
[INFO] snapshot org.apache.cxf:cxf-integration-jca:2.5.0-SNAPSHOT: checking for updates from
apache.snapshots
[INFO] Configured Artifact: javax.xml.bind:jaxb-api:2.2.3:jar
[INFO] Configured Artifact: org.apache.geronimo.specs:geronimo-jaxws_2.2_spec:1.1:jar
[INFO] Copying cxf-integration-jca-2.5.0-SNAPSHOT.jar to <https://builds.apache.org/job/CXF-trunk-deploy/ws/trunk/distribution/target/additional-libs/cxf-integration-jca-2.5.0-SNAPSHOT.jar>
[INFO] Copying jaxb-api-2.2.3.jar to <https://builds.apache.org/job/CXF-trunk-deploy/ws/trunk/distribution/target/libs/endorsed/jaxb-api-2.2.3.jar>
[INFO] Copying geronimo-jaxws_2.2_spec-1.1.jar to <https://builds.apache.org/job/CXF-trunk-deploy/ws/trunk/distribution/target/libs/endorsed/geronimo-jaxws_2.2_spec-1.1.jar>
[WARNING] DEPRECATED [tasks]: Use target instead
[INFO] [antrun:run {execution: process-sources-xsl}]
[WARNING] Parameter tasks is deprecated, use target instead
[INFO] Executing tasks

main:
[INFO] Executed tasks
[INFO] [remote-resources:process {execution: default}]
Sep 26, 2011 7:10:16 AM org.apache.velocity.runtime.log.JdkLogChute log
INFO: FileResourceLoader : adding path '.'
[INFO] [site:attach-descriptor {execution: default-attach-descriptor}]
[INFO] Preparing source:jar
[WARNING] Removing: jar from forked lifecycle, to prevent recursive invocation.
[JENKINS] Archiving <https://builds.apache.org/job/CXF-trunk-deploy/ws/trunk/distribution/pom.xml>
to /home/hudson/hudson/jobs/CXF-trunk-deploy/modules/org.apache.cxf$apache-cxf/builds/2011-09-26_06-02-14/archive/org.apache.cxf/apache-cxf/2.5.0-SNAPSHOT/apache-cxf-2.5.0-SNAPSHOT.pom
[INFO] [checkstyle:checkstyle {execution: validate}]
[INFO] [cxf-xml2fastinfoset:xml2fastinfoset {execution: xml2fastinfoset}]
[INFO] [source:jar {execution: attach-sources}]
[INFO] [javadoc:jar {execution: attach-javadocs}]
[INFO] Not executing Javadoc as the project is not a Java classpath-capable package
[INFO] [dependency:unpack {execution: unpack-javadoc}]
[INFO] Configured Artifact: org.apache.cxf:cxf-api:javadoc:2.5.0-SNAPSHOT:jar
[INFO] Unpacking <https://builds.apache.org/job/CXF-trunk-deploy/ws/.repository/org/apache/cxf/cxf-api/2.5.0-SNAPSHOT/cxf-api-2.5.0-SNAPSHOT-javadoc.jar>
to <https://builds.apache.org/job/CXF-trunk-deploy/ws/trunk/distribution/target/javadoc>
with includes "" and excludes ""
[INFO] [assembly:single {execution: distribution-package}]
[INFO] Reading assembly descriptor: src/main/assembly/bin.xml
[INFO] Reading assembly descriptor: src/main/assembly/src.xml
[WARNING] Cannot include project artifact: org.apache.cxf:apache-cxf:pom:2.5.0-SNAPSHOT; it
doesn't have an associated file or directory.
[WARNING] Cannot include project artifact: org.apache.cxf:apache-cxf:pom:2.5.0-SNAPSHOT; it
doesn't have an associated file or directory.
[WARNING] Cannot include project artifact: org.apache.cxf:apache-cxf:pom:2.5.0-SNAPSHOT; it
doesn't have an associated file or directory.
[INFO] Copying files to <https://builds.apache.org/job/CXF-trunk-deploy/ws/trunk/distribution/target/apache-cxf-2.5.0-SNAPSHOT>
[WARNING] Assembly file: <https://builds.apache.org/job/CXF-trunk-deploy/ws/trunk/distribution/target/apache-cxf-2.5.0-SNAPSHOT>
is not a regular file (it may be a directory). It cannot be attached to the project build
for installation or deployment.
[WARNING] Cannot include project artifact: org.apache.cxf:apache-cxf:pom:2.5.0-SNAPSHOT; it
doesn't have an associated file or directory.
[WARNING] Cannot include project artifact: org.apache.cxf:apache-cxf:pom:2.5.0-SNAPSHOT; it
doesn't have an associated file or directory.
[WARNING] Cannot include project artifact: org.apache.cxf:apache-cxf:pom:2.5.0-SNAPSHOT; it
doesn't have an associated file or directory.
[INFO] Building tar : <https://builds.apache.org/job/CXF-trunk-deploy/ws/trunk/distribution/target/apache-cxf-2.5.0-SNAPSHOT.tar.gz>
[WARNING] Cannot include project artifact: org.apache.cxf:apache-cxf:pom:2.5.0-SNAPSHOT; it
doesn't have an associated file or directory.
[WARNING] Cannot include project artifact: org.apache.cxf:apache-cxf:pom:2.5.0-SNAPSHOT; it
doesn't have an associated file or directory.
[WARNING] Cannot include project artifact: org.apache.cxf:apache-cxf:pom:2.5.0-SNAPSHOT; it
doesn't have an associated file or directory.
[INFO] Building zip: <https://builds.apache.org/job/CXF-trunk-deploy/ws/trunk/distribution/target/apache-cxf-2.5.0-SNAPSHOT.zip>
[INFO] Building tar : <https://builds.apache.org/job/CXF-trunk-deploy/ws/trunk/distribution/target/apache-cxf-2.5.0-SNAPSHOT-src.tar.gz>
[JENKINS] Archiving <https://builds.apache.org/job/CXF-trunk-deploy/ws/trunk/distribution/target/apache-cxf-2.5.0-SNAPSHOT.tar.gz>
to /home/hudson/hudson/jobs/CXF-trunk-deploy/modules/org.apache.cxf$apache-cxf/builds/2011-09-26_06-02-14/archive/org.apache.cxf/apache-cxf/2.5.0-SNAPSHOT/apache-cxf-2.5.0-SNAPSHOT-.tar.gz
[JENKINS] Archiving <https://builds.apache.org/job/CXF-trunk-deploy/ws/trunk/distribution/target/apache-cxf-2.5.0-SNAPSHOT.zip>
to /home/hudson/hudson/jobs/CXF-trunk-deploy/modules/org.apache.cxf$apache-cxf/builds/2011-09-26_06-02-14/archive/org.apache.cxf/apache-cxf/2.5.0-SNAPSHOT/apache-cxf-2.5.0-SNAPSHOT-.zip
[INFO] ------------------------------------------------------------------------
[ERROR] BUILD ERROR
[INFO] ------------------------------------------------------------------------
[INFO] Failed to create assembly: Error creating assembly archive src: Failed to retrieve
numeric file attributes using: '/bin/sh -c ls -1laR <https://builds.apache.org/job/CXF-trunk-deploy/ws/trunk/distribution/..'>

[INFO] ------------------------------------------------------------------------
[INFO] Trace
org.apache.maven.lifecycle.LifecycleExecutionException: Failed to create assembly: Error creating
assembly archive src: Failed to retrieve numeric file attributes using: '/bin/sh -c ls -1laR
<https://builds.apache.org/job/CXF-trunk-deploy/ws/trunk/distribution/..'>
	at org.apache.maven.lifecycle.DefaultLifecycleExecutor.executeGoals(DefaultLifecycleExecutor.java:719)
	at org.apache.maven.lifecycle.DefaultLifecycleExecutor.executeGoalWithLifecycle(DefaultLifecycleExecutor.java:556)
	at org.apache.maven.lifecycle.DefaultLifecycleExecutor.executeGoal(DefaultLifecycleExecutor.java:535)
	at org.apache.maven.lifecycle.DefaultLifecycleExecutor.executeGoalAndHandleFailures(DefaultLifecycleExecutor.java:387)
	at org.apache.maven.lifecycle.DefaultLifecycleExecutor.executeTaskSegments(DefaultLifecycleExecutor.java:348)
	at org.apache.maven.lifecycle.DefaultLifecycleExecutor.execute(DefaultLifecycleExecutor.java:180)
	at org.apache.maven.lifecycle.LifecycleExecutorInterceptor.execute(LifecycleExecutorInterceptor.java:65)
	at org.apache.maven.DefaultMaven.doExecute(DefaultMaven.java:328)
	at org.apache.maven.DefaultMaven.execute(DefaultMaven.java:138)
	at org.apache.maven.cli.MavenCli.main(MavenCli.java:362)
	at sun.reflect.NativeMethodAccessorImpl.invoke0(Native Method)
	at sun.reflect.NativeMethodAccessorImpl.invoke(NativeMethodAccessorImpl.java:39)
	at sun.reflect.DelegatingMethodAccessorImpl.invoke(DelegatingMethodAccessorImpl.java:25)
	at java.lang.reflect.Method.invoke(Method.java:592)
	at org.codehaus.classworlds.Launcher.launchEnhanced(Launcher.java:315)
	at org.codehaus.classworlds.Launcher.launch(Launcher.java:255)
	at hudson.maven.agent.Main.launch(Main.java:185)
	at hudson.maven.MavenBuilder.call(MavenBuilder.java:160)
	at hudson.maven.MavenModuleSetBuild$Builder.call(MavenModuleSetBuild.java:1059)
	at hudson.maven.MavenModuleSetBuild$Builder.call(MavenModuleSetBuild.java:990)
	at hudson.remoting.UserRequest.perform(UserRequest.java:118)
	at hudson.remoting.UserRequest.perform(UserRequest.java:48)
	at hudson.remoting.Request$2.run(Request.java:287)
	at java.util.concurrent.Executors$RunnableAdapter.call(Executors.java:417)
	at java.util.concurrent.FutureTask$Sync.innerRun(FutureTask.java:269)
	at java.util.concurrent.FutureTask.run(FutureTask.java:123)
	at java.util.concurrent.ThreadPoolExecutor$Worker.runTask(ThreadPoolExecutor.java:651)
	at java.util.concurrent.ThreadPoolExecutor$Worker.run(ThreadPoolExecutor.java:676)
	at java.lang.Thread.run(Thread.java:595)
Caused by: org.apache.maven.plugin.MojoExecutionException: Failed to create assembly: Error
creating assembly archive src: Failed to retrieve numeric file attributes using: '/bin/sh
-c ls -1laR <https://builds.apache.org/job/CXF-trunk-deploy/ws/trunk/distribution/..'>
	at org.apache.maven.plugin.assembly.mojos.AbstractAssemblyMojo.execute(AbstractAssemblyMojo.java:429)
	at org.apache.maven.plugin.DefaultPluginManager.executeMojo(DefaultPluginManager.java:490)
	at hudson.maven.agent.PluginManagerInterceptor.executeMojo(PluginManagerInterceptor.java:182)
	at org.apache.maven.lifecycle.DefaultLifecycleExecutor.executeGoals(DefaultLifecycleExecutor.java:694)
	... 28 more
Caused by: org.apache.maven.plugin.assembly.archive.ArchiveCreationException: Error creating
assembly archive src: Failed to retrieve numeric file attributes using: '/bin/sh -c ls -1laR
<https://builds.apache.org/job/CXF-trunk-deploy/ws/trunk/distribution/..'>
	at org.apache.maven.plugin.assembly.archive.DefaultAssemblyArchiver.createArchive(DefaultAssemblyArchiver.java:197)
	at org.apache.maven.plugin.assembly.mojos.AbstractAssemblyMojo.execute(AbstractAssemblyMojo.java:378)
	... 31 more
Caused by: org.codehaus.plexus.archiver.ArchiverException: Failed to retrieve numeric file
attributes using: '/bin/sh -c ls -1laR <https://builds.apache.org/job/CXF-trunk-deploy/ws/trunk/distribution/..'>
	at org.codehaus.plexus.archiver.AbstractArchiver$1.hasNext(AbstractArchiver.java:427)
	at org.codehaus.plexus.archiver.AbstractArchiver$1.hasNext(AbstractArchiver.java:453)
	at org.codehaus.plexus.archiver.tar.TarArchiver.execute(TarArchiver.java:196)
	at org.codehaus.plexus.archiver.AbstractArchiver.createArchive(AbstractArchiver.java:852)
	at org.apache.maven.plugin.assembly.archive.archiver.AssemblyProxyArchiver.createArchive(AssemblyProxyArchiver.java:496)
	at org.apache.maven.plugin.assembly.archive.DefaultAssemblyArchiver.createArchive(DefaultAssemblyArchiver.java:193)
	... 32 more
Caused by: java.io.IOException: Failed to retrieve numeric file attributes using: '/bin/sh
-c ls -1laR <https://builds.apache.org/job/CXF-trunk-deploy/ws/trunk/distribution/..'>
	at org.codehaus.plexus.components.io.attributes.PlexusIoResourceAttributeUtils.executeLs(PlexusIoResourceAttributeUtils.java:281)
	at org.codehaus.plexus.components.io.attributes.PlexusIoResourceAttributeUtils.getFileAttributesByPath(PlexusIoResourceAttributeUtils.java:237)
	at org.codehaus.plexus.components.io.attributes.PlexusIoResourceAttributeUtils.getFileAttributesByPath(PlexusIoResourceAttributeUtils.java:188)
	at org.codehaus.plexus.components.io.resources.PlexusIoFileResourceCollection.getResources(PlexusIoFileResourceCollection.java:175)
	at org.codehaus.plexus.archiver.AbstractArchiver$1.hasNext(AbstractArchiver.java:423)
	... 37 more
[INFO] ------------------------------------------------------------------------
[INFO] Total time: 90 minutes 31 seconds
[INFO] Finished at: Mon Sep 26 07:33:18 UTC 2011
[INFO] Final Memory: 340M/492M
[INFO] ------------------------------------------------------------------------
Waiting for Jenkins to finish collecting data
Sending e-mails to: notifications@cxf.apache.org
channel stopped


Mime
View raw message