cxf-notifications mailing list archives

Site index · List index
Message view « Date » · « Thread »
Top « Date » · « Thread »
From Apache Jenkins Server <jenk...@builds.apache.org>
Subject Build failed in Jenkins: CXF-trunk-deploy » Apache CXF Distribution #659
Date Fri, 23 Sep 2011 06:59:10 GMT
See <https://builds.apache.org/job/CXF-trunk-deploy/org.apache.cxf$apache-cxf/659/changes>

Changes:

[ningjiang] CXF-3815 revert the change as it is no needed

[ningjiang] CXF-3815 Add bin script for wsdl2idl

[ffang] [CXF-3810]exclude ws_security/interopfest example from binary kit

[ffang] [CXF-3323]add description elements in all CXF POM files.

------------------------------------------
[INFO] ------------------------------------------------------------------------
[INFO] Building Apache CXF Distribution
[INFO]    task-segment: [clean, deploy]
[INFO] ------------------------------------------------------------------------
[INFO] [clean:clean {execution: default-clean}]
[INFO] Deleting <https://builds.apache.org/job/CXF-trunk-deploy/org.apache.cxf$apache-cxf/ws/target>
[INFO] [checkstyle:checkstyle {execution: validate}]
[INFO] [cxf-xml2fastinfoset:xml2fastinfoset {execution: xml2fastinfoset}]
[INFO] [dependency:copy {execution: add-jars}]
[INFO] Configured Artifact: org.apache.cxf:cxf-integration-jca:2.5.0-SNAPSHOT:jar
[INFO] snapshot org.apache.cxf:cxf-integration-jca:2.5.0-SNAPSHOT: checking for updates from
apache.snapshots
[INFO] Configured Artifact: javax.xml.bind:jaxb-api:2.2.3:jar
[INFO] Configured Artifact: org.apache.geronimo.specs:geronimo-jaxws_2.2_spec:1.1:jar
[INFO] Copying cxf-integration-jca-2.5.0-SNAPSHOT.jar to <https://builds.apache.org/job/CXF-trunk-deploy/org.apache.cxf$apache-cxf/ws/target/additional-libs/cxf-integration-jca-2.5.0-SNAPSHOT.jar>
[INFO] Copying jaxb-api-2.2.3.jar to <https://builds.apache.org/job/CXF-trunk-deploy/org.apache.cxf$apache-cxf/ws/target/libs/endorsed/jaxb-api-2.2.3.jar>
[INFO] Copying geronimo-jaxws_2.2_spec-1.1.jar to <https://builds.apache.org/job/CXF-trunk-deploy/org.apache.cxf$apache-cxf/ws/target/libs/endorsed/geronimo-jaxws_2.2_spec-1.1.jar>
[WARNING] DEPRECATED [tasks]: Use target instead
[INFO] [antrun:run {execution: process-sources-xsl}]
[WARNING] Parameter tasks is deprecated, use target instead
[INFO] Executing tasks

main:
[INFO] Executed tasks
[INFO] [remote-resources:process {execution: default}]
Sep 23, 2011 6:49:27 AM org.apache.velocity.runtime.log.JdkLogChute log
INFO: FileResourceLoader : adding path '.'
[INFO] [site:attach-descriptor {execution: default-attach-descriptor}]
[INFO] Preparing source:jar
[WARNING] Removing: jar from forked lifecycle, to prevent recursive invocation.
[JENKINS] Archiving <https://builds.apache.org/job/CXF-trunk-deploy/org.apache.cxf$apache-cxf/ws/pom.xml>
to /home/hudson/hudson/jobs/CXF-trunk-deploy/modules/org.apache.cxf$apache-cxf/builds/2011-09-23_06-05-51/archive/org.apache.cxf/apache-cxf/2.5.0-SNAPSHOT/apache-cxf-2.5.0-SNAPSHOT.pom
[INFO] [checkstyle:checkstyle {execution: validate}]
[INFO] [cxf-xml2fastinfoset:xml2fastinfoset {execution: xml2fastinfoset}]
[INFO] [source:jar {execution: attach-sources}]
[INFO] [javadoc:jar {execution: attach-javadocs}]
[INFO] Not executing Javadoc as the project is not a Java classpath-capable package
[INFO] [dependency:unpack {execution: unpack-javadoc}]
[INFO] Configured Artifact: org.apache.cxf:cxf-api:javadoc:2.5.0-SNAPSHOT:jar
[INFO] Unpacking /home/jenkins/jenkins-slave/workspace/CXF-trunk-deploy/.repository/org/apache/cxf/cxf-api/2.5.0-SNAPSHOT/cxf-api-2.5.0-SNAPSHOT-javadoc.jar
to <https://builds.apache.org/job/CXF-trunk-deploy/org.apache.cxf$apache-cxf/ws/target/javadoc>
with includes "" and excludes ""
[INFO] [assembly:single {execution: distribution-package}]
[INFO] Reading assembly descriptor: src/main/assembly/bin.xml
[INFO] Reading assembly descriptor: src/main/assembly/src.xml
[WARNING] Cannot include project artifact: org.apache.cxf:apache-cxf:pom:2.5.0-SNAPSHOT; it
doesn't have an associated file or directory.
[WARNING] Cannot include project artifact: org.apache.cxf:apache-cxf:pom:2.5.0-SNAPSHOT; it
doesn't have an associated file or directory.
[WARNING] Cannot include project artifact: org.apache.cxf:apache-cxf:pom:2.5.0-SNAPSHOT; it
doesn't have an associated file or directory.
[INFO] Copying files to <https://builds.apache.org/job/CXF-trunk-deploy/org.apache.cxf$apache-cxf/ws/target/apache-cxf-2.5.0-SNAPSHOT>
[WARNING] Assembly file: <https://builds.apache.org/job/CXF-trunk-deploy/org.apache.cxf$apache-cxf/ws/target/apache-cxf-2.5.0-SNAPSHOT>
is not a regular file (it may be a directory). It cannot be attached to the project build
for installation or deployment.
[WARNING] Cannot include project artifact: org.apache.cxf:apache-cxf:pom:2.5.0-SNAPSHOT; it
doesn't have an associated file or directory.
[WARNING] Cannot include project artifact: org.apache.cxf:apache-cxf:pom:2.5.0-SNAPSHOT; it
doesn't have an associated file or directory.
[WARNING] Cannot include project artifact: org.apache.cxf:apache-cxf:pom:2.5.0-SNAPSHOT; it
doesn't have an associated file or directory.
[INFO] Building tar : <https://builds.apache.org/job/CXF-trunk-deploy/org.apache.cxf$apache-cxf/ws/target/apache-cxf-2.5.0-SNAPSHOT.tar.gz>
[WARNING] Cannot include project artifact: org.apache.cxf:apache-cxf:pom:2.5.0-SNAPSHOT; it
doesn't have an associated file or directory.
[WARNING] Cannot include project artifact: org.apache.cxf:apache-cxf:pom:2.5.0-SNAPSHOT; it
doesn't have an associated file or directory.
[WARNING] Cannot include project artifact: org.apache.cxf:apache-cxf:pom:2.5.0-SNAPSHOT; it
doesn't have an associated file or directory.
[INFO] Building zip: <https://builds.apache.org/job/CXF-trunk-deploy/org.apache.cxf$apache-cxf/ws/target/apache-cxf-2.5.0-SNAPSHOT.zip>
[JENKINS] Archiving <https://builds.apache.org/job/CXF-trunk-deploy/org.apache.cxf$apache-cxf/ws/target/apache-cxf-2.5.0-SNAPSHOT.tar.gz>
to /home/hudson/hudson/jobs/CXF-trunk-deploy/modules/org.apache.cxf$apache-cxf/builds/2011-09-23_06-05-51/archive/org.apache.cxf/apache-cxf/2.5.0-SNAPSHOT/apache-cxf-2.5.0-SNAPSHOT-.tar.gz
Sep 23, 2011 6:59:07 AM hudson.remoting.Channel$ReaderThread run
SEVERE: Unexpected error in channel channel
java.lang.OutOfMemoryError: Java heap space
	at java.io.ObjectInputStream.readClassDescriptor(ObjectInputStream.java:788)
	at java.io.ObjectInputStream.readNonProxyDesc(ObjectInputStream.java:1534)
	at java.io.ObjectInputStream.readClassDesc(ObjectInputStream.java:1466)
	at java.io.ObjectInputStream.readNonProxyDesc(ObjectInputStream.java:1552)
	at java.io.ObjectInputStream.readClassDesc(ObjectInputStream.java:1466)
	at java.io.ObjectInputStream.readOrdinaryObject(ObjectInputStream.java:1699)
	at java.io.ObjectInputStream.readObject0(ObjectInputStream.java:1305)
	at java.io.ObjectInputStream.readObject(ObjectInputStream.java:348)
	at hudson.remoting.Channel$ReaderThread.run(Channel.java:1087)
Exception in thread "Channel reader thread: channel" java.lang.OutOfMemoryError: Java heap
space
	at java.io.ObjectInputStream.readClassDescriptor(ObjectInputStream.java:788)
	at java.io.ObjectInputStream.readNonProxyDesc(ObjectInputStream.java:1534)
[INFO] ------------------------------------------------------------------------
[ERROR] BUILD FAILURE
[INFO] ------------------------------------------------------------------------
	at java.io.ObjectInputStream.readClassDesc(ObjectInputStream.java:1466)
	at java.io.ObjectInputStream.readNonProxyDesc(ObjectInputStream.java:1552)
	at java.io.ObjectInputStream.readClassDesc(ObjectInputStream.java:1466)
	at java.io.ObjectInputStream.readOrdinaryObject(ObjectInputStream.java:1699)
	at java.io.ObjectInputStream.readObject0(ObjectInputStream.java:1305)
	at java.io.ObjectInputStream.readObject(ObjectInputStream.java:348)
	at hudson.remoting.Channel$ReaderThread.run(Channel.java:1087)
channel stopped
[INFO] Failed to copy <https://builds.apache.org/job/CXF-trunk-deploy/org.apache.cxf$apache-cxf/ws/target/apache-cxf-2.5.0-SNAPSHOT.tar.gz>
to /home/hudson/hudson/jobs/CXF-trunk-deploy/modules/org.apache.cxf$apache-cxf/builds/2011-09-23_06-05-51/archive/org.apache.cxf/apache-cxf/2.5.0-SNAPSHOT/apache-cxf-2.5.0-SNAPSHOT-.tar.gz
Java heap space
[INFO] ------------------------------------------------------------------------
[INFO] Trace
org.apache.maven.BuildFailureException: Failed to copy <https://builds.apache.org/job/CXF-trunk-deploy/org.apache.cxf$apache-cxf/ws/target/apache-cxf-2.5.0-SNAPSHOT.tar.gz>
to /home/hudson/hudson/jobs/CXF-trunk-deploy/modules/org.apache.cxf$apache-cxf/builds/2011-09-23_06-05-51/archive/org.apache.cxf/apache-cxf/2.5.0-SNAPSHOT/apache-cxf-2.5.0-SNAPSHOT-.tar.gz
	at org.apache.maven.lifecycle.LifecycleExecutorInterceptor.execute(LifecycleExecutorInterceptor.java:73)
	at org.apache.maven.DefaultMaven.doExecute(DefaultMaven.java:328)
	at org.apache.maven.DefaultMaven.execute(DefaultMaven.java:138)
	at org.apache.maven.cli.MavenCli.main(MavenCli.java:362)
	at sun.reflect.NativeMethodAccessorImpl.invoke0(Native Method)
	at sun.reflect.NativeMethodAccessorImpl.invoke(NativeMethodAccessorImpl.java:39)
	at sun.reflect.DelegatingMethodAccessorImpl.invoke(DelegatingMethodAccessorImpl.java:25)
	at java.lang.reflect.Method.invoke(Method.java:592)
	at org.codehaus.classworlds.Launcher.launchEnhanced(Launcher.java:315)
	at org.codehaus.classworlds.Launcher.launch(Launcher.java:255)
	at hudson.maven.agent.Main.launch(Main.java:185)
	at hudson.maven.MavenBuilder.call(MavenBuilder.java:160)
	at hudson.maven.MavenModuleSetBuild$Builder.call(MavenModuleSetBuild.java:1059)
	at hudson.maven.MavenModuleSetBuild$Builder.call(MavenModuleSetBuild.java:990)
	at hudson.remoting.UserRequest.perform(UserRequest.java:118)
	at hudson.remoting.UserRequest.perform(UserRequest.java:48)
	at hudson.remoting.Request$2.run(Request.java:287)
	at java.util.concurrent.Executors$RunnableAdapter.call(Executors.java:417)
	at java.util.concurrent.FutureTask$Sync.innerRun(FutureTask.java:269)
	at java.util.concurrent.FutureTask.run(FutureTask.java:123)
	at java.util.concurrent.ThreadPoolExecutor$Worker.runTask(ThreadPoolExecutor.java:651)
	at java.util.concurrent.ThreadPoolExecutor$Worker.run(ThreadPoolExecutor.java:676)
	at java.lang.Thread.run(Thread.java:595)
Caused by: hudson.util.IOException2: Failed to copy <https://builds.apache.org/job/CXF-trunk-deploy/org.apache.cxf$apache-cxf/ws/target/apache-cxf-2.5.0-SNAPSHOT.tar.gz>
to /home/hudson/hudson/jobs/CXF-trunk-deploy/modules/org.apache.cxf$apache-cxf/builds/2011-09-23_06-05-51/archive/org.apache.cxf/apache-cxf/2.5.0-SNAPSHOT/apache-cxf-2.5.0-SNAPSHOT-.tar.gz
	at hudson.FilePath.copyTo(FilePath.java:1390)
	at hudson.maven.reporters.MavenArtifact.archive(MavenArtifact.java:224)
	at hudson.maven.reporters.MavenArtifactArchiver.postBuild(MavenArtifactArchiver.java:122)
	at hudson.maven.MavenModuleSetBuild$Builder.postModule(MavenModuleSetBuild.java:1109)
	at hudson.maven.MavenBuilder$Adapter.fireLeaveModule(MavenBuilder.java:349)
	at hudson.maven.MavenBuilder$Adapter.postBuild(MavenBuilder.java:307)
	at org.apache.maven.lifecycle.LifecycleExecutorInterceptor.execute(LifecycleExecutorInterceptor.java:68)
	... 22 more
Caused by: hudson.remoting.ChannelClosedException: channel is already closed
	at hudson.remoting.Channel.send(Channel.java:499)
	at hudson.remoting.ProxyOutputStream.doClose(ProxyOutputStream.java:143)
	at hudson.remoting.ProxyOutputStream.close(ProxyOutputStream.java:139)
	at hudson.remoting.RemoteOutputStream.close(RemoteOutputStream.java:118)
	at hudson.FilePath.copyTo(FilePath.java:1387)
	... 28 more
Caused by: java.io.IOException: Unexpected reader termination
	at hudson.remoting.Channel$ReaderThread.run(Channel.java:1124)
Caused by: java.lang.OutOfMemoryError: Java heap space
	at java.io.ObjectInputStream.readClassDescriptor(ObjectInputStream.java:788)
	at java.io.ObjectInputStream.readNonProxyDesc(ObjectInputStream.java:1534)
	at java.io.ObjectInputStream.readClassDesc(ObjectInputStream.java:1466)
	at java.io.ObjectInputStream.readNonProxyDesc(ObjectInputStream.java:1552)
	at java.io.ObjectInputStream.readClassDesc(ObjectInputStream.java:1466)
	at java.io.ObjectInputStream.readOrdinaryObject(ObjectInputStream.java:1699)
	at java.io.ObjectInputStream.readObject0(ObjectInputStream.java:1305)
	at java.io.ObjectInputStream.readObject(ObjectInputStream.java:348)
	at hudson.remoting.Channel$ReaderThread.run(Channel.java:1087)
[INFO] ------------------------------------------------------------------------
[INFO] Total time: 52 minutes 49 seconds
[INFO] Finished at: Fri Sep 23 06:59:07 UTC 2011
[INFO] Final Memory: 340M/493M
[INFO] ------------------------------------------------------------------------


Mime
View raw message