cxf-notifications mailing list archives

Site index · List index
Message view « Date » · « Thread »
Top « Date » · « Thread »
From Apache Jenkins Server <jenk...@builds.apache.org>
Subject Build failed in Jenkins: CXF-Trunk-JDK15 #2275
Date Tue, 02 Aug 2011 20:22:01 GMT
See <https://builds.apache.org/job/CXF-Trunk-JDK15/2275/changes>

Changes:

[sergeyb] [CXF-3510] Better support for addresses with trailing slashes

------------------------------------------
[...truncated 4519 lines...]
Running org.apache.cxf.systest.dispatch.DispatchClientServerTest
{http://schemas.xmlsoap.org/soap/envelope/}Envelope
Tests run: 12, Failures: 0, Errors: 0, Skipped: 0, Time elapsed: 6.135 sec
Running org.apache.cxf.systest.dispatch.DispatchClientServerWithHugeResponseTest
Tests run: 3, Failures: 0, Errors: 0, Skipped: 0, Time elapsed: 4.27 sec
Running org.apache.cxf.systest.dispatch.DispatchClientServerWithMalformedResponseTest
Tests run: 1, Failures: 0, Errors: 0, Skipped: 0, Time elapsed: 4.253 sec
Running org.apache.cxf.systest.dispatch.DispatchXMLClientServerTest
Tests run: 3, Failures: 0, Errors: 0, Skipped: 0, Time elapsed: 4.507 sec
Running org.apache.cxf.systest.handlers.DispatchHandlerInvocationTest
Can not initialize the default wsdl from file:testutils/src/main/resources/wsdl/addNumbers.wsdl
Tests run: 12, Failures: 0, Errors: 0, Skipped: 0, Time elapsed: 5.217 sec
Running org.apache.cxf.systest.handlers.HandlerInvocationTest
Tests run: 35, Failures: 0, Errors: 0, Skipped: 0, Time elapsed: 3.824 sec
Running org.apache.cxf.systest.handlers.HandlerInvocationUsingAddNumbersTest
Tests run: 5, Failures: 0, Errors: 0, Skipped: 0, Time elapsed: 5.197 sec
Running org.apache.cxf.systest.handlers.SpringConfiguredAutoRewriteSoapAddressTest
portNumber: 34102
class org.apache.cxf.jaxws22.spring.JAXWS22SpringEndpointImpl
Tests run: 1, Failures: 0, Errors: 0, Skipped: 0, Time elapsed: 2.769 sec
Running org.apache.cxf.systest.handlers.SpringConfiguredHandlerTest
Tests run: 1, Failures: 0, Errors: 0, Skipped: 0, Time elapsed: 2.652 sec
Running org.apache.cxf.systest.handlers.SpringConfiguredNoAutoRewriteSoapAddressTest
portNumber: 39193
class org.apache.cxf.jaxws22.spring.JAXWS22SpringEndpointImpl
Tests run: 1, Failures: 0, Errors: 0, Skipped: 0, Time elapsed: 2.754 sec
Running org.apache.cxf.systest.handlers.TrivialSOAPHandlerTest
Tests run: 1, Failures: 0, Errors: 0, Skipped: 0, Time elapsed: 4.623 sec
Running org.apache.cxf.systest.jaxws.AnyClientServerTest
Tests run: 2, Failures: 0, Errors: 0, Skipped: 0, Time elapsed: 4.543 sec
Running org.apache.cxf.systest.jaxws.ClientServerGreeterBaseNoWsdlTest
Tests run: 1, Failures: 0, Errors: 0, Skipped: 0, Time elapsed: 4.541 sec
Running org.apache.cxf.systest.jaxws.ClientServerGreeterBaseTest
Tests run: 1, Failures: 0, Errors: 0, Skipped: 0, Time elapsed: 4.432 sec
Running org.apache.cxf.systest.jaxws.ClientServerGreeterNoWsdlTest
Tests run: 2, Failures: 0, Errors: 0, Skipped: 0, Time elapsed: 1.996 sec
Running org.apache.cxf.systest.jaxws.ClientServerMiscTest
Tests run: 19, Failures: 0, Errors: 0, Skipped: 0, Time elapsed: 18.67 sec
Running org.apache.cxf.systest.jaxws.ClientServerMixedStyleTest
Tests run: 2, Failures: 0, Errors: 0, Skipped: 0, Time elapsed: 5.119 sec
Running org.apache.cxf.systest.jaxws.ClientServerRPCLitDefatulAnnoTest
Tests run: 1, Failures: 0, Errors: 0, Skipped: 0, Time elapsed: 4.024 sec
Running org.apache.cxf.systest.jaxws.ClientServerRPCLitTest
Tests run: 4, Failures: 0, Errors: 0, Skipped: 0, Time elapsed: 4.86 sec
Running org.apache.cxf.systest.jaxws.ClientServerTest
the testNillable is invoked
the testNillable is invoked
Tests run: 29, Failures: 0, Errors: 0, Skipped: 0, Time elapsed: 20.205 sec
Running org.apache.cxf.systest.jaxws.ClientServerXMLTest
Tests run: 7, Failures: 0, Errors: 0, Skipped: 0, Time elapsed: 5.009 sec
Running org.apache.cxf.systest.jaxws.JaxWsClientThreadTest
Tests run: 1, Failures: 0, Errors: 0, Skipped: 0, Time elapsed: 1.533 sec
Running org.apache.cxf.systest.jaxws.JaxWsDynamicClientTest
values length is 2
Got values: [foobar, something]
Tests run: 2, Failures: 0, Errors: 0, Skipped: 0, Time elapsed: 4.23 sec
Running org.apache.cxf.systest.jaxws.JaxwsExecutorTest
Tests run: 1, Failures: 0, Errors: 0, Skipped: 0, Time elapsed: 4.381 sec
Running org.apache.cxf.systest.jaxws.LocatorClientServerTest
Tests run: 4, Failures: 0, Errors: 0, Skipped: 1, Time elapsed: 4.863 sec
Running org.apache.cxf.systest.jaxws.OASISCatalogTest
Tests run: 5, Failures: 0, Errors: 0, Skipped: 0, Time elapsed: 2.035 sec
Running org.apache.cxf.systest.jaxws.SchemaValidationClientServerTest
Tests run: 1, Failures: 0, Errors: 0, Skipped: 0, Time elapsed: 4.711 sec
Running org.apache.cxf.systest.jaxws.beanpostprocessor.BeanPostProcessorTest
Tests run: 1, Failures: 0, Errors: 0, Skipped: 0, Time elapsed: 1.952 sec
Running org.apache.cxf.systest.jaxws.beanpostprocessor.CustomizedfBeanPostProcessorTest
Tests run: 1, Failures: 0, Errors: 0, Skipped: 0, Time elapsed: 1.446 sec
Running org.apache.cxf.systest.jaxws.httpget.JavaFirstHttpGetTest
Tests run: 4, Failures: 0, Errors: 0, Skipped: 0, Time elapsed: 3.12 sec
Running org.apache.cxf.systest.provider.AttachmentProviderXMLClientServerTest
Tests run: 1, Failures: 0, Errors: 0, Skipped: 0, Time elapsed: 1.289 sec
Running org.apache.cxf.systest.provider.ProviderClientServerTest
Return sayHi
Milestone-0
Milestone-1
throwFault
Tests run: 1, Failures: 0, Errors: 0, Skipped: 0, Time elapsed: 2.226 sec
Running org.apache.cxf.systest.provider.ProviderRPCClientServerTest
Tests run: 8, Failures: 0, Errors: 0, Skipped: 0, Time elapsed: 5.318 sec
Running org.apache.cxf.systest.provider.ProviderXMLClientServerTest
Tests run: 2, Failures: 0, Errors: 0, Skipped: 0, Time elapsed: 4.225 sec
Running org.apache.cxf.systest.provider.datasource.DataSourceProviderTest
Tests run: 2, Failures: 0, Errors: 0, Skipped: 0, Time elapsed: 1.296 sec
Running org.apache.cxf.systest.swa.ClientServerSwaTest
Tests run: 6, Failures: 0, Errors: 0, Skipped: 0, Time elapsed: 2.457 sec

Results :

Tests run: 183, Failures: 0, Errors: 0, Skipped: 1

[JENKINS] Recording test results
[INFO] [jar:jar {execution: default-jar}]
[INFO] Building jar: <https://builds.apache.org/job/CXF-Trunk-JDK15/ws/trunk/systests/jaxws/target/cxf-systests-jaxws-2.5.0-SNAPSHOT.jar>
[INFO] [jar:test-jar {execution: attach-sources}]
[INFO] Building jar: <https://builds.apache.org/job/CXF-Trunk-JDK15/ws/trunk/systests/jaxws/target/cxf-systests-jaxws-2.5.0-SNAPSHOT-tests.jar>
[INFO] [install:install {execution: default-install}]
[INFO] Installing <https://builds.apache.org/job/CXF-Trunk-JDK15/ws/trunk/systests/jaxws/target/cxf-systests-jaxws-2.5.0-SNAPSHOT.jar>
to <https://builds.apache.org/job/CXF-Trunk-JDK15/ws/.repository/org/apache/cxf/systests/cxf-systests-jaxws/2.5.0-SNAPSHOT/cxf-systests-jaxws-2.5.0-SNAPSHOT.jar>
[INFO] Installing <https://builds.apache.org/job/CXF-Trunk-JDK15/ws/trunk/systests/jaxws/target/cxf-systests-jaxws-2.5.0-SNAPSHOT-tests.jar>
to <https://builds.apache.org/job/CXF-Trunk-JDK15/ws/.repository/org/apache/cxf/systests/cxf-systests-jaxws/2.5.0-SNAPSHOT/cxf-systests-jaxws-2.5.0-SNAPSHOT-tests.jar>
[JENKINS] Archiving <https://builds.apache.org/job/CXF-Trunk-JDK15/ws/trunk/systests/jaxws/pom.xml>
to /home/hudson/hudson/jobs/CXF-Trunk-JDK15/modules/org.apache.cxf.systests$cxf-systests-jaxws/builds/2011-08-02_19-55-24/archive/org.apache.cxf.systests/cxf-systests-jaxws/2.5.0-SNAPSHOT/cxf-systests-jaxws-2.5.0-SNAPSHOT.pom
[JENKINS] Archiving <https://builds.apache.org/job/CXF-Trunk-JDK15/ws/trunk/systests/jaxws/target/cxf-systests-jaxws-2.5.0-SNAPSHOT.jar>
to /home/hudson/hudson/jobs/CXF-Trunk-JDK15/modules/org.apache.cxf.systests$cxf-systests-jaxws/builds/2011-08-02_19-55-24/archive/org.apache.cxf.systests/cxf-systests-jaxws/2.5.0-SNAPSHOT/cxf-systests-jaxws-2.5.0-SNAPSHOT.jar
[JENKINS] Archiving <https://builds.apache.org/job/CXF-Trunk-JDK15/ws/trunk/systests/jaxws/target/cxf-systests-jaxws-2.5.0-SNAPSHOT-tests.jar>
to /home/hudson/hudson/jobs/CXF-Trunk-JDK15/modules/org.apache.cxf.systests$cxf-systests-jaxws/builds/2011-08-02_19-55-24/archive/org.apache.cxf.systests/cxf-systests-jaxws/2.5.0-SNAPSHOT/cxf-systests-jaxws-2.5.0-SNAPSHOT-tests.jar
[INFO] ------------------------------------------------------------------------
[INFO] Building Apache CXF Databinding System Tests
[INFO]    task-segment: [clean, install]
[INFO] ------------------------------------------------------------------------
[INFO] [clean:clean {execution: default-clean}]
[INFO] Deleting <https://builds.apache.org/job/CXF-Trunk-JDK15/ws/trunk/systests/databinding/target>
[INFO] [cxf-xml2fastinfoset:xml2fastinfoset {execution: xml2fastinfoset}]
[INFO] [remote-resources:process {execution: default}]
Downloading: http://repository.apache.org/snapshots/org/apache/ws/security/wss4j/1.6.2-SNAPSHOT/wss4j-1.6.2-SNAPSHOT.jar
[JENKINS] Archiving <https://builds.apache.org/job/CXF-Trunk-JDK15/ws/trunk/systests/databinding/pom.xml>
to /home/hudson/hudson/jobs/CXF-Trunk-JDK15/modules/org.apache.cxf.systests$cxf-systests-databinding/builds/2011-08-02_19-55-24/archive/org.apache.cxf.systests/cxf-systests-databinding/2.5.0-SNAPSHOT/cxf-systests-databinding-2.5.0-SNAPSHOT.pom
[INFO] ------------------------------------------------------------------------
[ERROR] BUILD ERROR
[INFO] ------------------------------------------------------------------------
[INFO] Failed to resolve artifact.

Error transferring file: Server returned HTTP response code: 503 for URL: http://repository.apache.org/snapshots/org/apache/ws/security/wss4j/1.6.2-SNAPSHOT/wss4j-1.6.2-SNAPSHOT.jar
  org.apache.ws.security:wss4j:jar:1.6.2-SNAPSHOT

from the specified remote repositories:
  central (http://repo1.maven.org/maven2),
  Nexus (http://repository.apache.org/snapshots)

Path to dependency: 
	1) org.apache.cxf.systests:cxf-systests-databinding:jar:2.5.0-SNAPSHOT
	2) org.apache.cxf:cxf-rt-ws-security:jar:2.5.0-SNAPSHOT
	3) org.apache.ws.security:wss4j:jar:1.6.2-SNAPSHOT



[INFO] ------------------------------------------------------------------------
[INFO] Trace
org.apache.maven.lifecycle.LifecycleExecutionException: Failed to resolve dependencies for
one or more projects in the reactor. Reason: Error transferring file: Server returned HTTP
response code: 503 for URL: http://repository.apache.org/snapshots/org/apache/ws/security/wss4j/1.6.2-SNAPSHOT/wss4j-1.6.2-SNAPSHOT.jar
  org.apache.ws.security:wss4j:jar:1.6.2-SNAPSHOT

from the specified remote repositories:
  central (http://repo1.maven.org/maven2),
  Nexus (http://repository.apache.org/snapshots)

Path to dependency: 
	1) org.apache.cxf.systests:cxf-systests-databinding:jar:2.5.0-SNAPSHOT
	2) org.apache.cxf:cxf-rt-ws-security:jar:2.5.0-SNAPSHOT
	3) org.apache.ws.security:wss4j:jar:1.6.2-SNAPSHOT


	at org.apache.maven.lifecycle.DefaultLifecycleExecutor.executeGoals(DefaultLifecycleExecutor.java:719)
	at org.apache.maven.lifecycle.DefaultLifecycleExecutor.executeGoalWithLifecycle(DefaultLifecycleExecutor.java:556)
	at org.apache.maven.lifecycle.DefaultLifecycleExecutor.executeGoal(DefaultLifecycleExecutor.java:535)
	at org.apache.maven.lifecycle.DefaultLifecycleExecutor.executeGoalAndHandleFailures(DefaultLifecycleExecutor.java:387)
	at org.apache.maven.lifecycle.DefaultLifecycleExecutor.executeTaskSegments(DefaultLifecycleExecutor.java:348)
	at org.apache.maven.lifecycle.DefaultLifecycleExecutor.execute(DefaultLifecycleExecutor.java:180)
	at org.apache.maven.lifecycle.LifecycleExecutorInterceptor.execute(LifecycleExecutorInterceptor.java:65)
	at org.apache.maven.DefaultMaven.doExecute(DefaultMaven.java:328)
	at org.apache.maven.DefaultMaven.execute(DefaultMaven.java:138)
	at org.apache.maven.cli.MavenCli.main(MavenCli.java:362)
	at sun.reflect.NativeMethodAccessorImpl.invoke0(Native Method)
	at sun.reflect.NativeMethodAccessorImpl.invoke(NativeMethodAccessorImpl.java:39)
	at sun.reflect.DelegatingMethodAccessorImpl.invoke(DelegatingMethodAccessorImpl.java:25)
	at java.lang.reflect.Method.invoke(Method.java:592)
	at org.codehaus.classworlds.Launcher.launchEnhanced(Launcher.java:315)
	at org.codehaus.classworlds.Launcher.launch(Launcher.java:255)
	at hudson.maven.agent.Main.launch(Main.java:185)
	at hudson.maven.MavenBuilder.call(MavenBuilder.java:164)
	at hudson.maven.MavenModuleSetBuild$Builder.call(MavenModuleSetBuild.java:987)
	at hudson.maven.MavenModuleSetBuild$Builder.call(MavenModuleSetBuild.java:918)
	at hudson.remoting.UserRequest.perform(UserRequest.java:118)
	at hudson.remoting.UserRequest.perform(UserRequest.java:48)
	at hudson.remoting.Request$2.run(Request.java:270)
	at java.util.concurrent.Executors$RunnableAdapter.call(Executors.java:417)
	at java.util.concurrent.FutureTask$Sync.innerRun(FutureTask.java:269)
	at java.util.concurrent.FutureTask.run(FutureTask.java:123)
	at java.util.concurrent.ThreadPoolExecutor$Worker.runTask(ThreadPoolExecutor.java:651)
	at java.util.concurrent.ThreadPoolExecutor$Worker.run(ThreadPoolExecutor.java:676)
	at java.lang.Thread.run(Thread.java:595)
Caused by: org.apache.maven.plugin.MojoExecutionException: Failed to resolve dependencies
for one or more projects in the reactor. Reason: Error transferring file: Server returned
HTTP response code: 503 for URL: http://repository.apache.org/snapshots/org/apache/ws/security/wss4j/1.6.2-SNAPSHOT/wss4j-1.6.2-SNAPSHOT.jar
  org.apache.ws.security:wss4j:jar:1.6.2-SNAPSHOT

from the specified remote repositories:
  central (http://repo1.maven.org/maven2),
  Nexus (http://repository.apache.org/snapshots)

Path to dependency: 
	1) org.apache.cxf.systests:cxf-systests-databinding:jar:2.5.0-SNAPSHOT
	2) org.apache.cxf:cxf-rt-ws-security:jar:2.5.0-SNAPSHOT
	3) org.apache.ws.security:wss4j:jar:1.6.2-SNAPSHOT


	at org.apache.maven.plugin.resources.remote.ProcessRemoteResourcesMojo.resolveProjectArtifacts(ProcessRemoteResourcesMojo.java:721)
	at org.apache.maven.plugin.resources.remote.ProcessRemoteResourcesMojo.getProjects(ProcessRemoteResourcesMojo.java:621)
	at org.apache.maven.plugin.resources.remote.ProcessRemoteResourcesMojo.configureVelocityContext(ProcessRemoteResourcesMojo.java:988)
	at org.apache.maven.plugin.resources.remote.ProcessRemoteResourcesMojo.execute(ProcessRemoteResourcesMojo.java:511)
	at org.apache.maven.plugin.DefaultPluginManager.executeMojo(DefaultPluginManager.java:490)
	at hudson.maven.agent.PluginManagerInterceptor.executeMojo(PluginManagerInterceptor.java:182)
	at org.apache.maven.lifecycle.DefaultLifecycleExecutor.executeGoals(DefaultLifecycleExecutor.java:694)
	... 28 more
Caused by: org.apache.maven.artifact.resolver.ArtifactResolutionException: Error transferring
file: Server returned HTTP response code: 503 for URL: http://repository.apache.org/snapshots/org/apache/ws/security/wss4j/1.6.2-SNAPSHOT/wss4j-1.6.2-SNAPSHOT.jar
  org.apache.ws.security:wss4j:jar:1.6.2-SNAPSHOT

from the specified remote repositories:
  central (http://repo1.maven.org/maven2),
  Nexus (http://repository.apache.org/snapshots)

Path to dependency: 
	1) org.apache.cxf.systests:cxf-systests-databinding:jar:2.5.0-SNAPSHOT
	2) org.apache.cxf:cxf-rt-ws-security:jar:2.5.0-SNAPSHOT
	3) org.apache.ws.security:wss4j:jar:1.6.2-SNAPSHOT


	at org.apache.maven.artifact.resolver.DefaultArtifactResolver.resolve(DefaultArtifactResolver.java:233)
	at org.apache.maven.artifact.resolver.DefaultArtifactResolver.resolve(DefaultArtifactResolver.java:90)
	at org.apache.maven.artifact.resolver.DefaultArtifactResolver$ResolveArtifactTask.resolveArtifact(DefaultArtifactResolver.java:456)
	at org.apache.maven.artifact.resolver.DefaultArtifactResolver$ResolveArtifactTask.run(DefaultArtifactResolver.java:433)
	at hidden.edu.emory.mathcs.backport.java.util.concurrent.ThreadPoolExecutor.runWorker(ThreadPoolExecutor.java:1061)
	at hidden.edu.emory.mathcs.backport.java.util.concurrent.ThreadPoolExecutor$Worker.run(ThreadPoolExecutor.java:575)
	... 1 more
Caused by: org.apache.maven.wagon.TransferFailedException: Error transferring file: Server
returned HTTP response code: 503 for URL: http://repository.apache.org/snapshots/org/apache/ws/security/wss4j/1.6.2-SNAPSHOT/wss4j-1.6.2-SNAPSHOT.jar
	at org.apache.maven.wagon.providers.http.LightweightHttpWagon.fillInputData(LightweightHttpWagon.java:143)
	at org.apache.maven.wagon.StreamWagon.getInputStream(StreamWagon.java:116)
	at org.apache.maven.wagon.StreamWagon.getIfNewer(StreamWagon.java:88)
	at org.apache.maven.artifact.manager.DefaultWagonManager.getRemoteFile(DefaultWagonManager.java:530)
	at org.apache.maven.artifact.manager.DefaultWagonManager.getArtifact(DefaultWagonManager.java:427)
	at org.apache.maven.artifact.resolver.DefaultArtifactResolver.resolve(DefaultArtifactResolver.java:212)
	... 6 more
Caused by: java.io.IOException: Server returned HTTP response code: 503 for URL: http://repository.apache.org/snapshots/org/apache/ws/security/wss4j/1.6.2-SNAPSHOT/wss4j-1.6.2-SNAPSHOT.jar
	at sun.reflect.NativeConstructorAccessorImpl.newInstance0(Native Method)
	at sun.reflect.NativeConstructorAccessorImpl.newInstance(NativeConstructorAccessorImpl.java:39)
	at sun.reflect.DelegatingConstructorAccessorImpl.newInstance(DelegatingConstructorAccessorImpl.java:27)
	at java.lang.reflect.Constructor.newInstance(Constructor.java:501)
	at sun.net.www.protocol.http.HttpURLConnection$6.run(HttpURLConnection.java:1250)
	at java.security.AccessController.doPrivileged(Native Method)
	at sun.net.www.protocol.http.HttpURLConnection.getChainedException(HttpURLConnection.java:1244)
	at sun.net.www.protocol.http.HttpURLConnection.getInputStream(HttpURLConnection.java:932)
	at org.apache.maven.wagon.providers.http.LightweightHttpWagon.fillInputData(LightweightHttpWagon.java:122)
	... 11 more
Caused by: java.io.IOException: Server returned HTTP response code: 503 for URL: http://repository.apache.org/snapshots/org/apache/ws/security/wss4j/1.6.2-SNAPSHOT/wss4j-1.6.2-SNAPSHOT.jar
	at sun.net.www.protocol.http.HttpURLConnection.getInputStream(HttpURLConnection.java:1196)
	at java.net.HttpURLConnection.getResponseCode(HttpURLConnection.java:367)
	at org.apache.maven.wagon.providers.http.LightweightHttpWagon.fillInputData(LightweightHttpWagon.java:115)
	... 11 more
[INFO] ------------------------------------------------------------------------
[INFO] Total time: 25 minutes 56 seconds
[INFO] Finished at: Tue Aug 02 20:21:51 UTC 2011
[INFO] Final Memory: 227M/299M
[INFO] ------------------------------------------------------------------------
Sending e-mails to: notifications@cxf.apache.org
channel stopped
[locks-and-latches] Releasing all the locks
[locks-and-latches] All the locks released


Mime
View raw message