cxf-notifications mailing list archives

Site index · List index
Message view « Date » · « Thread »
Top « Date » · « Thread »
From Apache Jenkins Server <jenk...@builds.apache.org>
Subject Build failed in Jenkins: CXF-2.4.x #88
Date Thu, 04 Aug 2011 18:30:51 GMT
See <https://builds.apache.org/job/CXF-2.4.x/88/changes>

Changes:

[dkulp] Blocked revisions 1153798,1153825,1153851 via svnmerge

........
  r1153798 | sergeyb | 2011-08-04 05:09:55 -0400 (Thu, 04 Aug 2011) | 1 line
  
  CXF-3661,CXF-3677: Minimizing the duplication to do with getting user names and passwords
........
  r1153825 | sergeyb | 2011-08-04 06:10:57 -0400 (Thu, 04 Aug 2011) | 1 line
  
  CXF-3661,CXF-3677: Adding encryption/sig test using shared encryption properties
........
  r1153851 | sergeyb | 2011-08-04 07:28:51 -0400 (Thu, 04 Aug 2011) | 1 line
  
  CXF-3661,CXF-3677: More refactoring to minimize the duplication
........

[dkulp] Recorded merge of revisions 1153820,1153843 via svnmerge from 
https://svn.apache.org/repos/asf/cxf/trunk

........
  r1153820 | coheigea | 2011-08-04 06:02:54 -0400 (Thu, 04 Aug 2011) | 1 line
  
  [CXF-3708] - A validated and transformed SAML Token is not cached in the STSTokenValidator
........
  r1153843 | coheigea | 2011-08-04 06:55:48 -0400 (Thu, 04 Aug 2011) | 1 line
  
  Updating the STSProvider to support SOAP 1.2 faults.
........

[dkulp] Merged revisions 1153930 via svnmerge from 
https://svn.apache.org/repos/asf/cxf/trunk

........
  r1153930 | dkulp | 2011-08-04 13:05:14 -0400 (Thu, 04 Aug 2011) | 1 line
  
  [CXF-3710, CXF-3711] Some client shutdown enhancements and optimizations
........

------------------------------------------
[...truncated 3227 lines...]
-------------------------------------------------------
Running org.apache.cxf.ws.policy.AssertionBuilderRegistryImplTest
Tests run: 1, Failures: 0, Errors: 0, Skipped: 0, Time elapsed: 0.273 sec
Running org.apache.cxf.ws.policy.EffectivePolicyImplTest
Tests run: 9, Failures: 0, Errors: 0, Skipped: 0, Time elapsed: 0.335 sec
Running org.apache.cxf.ws.policy.EndpointPolicyImplTest
Tests run: 10, Failures: 0, Errors: 0, Skipped: 0, Time elapsed: 0.061 sec
Running org.apache.cxf.ws.policy.NormalizeTest
Tests run: 2, Failures: 0, Errors: 0, Skipped: 0, Time elapsed: 0.26 sec
Running org.apache.cxf.ws.policy.PolicyAnnotationTest
Tests run: 1, Failures: 0, Errors: 0, Skipped: 0, Time elapsed: 1.074 sec
Running org.apache.cxf.ws.policy.PolicyBuilderTest
Tests run: 3, Failures: 0, Errors: 0, Skipped: 0, Time elapsed: 0.02 sec
Running org.apache.cxf.ws.policy.PolicyEngineImplInitTest
Tests run: 1, Failures: 0, Errors: 0, Skipped: 0, Time elapsed: 0.385 sec
Running org.apache.cxf.ws.policy.PolicyEngineTest
Tests run: 26, Failures: 0, Errors: 0, Skipped: 0, Time elapsed: 0.061 sec
Running org.apache.cxf.ws.policy.PolicyExtensionsTest
Tests run: 1, Failures: 0, Errors: 0, Skipped: 0, Time elapsed: 0.163 sec
Running org.apache.cxf.ws.policy.PolicyInterceptorProviderRegistryImplTest
[JENKINS] Recording test resultsTests run: 1, Failures: 0, Errors: 0, Skipped: 0, Time elapsed:
0 sec
Running org.apache.cxf.ws.policy.PolicyInterceptorsTest
Tests run: 7, Failures: 0, Errors: 0, Skipped: 0, Time elapsed: 0.086 sec
Running org.apache.cxf.ws.policy.PolicyRegistryImplTest
Tests run: 1, Failures: 0, Errors: 0, Skipped: 0, Time elapsed: 0 sec
Running org.apache.cxf.ws.policy.PolicyVerificationInFaultInterceptorTest
Tests run: 1, Failures: 0, Errors: 0, Skipped: 0, Time elapsed: 0.032 sec
Running org.apache.cxf.ws.policy.PolicyVerificationInInterceptorTest
Tests run: 2, Failures: 0, Errors: 0, Skipped: 0, Time elapsed: 0.015 sec
Running org.apache.cxf.ws.policy.PolicyVerificationOutInterceptorTest
Tests run: 1, Failures: 0, Errors: 0, Skipped: 0, Time elapsed: 0.021 sec
Running org.apache.cxf.ws.policy.attachment.external.DomainExpressionBuilderRegistryTest
Tests run: 2, Failures: 0, Errors: 0, Skipped: 0, Time elapsed: 0.003 sec
Running org.apache.cxf.ws.policy.attachment.external.EndpointReferenceDomainExpressionTest
Tests run: 1, Failures: 0, Errors: 0, Skipped: 0, Time elapsed: 0.012 sec
Running org.apache.cxf.ws.policy.attachment.external.ExternalAttachmentProviderTest
Tests run: 11, Failures: 0, Errors: 0, Skipped: 0, Time elapsed: 0.032 sec
Running org.apache.cxf.ws.policy.attachment.external.PolicyAttachmentTest
Tests run: 6, Failures: 0, Errors: 0, Skipped: 0, Time elapsed: 0.005 sec
Running org.apache.cxf.ws.policy.attachment.reference.ReferenceResolverTest
Tests run: 3, Failures: 0, Errors: 0, Skipped: 0, Time elapsed: 0.027 sec
Running org.apache.cxf.ws.policy.attachment.wsdl11.Wsdl11AttachmentPolicyProviderTest
Tests run: 7, Failures: 0, Errors: 0, Skipped: 0, Time elapsed: 0.381 sec
Running org.apache.cxf.ws.policy.selector.FirstAlternativeSelectorTest
Tests run: 1, Failures: 0, Errors: 0, Skipped: 0, Time elapsed: 0.002 sec
Running org.apache.cxf.ws.policy.selector.MinimalMaximalAlternativeSelectorTest
Tests run: 2, Failures: 0, Errors: 0, Skipped: 0, Time elapsed: 0.002 sec
Running org.apache.cxf.ws.policy.spring.PolicyBeansTest
Tests run: 1, Failures: 0, Errors: 0, Skipped: 0, Time elapsed: 0.068 sec
Running org.apache.cxf.ws.policy.spring.PolicyFeatureTest
Tests run: 1, Failures: 0, Errors: 0, Skipped: 1, Time elapsed: 0 sec

Results :

Tests run: 102, Failures: 0, Errors: 0, Skipped: 1


[INFO] [jar:jar {execution: default-jar}]
[INFO] Building jar: <https://builds.apache.org/job/CXF-2.4.x/ws/2.4.x-fixes/rt/ws/policy/target/cxf-rt-ws-policy-2.4.2-SNAPSHOT.jar>
[INFO] [install:install {execution: default-install}]
[INFO] Installing <https://builds.apache.org/job/CXF-2.4.x/ws/2.4.x-fixes/rt/ws/policy/target/cxf-rt-ws-policy-2.4.2-SNAPSHOT.jar>
to <https://builds.apache.org/job/CXF-2.4.x/ws/.repository/org/apache/cxf/cxf-rt-ws-policy/2.4.2-SNAPSHOT/cxf-rt-ws-policy-2.4.2-SNAPSHOT.jar>
[JENKINS] Archiving <https://builds.apache.org/job/CXF-2.4.x/ws/2.4.x-fixes/rt/ws/policy/pom.xml>
to /home/hudson/hudson/jobs/CXF-2.4.x/modules/org.apache.cxf$cxf-rt-ws-policy/builds/2011-08-04_18-13-11/archive/org.apache.cxf/cxf-rt-ws-policy/2.4.2-SNAPSHOT/cxf-rt-ws-policy-2.4.2-SNAPSHOT.pom
[JENKINS] Archiving <https://builds.apache.org/job/CXF-2.4.x/ws/2.4.x-fixes/rt/ws/policy/target/cxf-rt-ws-policy-2.4.2-SNAPSHOT.jar>
to /home/hudson/hudson/jobs/CXF-2.4.x/modules/org.apache.cxf$cxf-rt-ws-policy/builds/2011-08-04_18-13-11/archive/org.apache.cxf/cxf-rt-ws-policy/2.4.2-SNAPSHOT/cxf-rt-ws-policy-2.4.2-SNAPSHOT.jar
[INFO] ------------------------------------------------------------------------
[INFO] Building Apache CXF Runtime WS Reliable Messaging
[INFO]    task-segment: [clean, install]
[INFO] ------------------------------------------------------------------------
[INFO] [clean:clean {execution: default-clean}]
[INFO] Deleting <https://builds.apache.org/job/CXF-2.4.x/ws/2.4.x-fixes/rt/ws/rm/target>
[INFO] [cxf-xml2fastinfoset:xml2fastinfoset {execution: xml2fastinfoset}]
[INFO] [cxf-xjc:xsdtojava {execution: generate-sources}]
[INFO] [remote-resources:process {execution: default}]
[INFO] [resources:resources {execution: default-resources}]
[INFO] Using 'UTF-8' encoding to copy filtered resources.
[INFO] Copying 3 resources
[INFO] Copying 10 resources
[INFO] skip non existing resourceDirectory <https://builds.apache.org/job/CXF-2.4.x/ws/2.4.x-fixes/rt/ws/rm/src/main/resources-filtered>
[INFO] Copying 1 resource
[INFO] Copying 3 resources
[INFO] [compiler:compile {execution: default-compile}]
[INFO] Compiling 78 source files to <https://builds.apache.org/job/CXF-2.4.x/ws/2.4.x-fixes/rt/ws/rm/target/classes>
[INFO] [resources:testResources {execution: default-testResources}]
[INFO] Using 'UTF-8' encoding to copy filtered resources.
[INFO] Copying 10 resources
[INFO] skip non existing resourceDirectory <https://builds.apache.org/job/CXF-2.4.x/ws/2.4.x-fixes/rt/ws/rm/src/test/resources>
[INFO] skip non existing resourceDirectory <https://builds.apache.org/job/CXF-2.4.x/ws/2.4.x-fixes/rt/ws/rm/target/generated/src/test/resources>
[INFO] Copying 3 resources
[INFO] [compiler:testCompile {execution: default-testCompile}]
[INFO] Compiling 24 source files to <https://builds.apache.org/job/CXF-2.4.x/ws/2.4.x-fixes/rt/ws/rm/target/test-classes>
[INFO] [surefire:test {execution: default-test}]
[INFO] Surefire report directory: <https://builds.apache.org/job/CXF-2.4.x/ws/2.4.x-fixes/rt/ws/rm/target/surefire-reports>

-------------------------------------------------------
 T E S T S
-------------------------------------------------------
Running org.apache.cxf.ws.rm.AbstractEndpointTest
Tests run: 2, Failures: 0, Errors: 0, Skipped: 0, Time elapsed: 0.357 sec
Running org.apache.cxf.ws.rm.AbstractRMInterceptorTest
Tests run: 5, Failures: 0, Errors: 0, Skipped: 0, Time elapsed: 0.096 sec
Running org.apache.cxf.ws.rm.AbstractSequenceTest
Tests run: 1, Failures: 0, Errors: 0, Skipped: 0, Time elapsed: 0.001 sec
Running org.apache.cxf.ws.rm.DestinationSequenceTest
Tests run: 23, Failures: 0, Errors: 0, Skipped: 0, Time elapsed: 2.434 sec
Running org.apache.cxf.ws.rm.DestinationTest
Tests run: 7, Failures: 0, Errors: 0, Skipped: 0, Time elapsed: 0.087 sec
Running org.apache.cxf.ws.rm.ProxyTest
Tests run: 12, Failures: 0, Errors: 0, Skipped: 0, Time elapsed: 0.195 sec
Running org.apache.cxf.ws.rm.RMContextUtilsTest
Tests run: 10, Failures: 0, Errors: 0, Skipped: 0, Time elapsed: 0.01 sec
Running org.apache.cxf.ws.rm.RMEndpointTest
Tests run: 18, Failures: 0, Errors: 0, Skipped: 0, Time elapsed: 0.572 sec
Running org.apache.cxf.ws.rm.RMInInterceptorTest
Tests run: 14, Failures: 0, Errors: 0, Skipped: 0, Time elapsed: 0.074 sec
Running org.apache.cxf.ws.rm.RMManagerConfigurationTest
Tests run: 3, Failures: 0, Errors: 0, Skipped: 0, Time elapsed: 1.162 sec
Running org.apache.cxf.ws.rm.RMManagerTest
Tests run: 19, Failures: 0, Errors: 0, Skipped: 0, Time elapsed: 0.105 sec
Running org.apache.cxf.ws.rm.RMOutInterceptorTest
Tests run: 5, Failures: 0, Errors: 0, Skipped: 0, Time elapsed: 0.028 sec
Running org.apache.cxf.ws.rm.RMUtilsTest
Tests run: 1, Failures: 0, Errors: 0, Skipped: 0, Time elapsed: 0.001 sec
Running org.apache.cxf.ws.rm.ServantTest
Tests run: 1, Failures: 0, Errors: 0, Skipped: 0, Time elapsed: 0.004 sec
Running org.apache.cxf.ws.rm.SourceSequenceTest
Tests run: 8, Failures: 0, Errors: 0, Skipped: 0, Time elapsed: 1.008 sec
Running org.apache.cxf.ws.rm.persistence.PersistenceUtilsTest
Tests run: 1, Failures: 0, Errors: 0, Skipped: 0, Time elapsed: 0.051 sec
Running org.apache.cxf.ws.rm.persistence.RMLargeMessageTest
Tests run: 3, Failures: 0, Errors: 0, Skipped: 0, Time elapsed: 0.002 sec
Running org.apache.cxf.ws.rm.persistence.RMMessageTest
Tests run: 3, Failures: 0, Errors: 0, Skipped: 0, Time elapsed: 0.001 sec
Running org.apache.cxf.ws.rm.persistence.jdbc.RMTxStoreConfigurationTest
Tests run: 1, Failures: 0, Errors: 0, Skipped: 0, Time elapsed: 0.069 sec
Running org.apache.cxf.ws.rm.persistence.jdbc.RMTxStoreTest
Tests run: 11, Failures: 0, Errors: 0, Skipped: 0, Time elapsed: 10.746 sec
Running org.apache.cxf.ws.rm.policy.PolicyUtilsTest
Tests run: 3, Failures: 0, Errors: 0, Skipped: 0, Time elapsed: 0.008 sec
Running org.apache.cxf.ws.rm.soap.RMSoapInterceptorTest
Tests run: 9, Failures: 0, Errors: 0, Skipped: 0, Time elapsed: 0.106 sec
Running org.apache.cxf.ws.rm.soap.RetransmissionQueueImplTest
Tests run: 11, Failures: 0, Errors: 0, Skipped: 0, Time elapsed: 0.039 sec
Running org.apache.cxf.ws.rm.soap.SoapFaultFactoryTest
Tests run: 6, Failures: 0, Errors: 0, Skipped: 0, Time elapsed: 0.096 sec

Results :

Tests run: 177, Failures: 0, Errors: 0, Skipped: 0

[JENKINS] Recording test results
[INFO] [jar:jar {execution: default-jar}]
[INFO] Building jar: <https://builds.apache.org/job/CXF-2.4.x/ws/2.4.x-fixes/rt/ws/rm/target/cxf-rt-ws-rm-2.4.2-SNAPSHOT.jar>
[INFO] [install:install {execution: default-install}]
[INFO] Installing <https://builds.apache.org/job/CXF-2.4.x/ws/2.4.x-fixes/rt/ws/rm/target/cxf-rt-ws-rm-2.4.2-SNAPSHOT.jar>
to <https://builds.apache.org/job/CXF-2.4.x/ws/.repository/org/apache/cxf/cxf-rt-ws-rm/2.4.2-SNAPSHOT/cxf-rt-ws-rm-2.4.2-SNAPSHOT.jar>
[JENKINS] Archiving <https://builds.apache.org/job/CXF-2.4.x/ws/2.4.x-fixes/rt/ws/rm/pom.xml>
to /home/hudson/hudson/jobs/CXF-2.4.x/modules/org.apache.cxf$cxf-rt-ws-rm/builds/2011-08-04_18-13-11/archive/org.apache.cxf/cxf-rt-ws-rm/2.4.2-SNAPSHOT/cxf-rt-ws-rm-2.4.2-SNAPSHOT.pom
[JENKINS] Archiving <https://builds.apache.org/job/CXF-2.4.x/ws/2.4.x-fixes/rt/ws/rm/target/cxf-rt-ws-rm-2.4.2-SNAPSHOT.jar>
to /home/hudson/hudson/jobs/CXF-2.4.x/modules/org.apache.cxf$cxf-rt-ws-rm/builds/2011-08-04_18-13-11/archive/org.apache.cxf/cxf-rt-ws-rm/2.4.2-SNAPSHOT/cxf-rt-ws-rm-2.4.2-SNAPSHOT.jar
[INFO] ------------------------------------------------------------------------
[INFO] Building Apache CXF Runtime WS Security
[INFO]    task-segment: [clean, install]
[INFO] ------------------------------------------------------------------------
[INFO] [clean:clean {execution: default-clean}]
[INFO] Deleting <https://builds.apache.org/job/CXF-2.4.x/ws/2.4.x-fixes/rt/ws/security/target>
[INFO] [dependency:copy {execution: create-endorsed-dir}]
[INFO] Configured Artifact: xerces:xercesImpl:?:jar
[INFO] Configured Artifact: xml-apis:xml-apis:1.3.04:jar
[INFO] Copying xercesImpl-2.9.1.jar to <https://builds.apache.org/job/CXF-2.4.x/ws/2.4.x-fixes/rt/ws/security/target/endorsed/xercesImpl-2.9.1.jar>
[INFO] Copying xml-apis-1.3.04.jar to <https://builds.apache.org/job/CXF-2.4.x/ws/2.4.x-fixes/rt/ws/security/target/endorsed/xml-apis-1.3.04.jar>
[INFO] [cxf-xml2fastinfoset:xml2fastinfoset {execution: xml2fastinfoset}]
[INFO] [cxf-xjc:xsdtojava {execution: generate-sources}]
[INFO] [remote-resources:process {execution: default}]
[INFO] [resources:resources {execution: default-resources}]
[INFO] Using 'UTF-8' encoding to copy filtered resources.
[INFO] Copying 4 resources
[INFO] Copying 2 resources
[INFO] skip non existing resourceDirectory <https://builds.apache.org/job/CXF-2.4.x/ws/2.4.x-fixes/rt/ws/security/src/main/resources-filtered>
[INFO] Copying 1 resource
[INFO] Copying 3 resources
[INFO] [compiler:compile {execution: default-compile}]
[INFO] Compiling 206 source files to <https://builds.apache.org/job/CXF-2.4.x/ws/2.4.x-fixes/rt/ws/security/target/classes>
[INFO] -------------------------------------------------------------
[ERROR] COMPILATION ERROR : 
[INFO] -------------------------------------------------------------
[ERROR] <https://builds.apache.org/job/CXF-2.4.x/ws/2.4.x-fixes/rt/ws/security/src/main/java/org/apache/cxf/ws/security/trust/STSTokenValidator.java>:[73,49]
cannot find symbol
symbol  : method getSignatureValue()
location: class org.apache.ws.security.saml.ext.AssertionWrapper
[INFO] 1 error
[INFO] -------------------------------------------------------------
[JENKINS] Archiving <https://builds.apache.org/job/CXF-2.4.x/ws/2.4.x-fixes/rt/ws/security/pom.xml>
to /home/hudson/hudson/jobs/CXF-2.4.x/modules/org.apache.cxf$cxf-rt-ws-security/builds/2011-08-04_18-13-11/archive/org.apache.cxf/cxf-rt-ws-security/2.4.2-SNAPSHOT/cxf-rt-ws-security-2.4.2-SNAPSHOT.pom
[INFO] ------------------------------------------------------------------------
[ERROR] BUILD FAILURE
[INFO] ------------------------------------------------------------------------
[INFO] Compilation failure
<https://builds.apache.org/job/CXF-2.4.x/ws/2.4.x-fixes/rt/ws/security/src/main/java/org/apache/cxf/ws/security/trust/STSTokenValidator.java>:[73,49]
cannot find symbol
symbol  : method getSignatureValue()
location: class org.apache.ws.security.saml.ext.AssertionWrapper

[INFO] ------------------------------------------------------------------------
[INFO] Trace
org.apache.maven.BuildFailureException: Compilation failure
<https://builds.apache.org/job/CXF-2.4.x/ws/2.4.x-fixes/rt/ws/security/src/main/java/org/apache/cxf/ws/security/trust/STSTokenValidator.java>:[73,49]
cannot find symbol
symbol  : method getSignatureValue()
location: class org.apache.ws.security.saml.ext.AssertionWrapper

	at org.apache.maven.lifecycle.DefaultLifecycleExecutor.executeGoals(DefaultLifecycleExecutor.java:715)
	at org.apache.maven.lifecycle.DefaultLifecycleExecutor.executeGoalWithLifecycle(DefaultLifecycleExecutor.java:556)
	at org.apache.maven.lifecycle.DefaultLifecycleExecutor.executeGoal(DefaultLifecycleExecutor.java:535)
	at org.apache.maven.lifecycle.DefaultLifecycleExecutor.executeGoalAndHandleFailures(DefaultLifecycleExecutor.java:387)
	at org.apache.maven.lifecycle.DefaultLifecycleExecutor.executeTaskSegments(DefaultLifecycleExecutor.java:348)
	at org.apache.maven.lifecycle.DefaultLifecycleExecutor.execute(DefaultLifecycleExecutor.java:180)
	at org.apache.maven.lifecycle.LifecycleExecutorInterceptor.execute(LifecycleExecutorInterceptor.java:65)
	at org.apache.maven.DefaultMaven.doExecute(DefaultMaven.java:328)
	at org.apache.maven.DefaultMaven.execute(DefaultMaven.java:138)
	at org.apache.maven.cli.MavenCli.main(MavenCli.java:362)
	at sun.reflect.NativeMethodAccessorImpl.invoke0(Native Method)
	at sun.reflect.NativeMethodAccessorImpl.invoke(NativeMethodAccessorImpl.java:39)
	at sun.reflect.DelegatingMethodAccessorImpl.invoke(DelegatingMethodAccessorImpl.java:25)
	at java.lang.reflect.Method.invoke(Method.java:592)
	at org.codehaus.classworlds.Launcher.launchEnhanced(Launcher.java:315)
	at org.codehaus.classworlds.Launcher.launch(Launcher.java:255)
	at hudson.maven.agent.Main.launch(Main.java:185)
	at hudson.maven.MavenBuilder.call(MavenBuilder.java:164)
	at hudson.maven.MavenModuleSetBuild$Builder.call(MavenModuleSetBuild.java:987)
	at hudson.maven.MavenModuleSetBuild$Builder.call(MavenModuleSetBuild.java:918)
	at hudson.remoting.UserRequest.perform(UserRequest.java:118)
	at hudson.remoting.UserRequest.perform(UserRequest.java:48)
	at hudson.remoting.Request$2.run(Request.java:270)
	at java.util.concurrent.Executors$RunnableAdapter.call(Executors.java:417)
	at java.util.concurrent.FutureTask$Sync.innerRun(FutureTask.java:269)
	at java.util.concurrent.FutureTask.run(FutureTask.java:123)
	at java.util.concurrent.ThreadPoolExecutor$Worker.runTask(ThreadPoolExecutor.java:651)
	at java.util.concurrent.ThreadPoolExecutor$Worker.run(ThreadPoolExecutor.java:676)
	at java.lang.Thread.run(Thread.java:595)
Caused by: org.apache.maven.plugin.CompilationFailureException: Compilation failure
<https://builds.apache.org/job/CXF-2.4.x/ws/2.4.x-fixes/rt/ws/security/src/main/java/org/apache/cxf/ws/security/trust/STSTokenValidator.java>:[73,49]
cannot find symbol
symbol  : method getSignatureValue()
location: class org.apache.ws.security.saml.ext.AssertionWrapper

	at org.apache.maven.plugin.AbstractCompilerMojo.execute(AbstractCompilerMojo.java:656)
	at org.apache.maven.plugin.CompilerMojo.execute(CompilerMojo.java:128)
	at org.apache.maven.plugin.DefaultPluginManager.executeMojo(DefaultPluginManager.java:490)
	at hudson.maven.agent.PluginManagerInterceptor.executeMojo(PluginManagerInterceptor.java:182)
	at org.apache.maven.lifecycle.DefaultLifecycleExecutor.executeGoals(DefaultLifecycleExecutor.java:694)
	... 28 more
[INFO] ------------------------------------------------------------------------
[INFO] Total time: 16 minutes 32 seconds
[INFO] Finished at: Thu Aug 04 18:30:24 UTC 2011
[INFO] Final Memory: 196M/240M
[INFO] ------------------------------------------------------------------------
Sending e-mails to: notifications@cxf.apache.org
channel stopped


Mime
View raw message