cxf-notifications mailing list archives

Site index · List index
Message view « Date » · « Thread »
Top « Date » · « Thread »
From Apache Jenkins Server <jenk...@builds.apache.org>
Subject Build failed in Jenkins: CXF-2.3.x #451
Date Wed, 24 Aug 2011 15:21:07 GMT
See <https://builds.apache.org/job/CXF-2.3.x/451/changes>

Changes:

[dkulp] Blocked revisions 1161125 via svnmerge

................
  r1161125 | dkulp | 2011-08-24 10:32:05 -0400 (Wed, 24 Aug 2011) | 12 lines
  
  Blocked revisions 1160748,1161045 via svnmerge
  
  ........
    r1160748 | ay | 2011-08-23 11:41:21 -0400 (Tue, 23 Aug 2011) | 1 line
    
    [CXF-3757] jmx instrumentaiton for ws-rm
  ........
    r1161045 | ay | 2011-08-24 06:41:08 -0400 (Wed, 24 Aug 2011) | 1 line
    
    build fix for jdk15 regarding CXF-3757
  ........
................

[dkulp] Merged revisions 1161124 via svnmerge from 
https://svn.us.apache.org/repos/asf/cxf/branches/2.4.x-fixes

................
  r1161124 | dkulp | 2011-08-24 10:31:45 -0400 (Wed, 24 Aug 2011) | 9 lines
  
  Merged revisions 1161122 via svnmerge from 
  https://svn.apache.org/repos/asf/cxf/trunk
  
  ........
    r1161122 | dkulp | 2011-08-24 10:29:24 -0400 (Wed, 24 Aug 2011) | 1 line
    
    Fix some tests that are leaving jetty dirs in /tmp
  ........
................

[dkulp] Merged revisions 1161123 via svnmerge from 
https://svn.us.apache.org/repos/asf/cxf/branches/2.4.x-fixes

................
  r1161123 | dkulp | 2011-08-24 10:30:57 -0400 (Wed, 24 Aug 2011) | 9 lines
  
  Merged revisions 1161048 via svnmerge from 
  https://svn.apache.org/repos/asf/cxf/trunk
  
  ........
    r1161048 | ningjiang | 2011-08-24 07:06:37 -0400 (Wed, 24 Aug 2011) | 1 line
    
    Add git ignore entry for the IntellijIDEA project files
  ........
................

------------------------------------------
[...truncated 1424 lines...]
Running org.apache.cxf.transport.http.HTTPConduitTest
Tests run: 5, Failures: 0, Errors: 0, Skipped: 0, Time elapsed: 0.037 sec
Running org.apache.cxf.transport.http.HTTPConduitURLConnectionTest
Tests run: 4, Failures: 0, Errors: 0, Skipped: 0, Time elapsed: 0.327 sec
Running org.apache.cxf.transport.http.HTTPConduitURLEasyMockTest
Tests run: 7, Failures: 0, Errors: 0, Skipped: 0, Time elapsed: 0.334 sec
Running org.apache.cxf.transport.http.PatternBuilderTest
Tests run: 1, Failures: 0, Errors: 0, Skipped: 0, Time elapsed: 0.002 sec
Running org.apache.cxf.transport.http.gzip.GZIPAcceptEncodingTest
Tests run: 8, Failures: 0, Errors: 0, Skipped: 0, Time elapsed: 0.021 sec
Running org.apache.cxf.transport.http.policy.HTTPClientAssertionBuilderTest
Tests run: 3, Failures: 0, Errors: 0, Skipped: 0, Time elapsed: 0.009 sec
Running org.apache.cxf.transport.http.policy.HTTPServerAssertionBuilderTest
Tests run: 3, Failures: 0, Errors: 0, Skipped: 0, Time elapsed: 0.004 sec
Running org.apache.cxf.transport.http.policy.PolicyUtilsTest
Tests run: 12, Failures: 0, Errors: 0, Skipped: 0, Time elapsed: 0.019 sec
Running org.apache.cxf.transport.https.CertConstraintsTest
Tests run: 1, Failures: 0, Errors: 0, Skipped: 0, Time elapsed: 0.655 sec
Running org.apache.cxf.transport.servlet.AbstractCXFServletTest
Tests run: 7, Failures: 0, Errors: 0, Skipped: 0, Time elapsed: 0.02 sec
Running org.apache.cxf.transport.servlet.ServletControllerTest
Tests run: 10, Failures: 0, Errors: 0, Skipped: 0, Time elapsed: 0.064 sec

Results :

Tests run: 62, Failures: 0, Errors: 0, Skipped: 0

[JENKINS] Recording test results
[INFO] [jar:jar {execution: default-jar}]
[INFO] Building jar: <https://builds.apache.org/job/CXF-2.3.x/ws/2.3.x-fixes/rt/transports/http/target/cxf-rt-transports-http-2.3.7-SNAPSHOT.jar>
[INFO] [install:install {execution: default-install}]
[INFO] Installing <https://builds.apache.org/job/CXF-2.3.x/ws/2.3.x-fixes/rt/transports/http/target/cxf-rt-transports-http-2.3.7-SNAPSHOT.jar>
to <https://builds.apache.org/job/CXF-2.3.x/ws/.repository/org/apache/cxf/cxf-rt-transports-http/2.3.7-SNAPSHOT/cxf-rt-transports-http-2.3.7-SNAPSHOT.jar>
[JENKINS] Archiving <https://builds.apache.org/job/CXF-2.3.x/ws/2.3.x-fixes/rt/transports/http/pom.xml>
to /home/hudson/hudson/jobs/CXF-2.3.x/modules/org.apache.cxf$cxf-rt-transports-http/builds/2011-08-24_15-16-37/archive/org.apache.cxf/cxf-rt-transports-http/2.3.7-SNAPSHOT/cxf-rt-transports-http-2.3.7-SNAPSHOT.pom
[JENKINS] Archiving <https://builds.apache.org/job/CXF-2.3.x/ws/2.3.x-fixes/rt/transports/http/target/cxf-rt-transports-http-2.3.7-SNAPSHOT.jar>
to /home/hudson/hudson/jobs/CXF-2.3.x/modules/org.apache.cxf$cxf-rt-transports-http/builds/2011-08-24_15-16-37/archive/org.apache.cxf/cxf-rt-transports-http/2.3.7-SNAPSHOT/cxf-rt-transports-http-2.3.7-SNAPSHOT.jar
[INFO] ------------------------------------------------------------------------
[INFO] Building Apache CXF Runtime HTTP Jetty Transport
[INFO]    task-segment: [clean, install]
[INFO] ------------------------------------------------------------------------
[INFO] [clean:clean {execution: default-clean}]
[INFO] Deleting <https://builds.apache.org/job/CXF-2.3.x/ws/2.3.x-fixes/rt/transports/http-jetty/target>
[INFO] [cxf-xml2fastinfoset:xml2fastinfoset {execution: xml2fastinfoset}]
[INFO] [cxf-xjc:xsdtojava {execution: generate-sources}]
[INFO] [remote-resources:process {execution: default}]
[INFO] [resources:resources {execution: default-resources}]
[INFO] Using 'UTF-8' encoding to copy filtered resources.
[INFO] Copying 2 resources
[INFO] Copying 6 resources
[INFO] skip non existing resourceDirectory <https://builds.apache.org/job/CXF-2.3.x/ws/2.3.x-fixes/rt/transports/http-jetty/src/main/resources-filtered>
[INFO] Copying 1 resource
[INFO] Copying 3 resources
[INFO] [compiler:compile {execution: default-compile}]
[INFO] Compiling 25 source files to <https://builds.apache.org/job/CXF-2.3.x/ws/2.3.x-fixes/rt/transports/http-jetty/target/classes>
[INFO] [resources:testResources {execution: default-testResources}]
[INFO] Using 'UTF-8' encoding to copy filtered resources.
[INFO] Copying 9 resources
[INFO] skip non existing resourceDirectory <https://builds.apache.org/job/CXF-2.3.x/ws/2.3.x-fixes/rt/transports/http-jetty/src/test/resources>
[INFO] skip non existing resourceDirectory <https://builds.apache.org/job/CXF-2.3.x/ws/2.3.x-fixes/rt/transports/http-jetty/target/generated/src/test/resources>
[INFO] Copying 3 resources
[INFO] [compiler:testCompile {execution: default-testCompile}]
[INFO] Compiling 7 source files to <https://builds.apache.org/job/CXF-2.3.x/ws/2.3.x-fixes/rt/transports/http-jetty/target/test-classes>
[INFO] [surefire:test {execution: default-test}]
[INFO] Surefire report directory: <https://builds.apache.org/job/CXF-2.3.x/ws/2.3.x-fixes/rt/transports/http-jetty/target/surefire-reports>

-------------------------------------------------------
 T E S T S
-------------------------------------------------------
Running org.apache.cxf.transport.http_jetty.JettyContextInspectorTest
Tests run: 1, Failures: 0, Errors: 0, Skipped: 0, Time elapsed: 0.431 sec
Running org.apache.cxf.transport.http_jetty.JettyHTTPDestinationTest
Tests run: 21, Failures: 0, Errors: 0, Skipped: 0, Time elapsed: 0.648 sec
Running org.apache.cxf.transport.http_jetty.JettyHTTPServerEngineFactoryTest
Tests run: 3, Failures: 0, Errors: 0, Skipped: 0, Time elapsed: 1.326 sec
Running org.apache.cxf.transport.http_jetty.JettyHTTPServerEngineTest
Tests run: 8, Failures: 0, Errors: 0, Skipped: 0, Time elapsed: 1.123 sec
Running org.apache.cxf.transport.http_jetty.spring.ApplicationContextTest
Tests run: 3, Failures: 0, Errors: 0, Skipped: 0, Time elapsed: 1.091 sec
Running org.apache.cxf.transport.http_jetty.spring.BeanDefinitionParsersTest
Tests run: 1, Failures: 0, Errors: 0, Skipped: 1, Time elapsed: 0.002 sec

Results :

Tests run: 37, Failures: 0, Errors: 0, Skipped: 1

[JENKINS] Recording test results
[INFO] [jar:jar {execution: default-jar}]
[INFO] Building jar: <https://builds.apache.org/job/CXF-2.3.x/ws/2.3.x-fixes/rt/transports/http-jetty/target/cxf-rt-transports-http-jetty-2.3.7-SNAPSHOT.jar>
[INFO] [install:install {execution: default-install}]
[INFO] Installing <https://builds.apache.org/job/CXF-2.3.x/ws/2.3.x-fixes/rt/transports/http-jetty/target/cxf-rt-transports-http-jetty-2.3.7-SNAPSHOT.jar>
to <https://builds.apache.org/job/CXF-2.3.x/ws/.repository/org/apache/cxf/cxf-rt-transports-http-jetty/2.3.7-SNAPSHOT/cxf-rt-transports-http-jetty-2.3.7-SNAPSHOT.jar>
[JENKINS] Archiving <https://builds.apache.org/job/CXF-2.3.x/ws/2.3.x-fixes/rt/transports/http-jetty/pom.xml>
to /home/hudson/hudson/jobs/CXF-2.3.x/modules/org.apache.cxf$cxf-rt-transports-http-jetty/builds/2011-08-24_15-16-37/archive/org.apache.cxf/cxf-rt-transports-http-jetty/2.3.7-SNAPSHOT/cxf-rt-transports-http-jetty-2.3.7-SNAPSHOT.pom
[JENKINS] Archiving <https://builds.apache.org/job/CXF-2.3.x/ws/2.3.x-fixes/rt/transports/http-jetty/target/cxf-rt-transports-http-jetty-2.3.7-SNAPSHOT.jar>
to /home/hudson/hudson/jobs/CXF-2.3.x/modules/org.apache.cxf$cxf-rt-transports-http-jetty/builds/2011-08-24_15-16-37/archive/org.apache.cxf/cxf-rt-transports-http-jetty/2.3.7-SNAPSHOT/cxf-rt-transports-http-jetty-2.3.7-SNAPSHOT.jar
[INFO] ------------------------------------------------------------------------
[INFO] Building Apache CXF Runtime WS Addressing
[INFO]    task-segment: [clean, install]
[INFO] ------------------------------------------------------------------------
[INFO] [clean:clean {execution: default-clean}]
[INFO] Deleting <https://builds.apache.org/job/CXF-2.3.x/ws/2.3.x-fixes/rt/ws/addr/target>
[INFO] [cxf-xml2fastinfoset:xml2fastinfoset {execution: xml2fastinfoset}]
[INFO] [remote-resources:process {execution: default}]
[INFO] [resources:resources {execution: default-resources}]
[INFO] Using 'UTF-8' encoding to copy filtered resources.
[INFO] Copying 3 resources
[INFO] Copying 7 resources
[INFO] skip non existing resourceDirectory <https://builds.apache.org/job/CXF-2.3.x/ws/2.3.x-fixes/rt/ws/addr/src/main/resources-filtered>
[INFO] Copying 1 resource
[INFO] Copying 3 resources
[INFO] [compiler:compile {execution: default-compile}]
[INFO] Compiling 18 source files to <https://builds.apache.org/job/CXF-2.3.x/ws/2.3.x-fixes/rt/ws/addr/target/classes>
[INFO] [resources:testResources {execution: default-testResources}]
[INFO] Using 'UTF-8' encoding to copy filtered resources.
[INFO] Copying 1 resource
[INFO] skip non existing resourceDirectory <https://builds.apache.org/job/CXF-2.3.x/ws/2.3.x-fixes/rt/ws/addr/src/test/resources>
[INFO] skip non existing resourceDirectory <https://builds.apache.org/job/CXF-2.3.x/ws/2.3.x-fixes/rt/ws/addr/target/generated/src/test/resources>
[INFO] Copying 3 resources
[INFO] [compiler:testCompile {execution: default-testCompile}]
[INFO] Compiling 7 source files to <https://builds.apache.org/job/CXF-2.3.x/ws/2.3.x-fixes/rt/ws/addr/target/test-classes>
[INFO] [surefire:test {execution: default-test}]
[INFO] Surefire report directory: <https://builds.apache.org/job/CXF-2.3.x/ws/2.3.x-fixes/rt/ws/addr/target/surefire-reports>

-------------------------------------------------------
 T E S T S
-------------------------------------------------------
Running org.apache.cxf.ws.addressing.AddressingBuilderImplTest
Tests run: 2, Failures: 0, Errors: 0, Skipped: 0, Time elapsed: 0.198 sec
Running org.apache.cxf.ws.addressing.AddressingBuilderTest
Tests run: 1, Failures: 0, Errors: 0, Skipped: 0, Time elapsed: 0.002 sec
Running org.apache.cxf.ws.addressing.AddressingConstantsImplTest
Tests run: 31, Failures: 0, Errors: 0, Skipped: 0, Time elapsed: 0.032 sec
Running org.apache.cxf.ws.addressing.MAPAggregatorTest
Tests run: 29, Failures: 0, Errors: 0, Skipped: 0, Time elapsed: 0.735 sec
Running org.apache.cxf.ws.addressing.VersionTransformerTest
Tests run: 1, Failures: 0, Errors: 0, Skipped: 0, Time elapsed: 0.665 sec
Running org.apache.cxf.ws.addressing.soap.MAPCodecTest
Tests run: 18, Failures: 0, Errors: 0, Skipped: 0, Time elapsed: 0.141 sec
Running org.apache.cxf.ws.addressing.soap.OneWayDecoupledFaultHandlerTest
Tests run: 1, Failures: 0, Errors: 0, Skipped: 0, Time elapsed: 0.002 sec

Results :

Tests run: 83, Failures: 0, Errors: 0, Skipped: 0

[JENKINS] Recording test results
[INFO] [jar:jar {execution: default-jar}]
[INFO] Building jar: <https://builds.apache.org/job/CXF-2.3.x/ws/2.3.x-fixes/rt/ws/addr/target/cxf-rt-ws-addr-2.3.7-SNAPSHOT.jar>
[INFO] [install:install {execution: default-install}]
[INFO] Installing <https://builds.apache.org/job/CXF-2.3.x/ws/2.3.x-fixes/rt/ws/addr/target/cxf-rt-ws-addr-2.3.7-SNAPSHOT.jar>
to <https://builds.apache.org/job/CXF-2.3.x/ws/.repository/org/apache/cxf/cxf-rt-ws-addr/2.3.7-SNAPSHOT/cxf-rt-ws-addr-2.3.7-SNAPSHOT.jar>
[JENKINS] Archiving <https://builds.apache.org/job/CXF-2.3.x/ws/2.3.x-fixes/rt/ws/addr/pom.xml>
to /home/hudson/hudson/jobs/CXF-2.3.x/modules/org.apache.cxf$cxf-rt-ws-addr/builds/2011-08-24_15-16-37/archive/org.apache.cxf/cxf-rt-ws-addr/2.3.7-SNAPSHOT/cxf-rt-ws-addr-2.3.7-SNAPSHOT.pom
[JENKINS] Archiving <https://builds.apache.org/job/CXF-2.3.x/ws/2.3.x-fixes/rt/ws/addr/target/cxf-rt-ws-addr-2.3.7-SNAPSHOT.jar>
to /home/hudson/hudson/jobs/CXF-2.3.x/modules/org.apache.cxf$cxf-rt-ws-addr/builds/2011-08-24_15-16-37/archive/org.apache.cxf/cxf-rt-ws-addr/2.3.7-SNAPSHOT/cxf-rt-ws-addr-2.3.7-SNAPSHOT.jar
[INFO] ------------------------------------------------------------------------
[INFO] Building Apache CXF Runtime JAX-WS Frontend
[INFO]    task-segment: [clean, install]
[INFO] ------------------------------------------------------------------------
[INFO] [clean:clean {execution: default-clean}]
[INFO] Deleting <https://builds.apache.org/job/CXF-2.3.x/ws/2.3.x-fixes/rt/frontend/jaxws/target>
[INFO] [cxf-xml2fastinfoset:xml2fastinfoset {execution: xml2fastinfoset}]
[INFO] [build-helper:add-source {execution: add-source}]
[INFO] Source directory: <https://builds.apache.org/job/CXF-2.3.x/ws/2.3.x-fixes/rt/frontend/jaxws/src/main/generated>
added.
[INFO] [build-helper:add-source {execution: add-jaxws22-source}]
[INFO] Source directory: <https://builds.apache.org/job/CXF-2.3.x/ws/2.3.x-fixes/rt/frontend/jaxws/src/main/jaxws22>
added.
[INFO] [remote-resources:process {execution: default}]
[INFO] [build-helper:add-resource {execution: add-spi}]
[INFO] [resources:resources {execution: default-resources}]
[INFO] Using 'UTF-8' encoding to copy filtered resources.
[INFO] Copying 11 resources
[INFO] Copying 5 resources
[INFO] skip non existing resourceDirectory <https://builds.apache.org/job/CXF-2.3.x/ws/2.3.x-fixes/rt/frontend/jaxws/src/main/resources-filtered>
[INFO] Copying 1 resource
[INFO] Copying 3 resources
[INFO] Copying 1 resource
[INFO] [compiler:compile {execution: default-compile}]
[INFO] Compiling 146 source files to <https://builds.apache.org/job/CXF-2.3.x/ws/2.3.x-fixes/rt/frontend/jaxws/target/classes>
[INFO] -------------------------------------------------------------
[ERROR] COMPILATION ERROR : 
[INFO] -------------------------------------------------------------
[ERROR] <https://builds.apache.org/job/CXF-2.3.x/ws/2.3.x-fixes/rt/frontend/jaxws/src/main/java/org/apache/cxf/jaxws/DispatchImpl.java>:[298,29]
cannot find symbol
symbol  : method getFeatures()
location: interface org.apache.cxf.Bus
[ERROR] <https://builds.apache.org/job/CXF-2.3.x/ws/2.3.x-fixes/rt/frontend/jaxws/src/main/java/org/apache/cxf/jaxws/DispatchImpl.java>:[300,35]
cannot find symbol
symbol  : method getFeatures()
location: interface org.apache.cxf.Bus
[ERROR] <https://builds.apache.org/job/CXF-2.3.x/ws/2.3.x-fixes/rt/frontend/jaxws/src/main/java/org/apache/cxf/jaxws/DispatchImpl.java>:[299,82]
operator + cannot be applied to int,org.apache.cxf.Bus.getFeatures.size
[ERROR] <https://builds.apache.org/job/CXF-2.3.x/ws/2.3.x-fixes/rt/frontend/jaxws/src/main/java/org/apache/cxf/jaxws/DispatchImpl.java>:[302,48]
cannot find symbol
symbol  : method getFeatures()
location: interface org.apache.cxf.Bus
[INFO] 4 errors 
[INFO] -------------------------------------------------------------
[JENKINS] Archiving <https://builds.apache.org/job/CXF-2.3.x/ws/2.3.x-fixes/rt/frontend/jaxws/pom.xml>
to /home/hudson/hudson/jobs/CXF-2.3.x/modules/org.apache.cxf$cxf-rt-frontend-jaxws/builds/2011-08-24_15-16-37/archive/org.apache.cxf/cxf-rt-frontend-jaxws/2.3.7-SNAPSHOT/cxf-rt-frontend-jaxws-2.3.7-SNAPSHOT.pom
[INFO] ------------------------------------------------------------------------
[ERROR] BUILD FAILURE
[INFO] ------------------------------------------------------------------------
[INFO] Compilation failure

<https://builds.apache.org/job/CXF-2.3.x/ws/2.3.x-fixes/rt/frontend/jaxws/src/main/java/org/apache/cxf/jaxws/DispatchImpl.java>:[298,29]
cannot find symbol
symbol  : method getFeatures()
location: interface org.apache.cxf.Bus
<https://builds.apache.org/job/CXF-2.3.x/ws/2.3.x-fixes/rt/frontend/jaxws/src/main/java/org/apache/cxf/jaxws/DispatchImpl.java>:[300,35]
cannot find symbol
symbol  : method getFeatures()
location: interface org.apache.cxf.Bus
<https://builds.apache.org/job/CXF-2.3.x/ws/2.3.x-fixes/rt/frontend/jaxws/src/main/java/org/apache/cxf/jaxws/DispatchImpl.java>:[299,82]
operator + cannot be applied to int,org.apache.cxf.Bus.getFeatures.size
<https://builds.apache.org/job/CXF-2.3.x/ws/2.3.x-fixes/rt/frontend/jaxws/src/main/java/org/apache/cxf/jaxws/DispatchImpl.java>:[302,48]
cannot find symbol
symbol  : method getFeatures()
location: interface org.apache.cxf.Bus

[INFO] ------------------------------------------------------------------------
[INFO] Trace
org.apache.maven.BuildFailureException: Compilation failure
	at org.apache.maven.lifecycle.DefaultLifecycleExecutor.executeGoals(DefaultLifecycleExecutor.java:715)
	at org.apache.maven.lifecycle.DefaultLifecycleExecutor.executeGoalWithLifecycle(DefaultLifecycleExecutor.java:556)
	at org.apache.maven.lifecycle.DefaultLifecycleExecutor.executeGoal(DefaultLifecycleExecutor.java:535)
	at org.apache.maven.lifecycle.DefaultLifecycleExecutor.executeGoalAndHandleFailures(DefaultLifecycleExecutor.java:387)
	at org.apache.maven.lifecycle.DefaultLifecycleExecutor.executeTaskSegments(DefaultLifecycleExecutor.java:348)
	at org.apache.maven.lifecycle.DefaultLifecycleExecutor.execute(DefaultLifecycleExecutor.java:180)
	at org.apache.maven.lifecycle.LifecycleExecutorInterceptor.execute(LifecycleExecutorInterceptor.java:65)
	at org.apache.maven.DefaultMaven.doExecute(DefaultMaven.java:328)
	at org.apache.maven.DefaultMaven.execute(DefaultMaven.java:138)
	at org.apache.maven.cli.MavenCli.main(MavenCli.java:362)
	at sun.reflect.NativeMethodAccessorImpl.invoke0(Native Method)
	at sun.reflect.NativeMethodAccessorImpl.invoke(NativeMethodAccessorImpl.java:39)
	at sun.reflect.DelegatingMethodAccessorImpl.invoke(DelegatingMethodAccessorImpl.java:25)
	at java.lang.reflect.Method.invoke(Method.java:592)
	at org.codehaus.classworlds.Launcher.launchEnhanced(Launcher.java:315)
	at org.codehaus.classworlds.Launcher.launch(Launcher.java:255)
	at hudson.maven.agent.Main.launch(Main.java:185)
	at hudson.maven.MavenBuilder.call(MavenBuilder.java:160)
	at hudson.maven.MavenModuleSetBuild$Builder.call(MavenModuleSetBuild.java:1064)
	at hudson.maven.MavenModuleSetBuild$Builder.call(MavenModuleSetBuild.java:995)
	at hudson.remoting.UserRequest.perform(UserRequest.java:118)
	at hudson.remoting.UserRequest.perform(UserRequest.java:48)
	at hudson.remoting.Request$2.run(Request.java:287)
	at java.util.concurrent.Executors$RunnableAdapter.call(Executors.java:417)
	at java.util.concurrent.FutureTask$Sync.innerRun(FutureTask.java:269)
	at java.util.concurrent.FutureTask.run(FutureTask.java:123)
	at java.util.concurrent.ThreadPoolExecutor$Worker.runTask(ThreadPoolExecutor.java:651)
	at java.util.concurrent.ThreadPoolExecutor$Worker.run(ThreadPoolExecutor.java:676)
	at java.lang.Thread.run(Thread.java:595)
Caused by: org.apache.maven.plugin.CompilationFailureException: Compilation failure
	at org.apache.maven.plugin.AbstractCompilerMojo.execute(AbstractCompilerMojo.java:656)
	at org.apache.maven.plugin.CompilerMojo.execute(CompilerMojo.java:128)
	at org.apache.maven.plugin.DefaultPluginManager.executeMojo(DefaultPluginManager.java:490)
	at hudson.maven.agent.PluginManagerInterceptor.executeMojo(PluginManagerInterceptor.java:182)
	at org.apache.maven.lifecycle.DefaultLifecycleExecutor.executeGoals(DefaultLifecycleExecutor.java:694)
	... 28 more
[INFO] ------------------------------------------------------------------------
[INFO] Total time: 3 minutes 56 seconds
[INFO] Finished at: Wed Aug 24 15:21:05 UTC 2011
[INFO] Final Memory: 96M/153M
[INFO] ------------------------------------------------------------------------
Sending e-mails to: notifications@cxf.apache.org
Sending e-mails to: notifications@cxf.apache.org
channel stopped


Mime
View raw message