cxf-notifications mailing list archives

Site index · List index
Message view « Date » · « Thread »
Top « Date » · « Thread »
From Apache Jenkins Server <jenk...@builds.apache.org>
Subject Build failed in Jenkins: CXF-2.4-deploy #23
Date Tue, 26 Jul 2011 08:24:51 GMT
See <https://builds.apache.org/job/CXF-2.4-deploy/23/changes>

Changes:

[dkulp] Blocked revisions 1150858 via svnmerge

........
  r1150858 | dkulp | 2011-07-25 15:29:03 -0400 (Mon, 25 Jul 2011) | 1 line
  
  Re-enable a WS-RM test
........

[dkulp] Merged revisions 1150971 via svnmerge from 
https://svn.apache.org/repos/asf/cxf/trunk

........
  r1150971 | dkulp | 2011-07-25 22:29:43 -0400 (Mon, 25 Jul 2011) | 1 line
  
  [CXF-3668] Fix issue with duplicate Poclies added in Java-First approach
........

[dkulp] Merged revisions 1150956 via svnmerge from 
https://svn.apache.org/repos/asf/cxf/trunk

........
  r1150956 | dkulp | 2011-07-25 19:37:36 -0400 (Mon, 25 Jul 2011) | 2 lines
  
  [CXF-3682] remove unused imports
  Patch from Robert Liguori applied
........

[dkulp] Blocked revisions 1150554,1150766 via svnmerge

........
  r1150554 | dsosnoski | 2011-07-25 01:56:11 -0400 (Mon, 25 Jul 2011) | 1 line
  
  Restructure WS-RM code to support multiple RMEndpoints with different protocol variations
for a single logical endpoint, change tests to match new code.
........
  r1150766 | dkulp | 2011-07-25 12:14:54 -0400 (Mon, 25 Jul 2011) | 1 line
  
  Fix checkstyle issues
........

[dkulp] Recorded merge of revisions 1150742-1150743,1150776 via svnmerge from 
https://svn.apache.org/repos/asf/cxf/trunk

........
  r1150742 | coheigea | 2011-07-25 11:13:11 -0400 (Mon, 25 Jul 2011) | 2 lines
  
  Store TLS Peer Certificate principal on the message context in the WS-Security layer
   - Also fixing some failing system tests following an update to WSS4J.
........
  r1150743 | coheigea | 2011-07-25 11:13:42 -0400 (Mon, 25 Jul 2011) | 1 line
  
  Changing around some of the Kerberos types.
........
  r1150776 | coheigea | 2011-07-25 12:43:29 -0400 (Mon, 25 Jul 2011) | 1 line
  
  Added ability to set the lifetime on an STSClient
........

[dkulp] Merged revisions 1150822 via svnmerge from 
https://svn.apache.org/repos/asf/cxf/trunk

........
  r1150822 | dkulp | 2011-07-25 14:20:40 -0400 (Mon, 25 Jul 2011) | 3 lines
  
  [CXF-3684] Move @WebParam(header=true) processing for out-of-band
  headers into the ParameterProcessor which actually knows that it's
  out-of-band and can force the header=true flag there.
........

[dkulp] Merged revisions 1150820 via svnmerge from 
https://svn.apache.org/repos/asf/cxf/trunk

........
  r1150820 | dkulp | 2011-07-25 14:20:20 -0400 (Mon, 25 Jul 2011) | 2 lines
  
  [CXF-3680] Logging locations are hidden with Slf4jLogger
  Patch from Woonsan Ko applied
........

[coheigea] Added ability to set the lifetime on an STSClient

[sergeyb] Merged revisions 1150739 via svnmerge from 
https://svn.apache.org/repos/asf/cxf/trunk

........
  r1150739 | sergeyb | 2011-07-25 16:05:57 +0100 (Mon, 25 Jul 2011) | 1 line
  
  [CXF-3681] More tests from Andi and a fix for PartialXMLStreamReader issue
........

[coheigea] Store TLS Peer Certificate principal on the message context in the WS-Security
layer
 - Also fixing some failing system tests following an update to WSS4J.

[coheigea] Changing around some of the Kerberos types.

------------------------------------------
[...truncated 18313 lines...]
[INFO] ------------------------------------------------------------------------
[INFO] Building Apache CXF Runtime WS Security
[INFO]    task-segment: [clean, deploy]
[INFO] ------------------------------------------------------------------------
Downloading: http://repo1.maven.org/maven2/org/apache/maven/plugins/maven-dependency-plugin/2.3/maven-dependency-plugin-2.3.pom

Downloading: http://repo1.maven.org/maven2/org/apache/maven/plugins/maven-plugins/21/maven-plugins-21.pom

Downloading: http://repo1.maven.org/maven2/org/apache/maven/maven-parent/20/maven-parent-20.pom

Downloading: http://repo1.maven.org/maven2/org/apache/maven/plugins/maven-dependency-plugin/2.3/maven-dependency-plugin-2.3.jar

[INFO] [clean:clean {execution: default-clean}]
Downloading: http://repo1.maven.org/maven2/org/codehaus/plexus/plexus-archiver/2.0/plexus-archiver-2.0.pom

Downloading: http://repo1.maven.org/maven2/org/sonatype/spice/spice-parent/17/spice-parent-17.pom

Downloading: http://repo1.maven.org/maven2/org/sonatype/forge/forge-parent/10/forge-parent-10.pom

Downloading: http://repo1.maven.org/maven2/org/codehaus/plexus/plexus-utils/3.0/plexus-utils-3.0.pom

Downloading: http://repo1.maven.org/maven2/org/codehaus/plexus/plexus-io/2.0/plexus-io-2.0.pom

Downloading: http://repo1.maven.org/maven2/org/apache/maven/shared/file-management/1.2.1/file-management-1.2.1.pom

Downloading: http://repo1.maven.org/maven2/org/apache/maven/shared/maven-shared-components/10/maven-shared-components-10.pom

Downloading: http://repo1.maven.org/maven2/org/apache/maven/maven-parent/9/maven-parent-9.pom

Downloading: http://repo1.maven.org/maven2/org/apache/maven/shared/maven-shared-io/1.1/maven-shared-io-1.1.pom

Downloading: http://repo1.maven.org/maven2/org/codehaus/plexus/plexus-utils/1.4.6/plexus-utils-1.4.6.pom

Downloading: http://repo1.maven.org/maven2/org/apache/maven/shared/maven-dependency-analyzer/1.2/maven-dependency-analyzer-1.2.pom

Downloading: http://repo1.maven.org/maven2/asm/asm/3.0/asm-3.0.pom

Downloading: http://repo1.maven.org/maven2/asm/asm-parent/3.0/asm-parent-3.0.pom

Downloading: http://repo1.maven.org/maven2/org/apache/maven/maven-project/2.0.5/maven-project-2.0.5.pom

Downloading: http://repo1.maven.org/maven2/org/apache/maven/maven/2.0.5/maven-2.0.5.pom

Downloading: http://repo1.maven.org/maven2/org/apache/maven/maven-model/2.0.5/maven-model-2.0.5.pom

Downloading: http://repo1.maven.org/maven2/org/apache/maven/maven-artifact/2.0.5/maven-artifact-2.0.5.pom

Downloading: http://repo1.maven.org/maven2/org/apache/maven/shared/maven-invoker/2.0.11/maven-invoker-2.0.11.pom

Downloading: http://repo1.maven.org/maven2/org/apache/maven/shared/file-management/1.2.1/file-management-1.2.1.jar
Downloading: http://repo1.maven.org/maven2/org/codehaus/plexus/plexus-utils/3.0/plexus-utils-3.0.jar
Downloading: http://repo1.maven.org/maven2/asm/asm/3.0/asm-3.0.jar



Downloading: http://repo1.maven.org/maven2/org/apache/maven/shared/maven-shared-io/1.1/maven-shared-io-1.1.jar
Downloading: http://repo1.maven.org/maven2/org/codehaus/plexus/plexus-archiver/2.0/plexus-archiver-2.0.jar

Downloading: http://repo1.maven.org/maven2/org/apache/maven/shared/maven-dependency-analyzer/1.2/maven-dependency-analyzer-1.2.jar


Downloading: http://repo1.maven.org/maven2/org/codehaus/plexus/plexus-io/2.0/plexus-io-2.0.jar
Downloading: http://repo1.maven.org/maven2/org/apache/maven/shared/maven-invoker/2.0.11/maven-invoker-2.0.11.jar


[INFO] [dependency:copy {execution: create-endorsed-dir}]
[INFO] Configured Artifact: xerces:xercesImpl:?:jar
[INFO] Configured Artifact: xml-apis:xml-apis:1.3.04:jar
[INFO] Copying xercesImpl-2.9.1.jar to <https://builds.apache.org/job/CXF-2.4-deploy/ws/cxf-2.4.x-fixes/rt/ws/security/target/endorsed/xercesImpl-2.9.1.jar>
[INFO] Copying xml-apis-1.3.04.jar to <https://builds.apache.org/job/CXF-2.4-deploy/ws/cxf-2.4.x-fixes/rt/ws/security/target/endorsed/xml-apis-1.3.04.jar>
[INFO] [cxf-xml2fastinfoset:xml2fastinfoset {execution: xml2fastinfoset}]
[INFO] [cxf-xjc:xsdtojava {execution: generate-sources}]
[INFO] [remote-resources:process {execution: default}]
[INFO] snapshot org.apache.ws.security:wss4j:1.6.2-SNAPSHOT: checking for updates from apache.snapshots
[WARNING] repository metadata for: 'snapshot org.apache.ws.security:wss4j:1.6.2-SNAPSHOT'
could not be retrieved from repository: apache.snapshots due to an error: Error transferring
file: Connection timed out
[INFO] Repository 'apache.snapshots' will be blacklisted
Downloading: http://repo1.maven.org/maven2/org/bouncycastle/bcprov-jdk15/1.45/bcprov-jdk15-1.45.pom

Downloading: http://repo1.maven.org/maven2/org/bouncycastle/bcprov-jdk15/1.45/bcprov-jdk15-1.45.jar

[JENKINS] Archiving <https://builds.apache.org/job/CXF-2.4-deploy/ws/cxf-2.4.x-fixes/rt/ws/security/pom.xml>
to /home/hudson/hudson/jobs/CXF-2.4-deploy/modules/org.apache.cxf$cxf-rt-ws-security/builds/2011-07-26_06-27-31/archive/org.apache.cxf/cxf-rt-ws-security/2.4.2-SNAPSHOT/cxf-rt-ws-security-2.4.2-SNAPSHOT.pom
[INFO] ------------------------------------------------------------------------
[ERROR] BUILD ERROR
[INFO] ------------------------------------------------------------------------
[INFO] Failed to resolve artifact.

Missing:
----------
1) org.apache.ws.security:wss4j:jar:1.6.2-SNAPSHOT

  Try downloading the file manually from the project website.

  Then, install it using the command: 
      mvn install:install-file -DgroupId=org.apache.ws.security -DartifactId=wss4j -Dversion=1.6.2-SNAPSHOT
-Dpackaging=jar -Dfile=/path/to/file

  Alternatively, if you host your own repository you can deploy the file there: 
      mvn deploy:deploy-file -DgroupId=org.apache.ws.security -DartifactId=wss4j -Dversion=1.6.2-SNAPSHOT
-Dpackaging=jar -Dfile=/path/to/file -Durl=[url] -DrepositoryId=[id]

  Path to dependency: 
  	1) org.apache.cxf:cxf-rt-ws-security:jar:2.4.2-SNAPSHOT
  	2) org.apache.ws.security:wss4j:jar:1.6.2-SNAPSHOT

----------
1 required artifact is missing.

for artifact: 
  org.apache.cxf:cxf-rt-ws-security:jar:2.4.2-SNAPSHOT

from the specified remote repositories:
  central (http://repo1.maven.org/maven2),
  Nexus (http://repository.apache.org/snapshots)



[INFO] ------------------------------------------------------------------------
[INFO] Trace
org.apache.maven.lifecycle.LifecycleExecutionException: Failed to resolve dependencies for
one or more projects in the reactor. Reason: Missing:
----------
1) org.apache.ws.security:wss4j:jar:1.6.2-SNAPSHOT

  Try downloading the file manually from the project website.

  Then, install it using the command: 
      mvn install:install-file -DgroupId=org.apache.ws.security -DartifactId=wss4j -Dversion=1.6.2-SNAPSHOT
-Dpackaging=jar -Dfile=/path/to/file

  Alternatively, if you host your own repository you can deploy the file there: 
      mvn deploy:deploy-file -DgroupId=org.apache.ws.security -DartifactId=wss4j -Dversion=1.6.2-SNAPSHOT
-Dpackaging=jar -Dfile=/path/to/file -Durl=[url] -DrepositoryId=[id]

  Path to dependency: 
  	1) org.apache.cxf:cxf-rt-ws-security:jar:2.4.2-SNAPSHOT
  	2) org.apache.ws.security:wss4j:jar:1.6.2-SNAPSHOT

----------
1 required artifact is missing.

for artifact: 
  org.apache.cxf:cxf-rt-ws-security:jar:2.4.2-SNAPSHOT

from the specified remote repositories:
  central (http://repo1.maven.org/maven2),
  Nexus (http://repository.apache.org/snapshots)


	at org.apache.maven.lifecycle.DefaultLifecycleExecutor.executeGoals(DefaultLifecycleExecutor.java:719)
	at org.apache.maven.lifecycle.DefaultLifecycleExecutor.executeGoalWithLifecycle(DefaultLifecycleExecutor.java:556)
	at org.apache.maven.lifecycle.DefaultLifecycleExecutor.executeGoal(DefaultLifecycleExecutor.java:535)
	at org.apache.maven.lifecycle.DefaultLifecycleExecutor.executeGoalAndHandleFailures(DefaultLifecycleExecutor.java:387)
	at org.apache.maven.lifecycle.DefaultLifecycleExecutor.executeTaskSegments(DefaultLifecycleExecutor.java:348)
	at org.apache.maven.lifecycle.DefaultLifecycleExecutor.execute(DefaultLifecycleExecutor.java:180)
	at org.apache.maven.lifecycle.LifecycleExecutorInterceptor.execute(LifecycleExecutorInterceptor.java:65)
	at org.apache.maven.DefaultMaven.doExecute(DefaultMaven.java:328)
	at org.apache.maven.DefaultMaven.execute(DefaultMaven.java:138)
	at org.apache.maven.cli.MavenCli.main(MavenCli.java:362)
	at sun.reflect.NativeMethodAccessorImpl.invoke0(Native Method)
	at sun.reflect.NativeMethodAccessorImpl.invoke(NativeMethodAccessorImpl.java:39)
	at sun.reflect.DelegatingMethodAccessorImpl.invoke(DelegatingMethodAccessorImpl.java:25)
	at java.lang.reflect.Method.invoke(Method.java:592)
	at org.codehaus.classworlds.Launcher.launchEnhanced(Launcher.java:315)
	at org.codehaus.classworlds.Launcher.launch(Launcher.java:255)
	at hudson.maven.agent.Main.launch(Main.java:185)
	at hudson.maven.MavenBuilder.call(MavenBuilder.java:164)
	at hudson.maven.MavenModuleSetBuild$Builder.call(MavenModuleSetBuild.java:987)
	at hudson.maven.MavenModuleSetBuild$Builder.call(MavenModuleSetBuild.java:918)
	at hudson.remoting.UserRequest.perform(UserRequest.java:118)
	at hudson.remoting.UserRequest.perform(UserRequest.java:48)
	at hudson.remoting.Request$2.run(Request.java:270)
	at java.util.concurrent.Executors$RunnableAdapter.call(Executors.java:417)
	at java.util.concurrent.FutureTask$Sync.innerRun(FutureTask.java:269)
	at java.util.concurrent.FutureTask.run(FutureTask.java:123)
	at java.util.concurrent.ThreadPoolExecutor$Worker.runTask(ThreadPoolExecutor.java:651)
	at java.util.concurrent.ThreadPoolExecutor$Worker.run(ThreadPoolExecutor.java:676)
	at java.lang.Thread.run(Thread.java:595)
Caused by: org.apache.maven.plugin.MojoExecutionException: Failed to resolve dependencies
for one or more projects in the reactor. Reason: Missing:
----------
1) org.apache.ws.security:wss4j:jar:1.6.2-SNAPSHOT

  Try downloading the file manually from the project website.

  Then, install it using the command: 
      mvn install:install-file -DgroupId=org.apache.ws.security -DartifactId=wss4j -Dversion=1.6.2-SNAPSHOT
-Dpackaging=jar -Dfile=/path/to/file

  Alternatively, if you host your own repository you can deploy the file there: 
      mvn deploy:deploy-file -DgroupId=org.apache.ws.security -DartifactId=wss4j -Dversion=1.6.2-SNAPSHOT
-Dpackaging=jar -Dfile=/path/to/file -Durl=[url] -DrepositoryId=[id]

  Path to dependency: 
  	1) org.apache.cxf:cxf-rt-ws-security:jar:2.4.2-SNAPSHOT
  	2) org.apache.ws.security:wss4j:jar:1.6.2-SNAPSHOT

----------
1 required artifact is missing.

for artifact: 
  org.apache.cxf:cxf-rt-ws-security:jar:2.4.2-SNAPSHOT

from the specified remote repositories:
  central (http://repo1.maven.org/maven2),
  Nexus (http://repository.apache.org/snapshots)


	at org.apache.maven.plugin.resources.remote.ProcessRemoteResourcesMojo.resolveProjectArtifacts(ProcessRemoteResourcesMojo.java:721)
	at org.apache.maven.plugin.resources.remote.ProcessRemoteResourcesMojo.getProjects(ProcessRemoteResourcesMojo.java:621)
	at org.apache.maven.plugin.resources.remote.ProcessRemoteResourcesMojo.configureVelocityContext(ProcessRemoteResourcesMojo.java:988)
	at org.apache.maven.plugin.resources.remote.ProcessRemoteResourcesMojo.execute(ProcessRemoteResourcesMojo.java:511)
	at org.apache.maven.plugin.DefaultPluginManager.executeMojo(DefaultPluginManager.java:490)
	at hudson.maven.agent.PluginManagerInterceptor.executeMojo(PluginManagerInterceptor.java:182)
	at org.apache.maven.lifecycle.DefaultLifecycleExecutor.executeGoals(DefaultLifecycleExecutor.java:694)
	... 28 more
Caused by: org.apache.maven.artifact.resolver.MultipleArtifactsNotFoundException: Missing:
----------
1) org.apache.ws.security:wss4j:jar:1.6.2-SNAPSHOT

  Try downloading the file manually from the project website.

  Then, install it using the command: 
      mvn install:install-file -DgroupId=org.apache.ws.security -DartifactId=wss4j -Dversion=1.6.2-SNAPSHOT
-Dpackaging=jar -Dfile=/path/to/file

  Alternatively, if you host your own repository you can deploy the file there: 
      mvn deploy:deploy-file -DgroupId=org.apache.ws.security -DartifactId=wss4j -Dversion=1.6.2-SNAPSHOT
-Dpackaging=jar -Dfile=/path/to/file -Durl=[url] -DrepositoryId=[id]

  Path to dependency: 
  	1) org.apache.cxf:cxf-rt-ws-security:jar:2.4.2-SNAPSHOT
  	2) org.apache.ws.security:wss4j:jar:1.6.2-SNAPSHOT

----------
1 required artifact is missing.

for artifact: 
  org.apache.cxf:cxf-rt-ws-security:jar:2.4.2-SNAPSHOT

from the specified remote repositories:
  central (http://repo1.maven.org/maven2),
  Nexus (http://repository.apache.org/snapshots)


	at org.apache.maven.artifact.resolver.DefaultArtifactResolver.resolveTransitively(DefaultArtifactResolver.java:360)
	at org.apache.maven.artifact.resolver.DefaultArtifactResolver.resolveTransitively(DefaultArtifactResolver.java:304)
	at org.apache.maven.shared.artifact.resolver.DefaultProjectDependenciesResolver.resolve(DefaultProjectDependenciesResolver.java:140)
	at org.apache.maven.shared.artifact.resolver.DefaultProjectDependenciesResolver.resolve(DefaultProjectDependenciesResolver.java:187)
	at org.apache.maven.plugin.resources.remote.ProcessRemoteResourcesMojo.resolveProjectArtifacts(ProcessRemoteResourcesMojo.java:716)
	... 34 more
[INFO] ------------------------------------------------------------------------
[INFO] Total time: 116 minutes 43 seconds
[INFO] Finished at: Tue Jul 26 08:24:43 UTC 2011
[INFO] Final Memory: 212M/323M
[INFO] ------------------------------------------------------------------------
Sending e-mails to: notifications@cxf.apache.org
channel stopped
[locks-and-latches] Releasing all the locks
[locks-and-latches] All the locks released


Mime
View raw message