cxf-notifications mailing list archives

Site index · List index
Message view « Date » · « Thread »
Top « Date » · « Thread »
From Apache Jenkins Server <jenk...@builds.apache.org>
Subject Build failed in Jenkins: CXF-2.4.x #50
Date Thu, 21 Jul 2011 20:22:39 GMT
See <https://builds.apache.org/job/CXF-2.4.x/50/changes>

Changes:

[dkulp] Blocked revisions 1144394,1144399,1144496,1144519,1144738,1144797-1144798,1144894,1144919,1144965,1145168,1146045,1146672,1147879-1147880,1147913,1149013,1149254
via svnmerge

........
  r1144394 | sergeyb | 2011-07-08 13:29:39 -0400 (Fri, 08 Jul 2011) | 1 line
  
  [CXF-3588] Adding basic jaxrs saml system test over two-way TLS with assertion passed as
a header, refactoring to follow
........
  r1144399 | sergeyb | 2011-07-08 13:38:11 -0400 (Fri, 08 Jul 2011) | 1 line
  
  [CXF-3588] Referencing rs-security system test module
........
  r1144496 | sergeyb | 2011-07-08 16:33:52 -0400 (Fri, 08 Jul 2011) | 1 line
  
  [CXF-3588] Fixing artifact id for systest/rs-security
........
  r1144519 | dkulp | 2011-07-08 17:17:42 -0400 (Fri, 08 Jul 2011) | 1 line
  
  Remove @Override to make it compile on java5
........
  r1144738 | sergeyb | 2011-07-09 16:47:03 -0400 (Sat, 09 Jul 2011) | 1 line
  
  [CXF-3588] Removing duplicate alice.properties
........
  r1144797 | dsosnoski | 2011-07-10 05:27:32 -0400 (Sun, 10 Jul 2011) | 1 line
  
  Merge unused constructor.
........
  r1144798 | dsosnoski | 2011-07-10 05:30:16 -0400 (Sun, 10 Jul 2011) | 1 line
  
  Eliminate unnecessary use of JAXB factory for WS-RM data objects.
........
  r1144894 | sergeyb | 2011-07-10 12:15:42 -0400 (Sun, 10 Jul 2011) | 1 line
  
  [CXF-3588] Trying to figure out why test is failing on JDK 1.5 with extra logging and exception
reporting
........
  r1144919 | sergeyb | 2011-07-10 13:56:42 -0400 (Sun, 10 Jul 2011) | 1 line
  
  [CXF-3588] Adding client-side reporting
........
  r1144965 | sergeyb | 2011-07-10 17:24:08 -0400 (Sun, 10 Jul 2011) | 1 line
  
  [CXF-3588] Adding stack trace
........
  r1145168 | sergeyb | 2011-07-11 09:28:24 -0400 (Mon, 11 Jul 2011) | 1 line
  
  [CXF-3588] Some initial refactoring to do with generalizing deflate/inflate handling and
the way saml tokens can be created/validated
........
  r1146045 | sergeyb | 2011-07-13 10:07:18 -0400 (Wed, 13 Jul 2011) | 1 line
  
  [CXF-3588] Some refactoring of plain SAML interceptors
........
  r1146672 | sergeyb | 2011-07-14 08:49:24 -0400 (Thu, 14 Jul 2011) | 1 line
  
  [CXF-3588] Prototyping some skeleton code to do with various subject confirmation methods
........
  r1147879 | sergeyb | 2011-07-18 09:49:35 -0400 (Mon, 18 Jul 2011) | 1 line
  
  [CXF-3661] Adding system test interceptors which add and extract the signature
........
  r1147880 | sergeyb | 2011-07-18 09:52:25 -0400 (Mon, 18 Jul 2011) | 1 line
  
  Reverting the change to ws-security test client cfg
........
  r1147913 | sergeyb | 2011-07-18 11:00:03 -0400 (Mon, 18 Jul 2011) | 1 line
  
  [CXF-3588] Adding WSSConfig.init call to SamlHeaderOutInterceptor
........
  r1149013 | dkulp | 2011-07-20 23:13:13 -0400 (Wed, 20 Jul 2011) | 1 line
  
  Fix failing unit test
........
  r1149254 | coheigea | 2011-07-21 12:15:35 -0400 (Thu, 21 Jul 2011) | 1 line
  
  Fix for failing JAX-RS system tests.
........

[dkulp] Recorded merge of revisions 1144400,1144873,1149227,1149229-1149231 via svnmerge from

https://svn.apache.org/repos/asf/cxf/trunk

........
  r1144400 | coheigea | 2011-07-08 13:38:51 -0400 (Fri, 08 Jul 2011) | 1 line
  
  [CXF-3624] - BinarySecurityToken validated by STSTokenValidator doesn't satisfy IssuedToken
policy
........
  r1144873 | ema | 2011-07-10 11:04:34 -0400 (Sun, 10 Jul 2011) | 1 line
  
  [CXF-3639]:add test case
........
  r1149227 | coheigea | 2011-07-21 11:37:07 -0400 (Thu, 21 Jul 2011) | 1 line
  
  Added support for the Kerberos Token Profile
........
  r1149229 | coheigea | 2011-07-21 11:37:43 -0400 (Thu, 21 Jul 2011) | 1 line
  
  Added a system test for the Kerberos Token Profile (using a mock).
........
  r1149230 | coheigea | 2011-07-21 11:38:01 -0400 (Thu, 21 Jul 2011) | 1 line
  
  Fixing checkstyle errors.
........
  r1149231 | coheigea | 2011-07-21 11:38:11 -0400 (Thu, 21 Jul 2011) | 1 line
  
  Updating to WSS4J 1.6.2-SNAPSHOT.
........

[dkulp] Merged revisions 1149315 via svnmerge from 
https://svn.apache.org/repos/asf/cxf/trunk

........
  r1149315 | dkulp | 2011-07-21 14:55:07 -0400 (Thu, 21 Jul 2011) | 1 line
  
  [CXF-3676] Mark the mojo's threadsafe
........

[dkulp] Merged revisions 1149313 via svnmerge from 
https://svn.apache.org/repos/asf/cxf/trunk

........
  r1149313 | dkulp | 2011-07-21 14:54:37 -0400 (Thu, 21 Jul 2011) | 1 line
  
  Use the CXF FileUtils to find an appropriate tmp dir
........

[dkulp] Merged revisions 1149276 via svnmerge from 
https://svn.apache.org/repos/asf/cxf/trunk

........
  r1149276 | dkulp | 2011-07-21 13:26:11 -0400 (Thu, 21 Jul 2011) | 1 line
  
  Update a bunch of plugin versions and such.
........

------------------------------------------
[...truncated 3712 lines...]
Tests run: 6, Failures: 0, Errors: 0, Skipped: 0, Time elapsed: 0.101 sec

Results :

Tests run: 177, Failures: 0, Errors: 0, Skipped: 0

[JENKINS] Recording test results
[INFO] [jar:jar {execution: default-jar}]
[INFO] Building jar: <https://builds.apache.org/job/CXF-2.4.x/ws/2.4.x-fixes/rt/ws/rm/target/cxf-rt-ws-rm-2.4.2-SNAPSHOT.jar>
[INFO] [install:install {execution: default-install}]
[INFO] Installing <https://builds.apache.org/job/CXF-2.4.x/ws/2.4.x-fixes/rt/ws/rm/target/cxf-rt-ws-rm-2.4.2-SNAPSHOT.jar>
to <https://builds.apache.org/job/CXF-2.4.x/ws/.repository/org/apache/cxf/cxf-rt-ws-rm/2.4.2-SNAPSHOT/cxf-rt-ws-rm-2.4.2-SNAPSHOT.jar>
[JENKINS] Archiving <https://builds.apache.org/job/CXF-2.4.x/ws/2.4.x-fixes/rt/ws/rm/pom.xml>
to /home/hudson/hudson/jobs/CXF-2.4.x/modules/org.apache.cxf$cxf-rt-ws-rm/builds/2011-07-21_20-13-10/archive/org.apache.cxf/cxf-rt-ws-rm/2.4.2-SNAPSHOT/cxf-rt-ws-rm-2.4.2-SNAPSHOT.pom
[JENKINS] Archiving <https://builds.apache.org/job/CXF-2.4.x/ws/2.4.x-fixes/rt/ws/rm/target/cxf-rt-ws-rm-2.4.2-SNAPSHOT.jar>
to /home/hudson/hudson/jobs/CXF-2.4.x/modules/org.apache.cxf$cxf-rt-ws-rm/builds/2011-07-21_20-13-10/archive/org.apache.cxf/cxf-rt-ws-rm/2.4.2-SNAPSHOT/cxf-rt-ws-rm-2.4.2-SNAPSHOT.jar
[INFO] ------------------------------------------------------------------------
[INFO] Building Apache CXF Runtime WS Security
[INFO]    task-segment: [clean, install]
[INFO] ------------------------------------------------------------------------
Downloading: http://repo1.maven.org/maven2/org/apache/maven/plugins/maven-dependency-plugin/2.3/maven-dependency-plugin-2.3.pom

Downloading: http://repo1.maven.org/maven2/org/apache/maven/plugins/maven-plugins/21/maven-plugins-21.pom

Downloading: http://repo1.maven.org/maven2/org/apache/maven/maven-parent/20/maven-parent-20.pom

Downloading: http://repo1.maven.org/maven2/org/apache/maven/plugins/maven-dependency-plugin/2.3/maven-dependency-plugin-2.3.jar

[INFO] [clean:clean {execution: default-clean}]
[INFO] Deleting <https://builds.apache.org/job/CXF-2.4.x/ws/2.4.x-fixes/rt/ws/security/target>
Downloading: http://repo1.maven.org/maven2/org/codehaus/plexus/plexus-utils/1.5.7/plexus-utils-1.5.7.pom

Downloading: http://repo1.maven.org/maven2/org/codehaus/plexus/plexus-archiver/2.0/plexus-archiver-2.0.pom

Downloading: http://repo1.maven.org/maven2/org/sonatype/spice/spice-parent/17/spice-parent-17.pom

Downloading: http://repo1.maven.org/maven2/org/sonatype/forge/forge-parent/10/forge-parent-10.pom

Downloading: http://repo1.maven.org/maven2/org/codehaus/plexus/plexus-utils/3.0/plexus-utils-3.0.pom

Downloading: http://repo1.maven.org/maven2/org/codehaus/plexus/plexus-io/2.0/plexus-io-2.0.pom

Downloading: http://repo1.maven.org/maven2/org/apache/maven/shared/file-management/1.2.1/file-management-1.2.1.pom

Downloading: http://repo1.maven.org/maven2/org/apache/maven/shared/maven-shared-io/1.1/maven-shared-io-1.1.pom

Downloading: http://repo1.maven.org/maven2/org/apache/maven/shared/maven-dependency-analyzer/1.2/maven-dependency-analyzer-1.2.pom

Downloading: http://repo1.maven.org/maven2/org/apache/maven/shared/maven-common-artifact-filters/1.2/maven-common-artifact-filters-1.2.pom

Downloading: http://repo1.maven.org/maven2/org/apache/maven/maven-model/2.0.8/maven-model-2.0.8.pom

Downloading: http://repo1.maven.org/maven2/org/apache/maven/maven-plugin-api/2.0.8/maven-plugin-api-2.0.8.pom

Downloading: http://repo1.maven.org/maven2/org/apache/maven/shared/maven-invoker/2.0.11/maven-invoker-2.0.11.pom

Downloading: http://repo1.maven.org/maven2/org/codehaus/plexus/plexus-utils/3.0/plexus-utils-3.0.jar
Downloading: http://repo1.maven.org/maven2/org/apache/maven/shared/file-management/1.2.1/file-management-1.2.1.jar


Downloading: http://repo1.maven.org/maven2/org/codehaus/plexus/plexus-archiver/2.0/plexus-archiver-2.0.jar
Downloading: http://repo1.maven.org/maven2/org/apache/maven/shared/maven-shared-io/1.1/maven-shared-io-1.1.jar


Downloading: http://repo1.maven.org/maven2/org/codehaus/plexus/plexus-io/2.0/plexus-io-2.0.jar
Downloading: http://repo1.maven.org/maven2/org/apache/maven/shared/maven-dependency-analyzer/1.2/maven-dependency-analyzer-1.2.jar


Downloading: http://repo1.maven.org/maven2/org/apache/maven/shared/maven-common-artifact-filters/1.2/maven-common-artifact-filters-1.2.jar

Downloading: http://repo1.maven.org/maven2/org/apache/maven/shared/maven-invoker/2.0.11/maven-invoker-2.0.11.jar

[INFO] [dependency:copy {execution: create-endorsed-dir}]
[INFO] Configured Artifact: xerces:xercesImpl:?:jar
[INFO] Configured Artifact: xml-apis:xml-apis:1.3.04:jar
[INFO] Copying xercesImpl-2.9.1.jar to <https://builds.apache.org/job/CXF-2.4.x/ws/2.4.x-fixes/rt/ws/security/target/endorsed/xercesImpl-2.9.1.jar>
[INFO] Copying xml-apis-1.3.04.jar to <https://builds.apache.org/job/CXF-2.4.x/ws/2.4.x-fixes/rt/ws/security/target/endorsed/xml-apis-1.3.04.jar>
[INFO] [cxf-xml2fastinfoset:xml2fastinfoset {execution: xml2fastinfoset}]
[INFO] [cxf-xjc:xsdtojava {execution: generate-sources}]
[INFO] [remote-resources:process {execution: default}]
[INFO] [resources:resources {execution: default-resources}]
[INFO] Using 'UTF-8' encoding to copy filtered resources.
[INFO] Copying 4 resources
[INFO] Copying 2 resources
[INFO] skip non existing resourceDirectory <https://builds.apache.org/job/CXF-2.4.x/ws/2.4.x-fixes/rt/ws/security/src/main/resources-filtered>
[INFO] Copying 1 resource
[INFO] Copying 3 resources
[INFO] [compiler:compile {execution: default-compile}]
[INFO] Compiling 203 source files to <https://builds.apache.org/job/CXF-2.4.x/ws/2.4.x-fixes/rt/ws/security/target/classes>
[INFO] [resources:testResources {execution: default-testResources}]
[INFO] Using 'UTF-8' encoding to copy filtered resources.
[INFO] Copying 0 resource
[INFO] Copying 66 resources
[INFO] skip non existing resourceDirectory <https://builds.apache.org/job/CXF-2.4.x/ws/2.4.x-fixes/rt/ws/security/target/generated/src/test/resources>
[INFO] Copying 3 resources
[INFO] [compiler:testCompile {execution: default-testCompile}]
[INFO] Compiling 25 source files to <https://builds.apache.org/job/CXF-2.4.x/ws/2.4.x-fixes/rt/ws/security/target/test-classes>
[INFO] [surefire:test {execution: default-test}]
[INFO] Surefire report directory: <https://builds.apache.org/job/CXF-2.4.x/ws/2.4.x-fixes/rt/ws/security/target/surefire-reports>

-------------------------------------------------------
 T E S T S
-------------------------------------------------------
Running org.apache.cxf.ws.security.sts.provider.SecurityTokenServiceImplTest
Tests run: 1, Failures: 0, Errors: 0, Skipped: 0, Time elapsed: 0.028 sec
Running org.apache.cxf.ws.security.sts.provider.SecurityTokenServiceProviderTest
Tests run: 1, Failures: 0, Errors: 0, Skipped: 0, Time elapsed: 0 sec
Running org.apache.cxf.ws.security.trust.AuthPolicyValidatingInterceptorTest
Tests run: 1, Failures: 0, Errors: 0, Skipped: 0, Time elapsed: 0.134 sec
Running org.apache.cxf.ws.security.wss4j.CryptoCoverageCheckerTest
Tests run: 7, Failures: 0, Errors: 0, Skipped: 0, Time elapsed: 1.517 sec
Running org.apache.cxf.ws.security.wss4j.PolicyBasedWss4JInOutTest
Tests run: 18, Failures: 0, Errors: 0, Skipped: 0, Time elapsed: 1.37 sec
Running org.apache.cxf.ws.security.wss4j.RoundTripTest
Tests run: 3, Failures: 0, Errors: 0, Skipped: 0, Time elapsed: 0.843 sec
Running org.apache.cxf.ws.security.wss4j.SignatureConfirmationTest
Tests run: 1, Failures: 0, Errors: 0, Skipped: 0, Time elapsed: 0.035 sec
Running org.apache.cxf.ws.security.wss4j.UserNameTokenAuthorizationTest
Tests run: 5, Failures: 0, Errors: 0, Skipped: 0, Time elapsed: 0.303 sec
Running org.apache.cxf.ws.security.wss4j.WSS4JFaultCodeTest
Tests run: 3, Failures: 0, Errors: 0, Skipped: 0, Time elapsed: 1.036 sec
Running org.apache.cxf.ws.security.wss4j.WSS4JInOutTest
Tests run: 10, Failures: 0, Errors: 0, Skipped: 0, Time elapsed: 0.279 sec
Running org.apache.cxf.ws.security.wss4j.WSS4JOutInterceptorTest
Tests run: 6, Failures: 0, Errors: 0, Skipped: 0, Time elapsed: 0.087 sec
Running org.apache.cxf.ws.security.wss4j.saml.PolicyBasedSamlTest
Tests run: 2, Failures: 0, Errors: 0, Skipped: 0, Time elapsed: 1.34 sec
Running org.apache.cxf.ws.security.wss4j.saml.SamlTokenTest
Tests run: 6, Failures: 0, Errors: 0, Skipped: 0, Time elapsed: 0.344 sec

Results :

Tests run: 64, Failures: 0, Errors: 0, Skipped: 0

[JENKINS] Recording test results
[INFO] [jar:jar {execution: default-jar}]
[INFO] Building jar: <https://builds.apache.org/job/CXF-2.4.x/ws/2.4.x-fixes/rt/ws/security/target/cxf-rt-ws-security-2.4.2-SNAPSHOT.jar>
[INFO] [install:install {execution: default-install}]
[INFO] Installing <https://builds.apache.org/job/CXF-2.4.x/ws/2.4.x-fixes/rt/ws/security/target/cxf-rt-ws-security-2.4.2-SNAPSHOT.jar>
to <https://builds.apache.org/job/CXF-2.4.x/ws/.repository/org/apache/cxf/cxf-rt-ws-security/2.4.2-SNAPSHOT/cxf-rt-ws-security-2.4.2-SNAPSHOT.jar>
[JENKINS] Archiving <https://builds.apache.org/job/CXF-2.4.x/ws/2.4.x-fixes/rt/ws/security/pom.xml>
to /home/hudson/hudson/jobs/CXF-2.4.x/modules/org.apache.cxf$cxf-rt-ws-security/builds/2011-07-21_20-13-10/archive/org.apache.cxf/cxf-rt-ws-security/2.4.2-SNAPSHOT/cxf-rt-ws-security-2.4.2-SNAPSHOT.pom
[JENKINS] Archiving <https://builds.apache.org/job/CXF-2.4.x/ws/2.4.x-fixes/rt/ws/security/target/cxf-rt-ws-security-2.4.2-SNAPSHOT.jar>
to /home/hudson/hudson/jobs/CXF-2.4.x/modules/org.apache.cxf$cxf-rt-ws-security/builds/2011-07-21_20-13-10/archive/org.apache.cxf/cxf-rt-ws-security/2.4.2-SNAPSHOT/cxf-rt-ws-security-2.4.2-SNAPSHOT.jar
[INFO] ------------------------------------------------------------------------
[INFO] Building Apache CXF Runtime Web Management
[INFO]    task-segment: [clean, install]
[INFO] ------------------------------------------------------------------------
[INFO] [clean:clean {execution: default-clean}]
[INFO] Deleting <https://builds.apache.org/job/CXF-2.4.x/ws/2.4.x-fixes/rt/management-web/target>
[INFO] [cxf-xml2fastinfoset:xml2fastinfoset {execution: xml2fastinfoset}]
[INFO] [remote-resources:process {execution: default}]
[INFO] [resources:resources {execution: default-resources}]
[INFO] Using 'UTF-8' encoding to copy filtered resources.
[INFO] Copying 15 resources
[INFO] skip non existing resourceDirectory <https://builds.apache.org/job/CXF-2.4.x/ws/2.4.x-fixes/rt/management-web/src/main/resources>
[INFO] skip non existing resourceDirectory <https://builds.apache.org/job/CXF-2.4.x/ws/2.4.x-fixes/rt/management-web/src/main/resources-filtered>
[INFO] skip non existing resourceDirectory <https://builds.apache.org/job/CXF-2.4.x/ws/2.4.x-fixes/rt/management-web/target/generated/src/main/resources>
[INFO] Copying 3 resources
[INFO] [compiler:compile {execution: default-compile}]
[INFO] Compiling 93 source files to <https://builds.apache.org/job/CXF-2.4.x/ws/2.4.x-fixes/rt/management-web/target/war/WEB-INF/classes>
[INFO] [gwt:compile {execution: default}]
[INFO] using GWT jars from project dependencies : 2.0.3
[INFO] auto discovered modules [org.apache.cxf.management.web.browser.LogBrowser]
[INFO] establishing classpath list (scope = compile)
[INFO] Compiling module org.apache.cxf.management.web.browser.LogBrowser
[INFO] [ERROR] Unexpected
[INFO] java.lang.RuntimeException: Unable to write to byte cache
[INFO] 	at com.google.gwt.dev.util.DiskCache.writeByteArray(DiskCache.java:202)
[INFO] 	at com.google.gwt.dev.javac.CompiledClass.<init>(CompiledClass.java:84)
[INFO] 	at com.google.gwt.dev.javac.JdtCompiler$FindTypesInCud.visit(JdtCompiler.java:196)
[INFO] 	at org.eclipse.jdt.internal.compiler.ast.TypeDeclaration.traverse(TypeDeclaration.java:1309)
[INFO] 	at org.eclipse.jdt.internal.compiler.ast.TypeDeclaration.traverse(TypeDeclaration.java:1223)
[INFO] 	at org.eclipse.jdt.internal.compiler.ast.CompilationUnitDeclaration.traverse(CompilationUnitDeclaration.java:687)
[INFO] 	at com.google.gwt.dev.javac.JdtCompiler$CompilerImpl.process(JdtCompiler.java:158)
[INFO] 	at org.eclipse.jdt.internal.compiler.Compiler.compile(Compiler.java:444)
[INFO] 	at com.google.gwt.dev.javac.JdtCompiler.doCompile(JdtCompiler.java:467)
[INFO] 	at com.google.gwt.dev.javac.CompilationStateBuilder$CompileMoreLater.compile(CompilationStateBuilder.java:142)
[INFO] 	at com.google.gwt.dev.javac.CompilationStateBuilder.doBuildFrom(CompilationStateBuilder.java:281)
[INFO] 	at com.google.gwt.dev.javac.CompilationStateBuilder.buildFrom(CompilationStateBuilder.java:182)
[INFO] 	at com.google.gwt.dev.cfg.ModuleDef.getCompilationState(ModuleDef.java:280)
[INFO] 	at com.google.gwt.dev.Precompile.precompile(Precompile.java:502)
[INFO] 	at com.google.gwt.dev.Precompile.precompile(Precompile.java:414)
[INFO] 	at com.google.gwt.dev.Compiler.run(Compiler.java:201)
[INFO] 	at com.google.gwt.dev.Compiler$1.run(Compiler.java:152)
[INFO] 	at com.google.gwt.dev.CompileTaskRunner.doRun(CompileTaskRunner.java:87)
[INFO] 	at com.google.gwt.dev.CompileTaskRunner.runWithAppropriateLogger(CompileTaskRunner.java:81)
[INFO] 	at com.google.gwt.dev.Compiler.main(Compiler.java:159)
[INFO] Caused by: java.io.IOException: No space left on device
[INFO] 	at java.io.RandomAccessFile.writeBytes(Native Method)
[INFO] 	at java.io.RandomAccessFile.write(RandomAccessFile.java:443)
[INFO] 	at com.google.gwt.dev.util.DiskCache.writeByteArray(DiskCache.java:199)
[INFO] 	... 19 more
[JENKINS] Archiving <https://builds.apache.org/job/CXF-2.4.x/ws/2.4.x-fixes/rt/management-web/pom.xml>
to /home/hudson/hudson/jobs/CXF-2.4.x/modules/org.apache.cxf$cxf-rt-management-web/builds/2011-07-21_20-13-10/archive/org.apache.cxf/cxf-rt-management-web/2.4.2-SNAPSHOT/cxf-rt-management-web-2.4.2-SNAPSHOT.pom
[INFO] ------------------------------------------------------------------------
[ERROR] BUILD ERROR
[INFO] ------------------------------------------------------------------------
[INFO] Command [[
/bin/sh -c /x1/jenkins/tools/java/jdk1.5.0_22-32/jre/bin/java -Xmx512m -classpath "<https://builds.apache.org/job/CXF-2.4.x/ws/2.4.x-fixes/rt/management-web/src/main/java">:"<https://builds.apache.org/job/CXF-2.4.x/ws/2.4.x-fixes/rt/management-web/src/main/resources">:"<https://builds.apache.org/job/CXF-2.4.x/ws/2.4.x-fixes/rt/management-web/src/main/resources-filtered">:"<https://builds.apache.org/job/CXF-2.4.x/ws/2.4.x-fixes/rt/management-web/target/generated/src/main/resources">:"<https://builds.apache.org/job/CXF-2.4.x/ws/2.4.x-fixes/rt/management-web/target/maven-shared-archive-resources">:"<https://builds.apache.org/job/CXF-2.4.x/ws/2.4.x-fixes/rt/management-web/target/war/WEB-INF/classes">:"<https://builds.apache.org/job/CXF-2.4.x/ws/.repository/commons-lang/commons-lang/2.6/commons-lang-2.6.jar">:"<https://builds.apache.org/job/CXF-2.4.x/ws/.repository/org/apache/abdera/abdera-core/1.1.2/abdera-core-1.1.2.jar">:"<https://builds.apache.org/job/CXF-2.4.x/ws/.repository/org/apache/abdera/abdera-i18n/1.1.2/abdera-i18n-1.1.2.jar">:"<https://builds.apache.org/job/CXF-2.4.x/ws/.repository/commons-codec/commons-codec/1.4/commons-codec-1.4.jar">:"<https://builds.apache.org/job/CXF-2.4.x/ws/.repository/commons-logging/commons-logging/1.1.1/commons-logging-1.1.1.jar">:"<https://builds.apache.org/job/CXF-2.4.x/ws/.repository/org/apache/abdera/abdera-parser/1.1.2/abdera-parser-1.1.2.jar">:"<https://builds.apache.org/job/CXF-2.4.x/ws/.repository/org/apache/ws/commons/axiom/axiom-impl/1.2.10/axiom-impl-1.2.10.jar">:"<https://builds.apache.org/job/CXF-2.4.x/ws/.repository/org/apache/ws/commons/axiom/axiom-api/1.2.10/axiom-api-1.2.10.jar">:"<https://builds.apache.org/job/CXF-2.4.x/ws/.repository/org/apache/geronimo/specs/geronimo-javamail_1.4_spec/1.7.1/geronimo-javamail_1.4_spec-1.7.1.jar">:"<https://builds.apache.org/job/CXF-2.4.x/ws/.repository/jaxen/jaxen/1.1.1/jaxen-1.1.1.jar">:"<https://builds.apache.org/job/CXF-2.4.x/ws/.repository/org/apache/abdera/abdera-extensions-json/1.1.2/abdera-extensions-json-1.1.2.jar">:"<https://builds.apache.org/job/CXF-2.4.x/ws/.repository/org/apache/abdera/abdera-extensions-main/1.1.2/abdera-extensions-main-1.1.2.jar">:"<https://builds.apache.org/job/CXF-2.4.x/ws/2.4.x-fixes/common/common/target/cxf-common-utilities-2.4.2-SNAPSHOT.jar">:"<https://builds.apache.org/job/CXF-2.4.x/ws/.repository/org/apache/ws/xmlschema/xmlschema-core/2.0/xmlschema-core-2.0.jar">:"<https://builds.apache.org/job/CXF-2.4.x/ws/.repository/org/codehaus/woodstox/woodstox-core-asl/4.1.1/woodstox-core-asl-4.1.1.jar">:"<https://builds.apache.org/job/CXF-2.4.x/ws/.repository/org/codehaus/woodstox/stax2-api/3.1.1/stax2-api-3.1.1.jar">:"<https://builds.apache.org/job/CXF-2.4.x/ws/.repository/org/apache/geronimo/specs/geronimo-stax-api_1.0_spec/1.0.1/geronimo-stax-api_1.0_spec-1.0.1.jar">:"<https://builds.apache.org/job/CXF-2.4.x/ws/.repository/org/apache/geronimo/specs/geronimo-annotation_1.0_spec/1.1.1/geronimo-annotation_1.0_spec-1.1.1.jar">:"<https://builds.apache.org/job/CXF-2.4.x/ws/.repository/javax/xml/bind/jaxb-api/2.2.1/jaxb-api-2.2.1.jar">:"<https://builds.apache.org/job/CXF-2.4.x/ws/2.4.x-fixes/api/target/cxf-api-2.4.2-SNAPSHOT.jar">:"<https://builds.apache.org/job/CXF-2.4.x/ws/.repository/org/apache/neethi/neethi/3.0.0/neethi-3.0.0.jar">:"<https://builds.apache.org/job/CXF-2.4.x/ws/.repository/wsdl4j/wsdl4j/1.6.2/wsdl4j-1.6.2.jar">:"<https://builds.apache.org/job/CXF-2.4.x/ws/.repository/org/apache/geronimo/specs/geronimo-activation_1.1_spec/1.1/geronimo-activation_1.1_spec-1.1.jar">:"<https://builds.apache.org/job/CXF-2.4.x/ws/2.4.x-fixes/rt/core/target/cxf-rt-core-2.4.2-SNAPSHOT.jar">:"<https://builds.apache.org/job/CXF-2.4.x/ws/.repository/com/sun/xml/bind/jaxb-impl/2.2.1.1/jaxb-impl-2.2.1.1.jar">:"<https://builds.apache.org/job/CXF-2.4.x/ws/.repository/org/apache/geronimo/specs/geronimo-servlet_3.0_spec/1.0/geronimo-servlet_3.0_spec-1.0.jar">:"<https://builds.apache.org/job/CXF-2.4.x/ws/.repository/org/springframework/spring-core/3.0.5.RELEASE/spring-core-3.0.5.RELEASE.jar">:"<https://builds.apache.org/job/CXF-2.4.x/ws/.repository/org/springframework/spring-asm/3.0.5.RELEASE/spring-asm-3.0.5.RELEASE.jar">:"<https://builds.apache.org/job/CXF-2.4.x/ws/2.4.x-fixes/rt/management/target/cxf-rt-management-2.4.2-SNAPSHOT.jar">:"<https://builds.apache.org/job/CXF-2.4.x/ws/2.4.x-fixes/rt/frontend/jaxrs/target/cxf-rt-frontend-jaxrs-2.4.2-SNAPSHOT.jar">:"<https://builds.apache.org/job/CXF-2.4.x/ws/.repository/javax/ws/rs/jsr311-api/1.1.1/jsr311-api-1.1.1.jar">:"<https://builds.apache.org/job/CXF-2.4.x/ws/2.4.x-fixes/rt/bindings/xml/target/cxf-rt-bindings-xml-2.4.2-SNAPSHOT.jar">:"<https://builds.apache.org/job/CXF-2.4.x/ws/2.4.x-fixes/rt/transports/http/target/cxf-rt-transports-http-2.4.2-SNAPSHOT.jar">:"<https://builds.apache.org/job/CXF-2.4.x/ws/2.4.x-fixes/rt/transports/common/target/cxf-rt-transports-common-2.4.2-SNAPSHOT.jar">:"<https://builds.apache.org/job/CXF-2.4.x/ws/.repository/org/springframework/spring-web/3.0.5.RELEASE/spring-web-3.0.5.RELEASE.jar">:"<https://builds.apache.org/job/CXF-2.4.x/ws/.repository/aopalliance/aopalliance/1.0/aopalliance-1.0.jar">:"<https://builds.apache.org/job/CXF-2.4.x/ws/.repository/org/springframework/spring-beans/3.0.5.RELEASE/spring-beans-3.0.5.RELEASE.jar">:"<https://builds.apache.org/job/CXF-2.4.x/ws/.repository/org/springframework/spring-context/3.0.5.RELEASE/spring-context-3.0.5.RELEASE.jar">:"<https://builds.apache.org/job/CXF-2.4.x/ws/.repository/org/springframework/spring-aop/3.0.5.RELEASE/spring-aop-3.0.5.RELEASE.jar">:"<https://builds.apache.org/job/CXF-2.4.x/ws/.repository/org/springframework/spring-expression/3.0.5.RELEASE/spring-expression-3.0.5.RELEASE.jar">:"<https://builds.apache.org/job/CXF-2.4.x/ws/.repository/org/codehaus/jettison/jettison/1.3/jettison-1.3.jar">:"<https://builds.apache.org/job/CXF-2.4.x/ws/.repository/com/google/gwt/gwt-servlet/2.0.3/gwt-servlet-2.0.3.jar">:"<https://builds.apache.org/job/CXF-2.4.x/ws/.repository/com/google/gwt/gwt-user/2.0.3/gwt-user-2.0.3.jar">:"<https://builds.apache.org/job/CXF-2.4.x/ws/.repository/com/googlecode/gwt/inject/gin/1.0/gin-1.0.jar">:"<https://builds.apache.org/job/CXF-2.4.x/ws/.repository/com/google/inject/guice/2.0/guice-2.0.jar">:"<https://builds.apache.org/job/CXF-2.4.x/ws/.repository/com/google/code/findbugs/jsr305/1.3.9/jsr305-1.3.9.jar">:"<https://builds.apache.org/job/CXF-2.4.x/ws/.repository/com/google/gwt/gwt-dev/2.0.3/gwt-dev-2.0.3.jar">
com.google.gwt.dev.Compiler -gen "<https://builds.apache.org/job/CXF-2.4.x/ws/2.4.x-fixes/rt/management-web/target/generated-sources/gwt">
-logLevel INFO -style OBF -war "<https://builds.apache.org/job/CXF-2.4.x/ws/2.4.x-fixes/rt/management-web/target/war/WEB-INF/classes/static-content">
-localWorkers 24 -XdisableClassMetadata -XdisableCastChecking org.apache.cxf.management.web.browser.LogBrowser
]] failed with status 1
[INFO] ------------------------------------------------------------------------
[INFO] Trace
org.apache.maven.lifecycle.LifecycleExecutionException: Command [[
/bin/sh -c /x1/jenkins/tools/java/jdk1.5.0_22-32/jre/bin/java -Xmx512m -classpath "<https://builds.apache.org/job/CXF-2.4.x/ws/2.4.x-fixes/rt/management-web/src/main/java">:"<https://builds.apache.org/job/CXF-2.4.x/ws/2.4.x-fixes/rt/management-web/src/main/resources">:"<https://builds.apache.org/job/CXF-2.4.x/ws/2.4.x-fixes/rt/management-web/src/main/resources-filtered">:"<https://builds.apache.org/job/CXF-2.4.x/ws/2.4.x-fixes/rt/management-web/target/generated/src/main/resources">:"<https://builds.apache.org/job/CXF-2.4.x/ws/2.4.x-fixes/rt/management-web/target/maven-shared-archive-resources">:"<https://builds.apache.org/job/CXF-2.4.x/ws/2.4.x-fixes/rt/management-web/target/war/WEB-INF/classes">:"<https://builds.apache.org/job/CXF-2.4.x/ws/.repository/commons-lang/commons-lang/2.6/commons-lang-2.6.jar">:"<https://builds.apache.org/job/CXF-2.4.x/ws/.repository/org/apache/abdera/abdera-core/1.1.2/abdera-core-1.1.2.jar">:"<https://builds.apache.org/job/CXF-2.4.x/ws/.repository/org/apache/abdera/abdera-i18n/1.1.2/abdera-i18n-1.1.2.jar">:"<https://builds.apache.org/job/CXF-2.4.x/ws/.repository/commons-codec/commons-codec/1.4/commons-codec-1.4.jar">:"<https://builds.apache.org/job/CXF-2.4.x/ws/.repository/commons-logging/commons-logging/1.1.1/commons-logging-1.1.1.jar">:"<https://builds.apache.org/job/CXF-2.4.x/ws/.repository/org/apache/abdera/abdera-parser/1.1.2/abdera-parser-1.1.2.jar">:"<https://builds.apache.org/job/CXF-2.4.x/ws/.repository/org/apache/ws/commons/axiom/axiom-impl/1.2.10/axiom-impl-1.2.10.jar">:"<https://builds.apache.org/job/CXF-2.4.x/ws/.repository/org/apache/ws/commons/axiom/axiom-api/1.2.10/axiom-api-1.2.10.jar">:"<https://builds.apache.org/job/CXF-2.4.x/ws/.repository/org/apache/geronimo/specs/geronimo-javamail_1.4_spec/1.7.1/geronimo-javamail_1.4_spec-1.7.1.jar">:"<https://builds.apache.org/job/CXF-2.4.x/ws/.repository/jaxen/jaxen/1.1.1/jaxen-1.1.1.jar">:"<https://builds.apache.org/job/CXF-2.4.x/ws/.repository/org/apache/abdera/abdera-extensions-json/1.1.2/abdera-extensions-json-1.1.2.jar">:"<https://builds.apache.org/job/CXF-2.4.x/ws/.repository/org/apache/abdera/abdera-extensions-main/1.1.2/abdera-extensions-main-1.1.2.jar">:"<https://builds.apache.org/job/CXF-2.4.x/ws/2.4.x-fixes/common/common/target/cxf-common-utilities-2.4.2-SNAPSHOT.jar">:"<https://builds.apache.org/job/CXF-2.4.x/ws/.repository/org/apache/ws/xmlschema/xmlschema-core/2.0/xmlschema-core-2.0.jar">:"<https://builds.apache.org/job/CXF-2.4.x/ws/.repository/org/codehaus/woodstox/woodstox-core-asl/4.1.1/woodstox-core-asl-4.1.1.jar">:"<https://builds.apache.org/job/CXF-2.4.x/ws/.repository/org/codehaus/woodstox/stax2-api/3.1.1/stax2-api-3.1.1.jar">:"<https://builds.apache.org/job/CXF-2.4.x/ws/.repository/org/apache/geronimo/specs/geronimo-stax-api_1.0_spec/1.0.1/geronimo-stax-api_1.0_spec-1.0.1.jar">:"<https://builds.apache.org/job/CXF-2.4.x/ws/.repository/org/apache/geronimo/specs/geronimo-annotation_1.0_spec/1.1.1/geronimo-annotation_1.0_spec-1.1.1.jar">:"<https://builds.apache.org/job/CXF-2.4.x/ws/.repository/javax/xml/bind/jaxb-api/2.2.1/jaxb-api-2.2.1.jar">:"<https://builds.apache.org/job/CXF-2.4.x/ws/2.4.x-fixes/api/target/cxf-api-2.4.2-SNAPSHOT.jar">:"<https://builds.apache.org/job/CXF-2.4.x/ws/.repository/org/apache/neethi/neethi/3.0.0/neethi-3.0.0.jar">:"<https://builds.apache.org/job/CXF-2.4.x/ws/.repository/wsdl4j/wsdl4j/1.6.2/wsdl4j-1.6.2.jar">:"<https://builds.apache.org/job/CXF-2.4.x/ws/.repository/org/apache/geronimo/specs/geronimo-activation_1.1_spec/1.1/geronimo-activation_1.1_spec-1.1.jar">:"<https://builds.apache.org/job/CXF-2.4.x/ws/2.4.x-fixes/rt/core/target/cxf-rt-core-2.4.2-SNAPSHOT.jar">:"<https://builds.apache.org/job/CXF-2.4.x/ws/.repository/com/sun/xml/bind/jaxb-impl/2.2.1.1/jaxb-impl-2.2.1.1.jar">:"<https://builds.apache.org/job/CXF-2.4.x/ws/.repository/org/apache/geronimo/specs/geronimo-servlet_3.0_spec/1.0/geronimo-servlet_3.0_spec-1.0.jar">:"<https://builds.apache.org/job/CXF-2.4.x/ws/.repository/org/springframework/spring-core/3.0.5.RELEASE/spring-core-3.0.5.RELEASE.jar">:"<https://builds.apache.org/job/CXF-2.4.x/ws/.repository/org/springframework/spring-asm/3.0.5.RELEASE/spring-asm-3.0.5.RELEASE.jar">:"<https://builds.apache.org/job/CXF-2.4.x/ws/2.4.x-fixes/rt/management/target/cxf-rt-management-2.4.2-SNAPSHOT.jar">:"<https://builds.apache.org/job/CXF-2.4.x/ws/2.4.x-fixes/rt/frontend/jaxrs/target/cxf-rt-frontend-jaxrs-2.4.2-SNAPSHOT.jar">:"<https://builds.apache.org/job/CXF-2.4.x/ws/.repository/javax/ws/rs/jsr311-api/1.1.1/jsr311-api-1.1.1.jar">:"<https://builds.apache.org/job/CXF-2.4.x/ws/2.4.x-fixes/rt/bindings/xml/target/cxf-rt-bindings-xml-2.4.2-SNAPSHOT.jar">:"<https://builds.apache.org/job/CXF-2.4.x/ws/2.4.x-fixes/rt/transports/http/target/cxf-rt-transports-http-2.4.2-SNAPSHOT.jar">:"<https://builds.apache.org/job/CXF-2.4.x/ws/2.4.x-fixes/rt/transports/common/target/cxf-rt-transports-common-2.4.2-SNAPSHOT.jar">:"<https://builds.apache.org/job/CXF-2.4.x/ws/.repository/org/springframework/spring-web/3.0.5.RELEASE/spring-web-3.0.5.RELEASE.jar">:"<https://builds.apache.org/job/CXF-2.4.x/ws/.repository/aopalliance/aopalliance/1.0/aopalliance-1.0.jar">:"<https://builds.apache.org/job/CXF-2.4.x/ws/.repository/org/springframework/spring-beans/3.0.5.RELEASE/spring-beans-3.0.5.RELEASE.jar">:"<https://builds.apache.org/job/CXF-2.4.x/ws/.repository/org/springframework/spring-context/3.0.5.RELEASE/spring-context-3.0.5.RELEASE.jar">:"<https://builds.apache.org/job/CXF-2.4.x/ws/.repository/org/springframework/spring-aop/3.0.5.RELEASE/spring-aop-3.0.5.RELEASE.jar">:"<https://builds.apache.org/job/CXF-2.4.x/ws/.repository/org/springframework/spring-expression/3.0.5.RELEASE/spring-expression-3.0.5.RELEASE.jar">:"<https://builds.apache.org/job/CXF-2.4.x/ws/.repository/org/codehaus/jettison/jettison/1.3/jettison-1.3.jar">:"<https://builds.apache.org/job/CXF-2.4.x/ws/.repository/com/google/gwt/gwt-servlet/2.0.3/gwt-servlet-2.0.3.jar">:"<https://builds.apache.org/job/CXF-2.4.x/ws/.repository/com/google/gwt/gwt-user/2.0.3/gwt-user-2.0.3.jar">:"<https://builds.apache.org/job/CXF-2.4.x/ws/.repository/com/googlecode/gwt/inject/gin/1.0/gin-1.0.jar">:"<https://builds.apache.org/job/CXF-2.4.x/ws/.repository/com/google/inject/guice/2.0/guice-2.0.jar">:"<https://builds.apache.org/job/CXF-2.4.x/ws/.repository/com/google/code/findbugs/jsr305/1.3.9/jsr305-1.3.9.jar">:"<https://builds.apache.org/job/CXF-2.4.x/ws/.repository/com/google/gwt/gwt-dev/2.0.3/gwt-dev-2.0.3.jar">
com.google.gwt.dev.Compiler -gen "<https://builds.apache.org/job/CXF-2.4.x/ws/2.4.x-fixes/rt/management-web/target/generated-sources/gwt">
-logLevel INFO -style OBF -war "<https://builds.apache.org/job/CXF-2.4.x/ws/2.4.x-fixes/rt/management-web/target/war/WEB-INF/classes/static-content">
-localWorkers 24 -XdisableClassMetadata -XdisableCastChecking org.apache.cxf.management.web.browser.LogBrowser
]] failed with status 1
	at org.apache.maven.lifecycle.DefaultLifecycleExecutor.executeGoals(DefaultLifecycleExecutor.java:719)
	at org.apache.maven.lifecycle.DefaultLifecycleExecutor.executeGoalWithLifecycle(DefaultLifecycleExecutor.java:556)
	at org.apache.maven.lifecycle.DefaultLifecycleExecutor.executeGoal(DefaultLifecycleExecutor.java:535)
	at org.apache.maven.lifecycle.DefaultLifecycleExecutor.executeGoalAndHandleFailures(DefaultLifecycleExecutor.java:387)
	at org.apache.maven.lifecycle.DefaultLifecycleExecutor.executeTaskSegments(DefaultLifecycleExecutor.java:348)
	at org.apache.maven.lifecycle.DefaultLifecycleExecutor.execute(DefaultLifecycleExecutor.java:180)
	at org.apache.maven.lifecycle.LifecycleExecutorInterceptor.execute(LifecycleExecutorInterceptor.java:65)
	at org.apache.maven.DefaultMaven.doExecute(DefaultMaven.java:328)
	at org.apache.maven.DefaultMaven.execute(DefaultMaven.java:138)
	at org.apache.maven.cli.MavenCli.main(MavenCli.java:362)
	at sun.reflect.NativeMethodAccessorImpl.invoke0(Native Method)
	at sun.reflect.NativeMethodAccessorImpl.invoke(NativeMethodAccessorImpl.java:39)
	at sun.reflect.DelegatingMethodAccessorImpl.invoke(DelegatingMethodAccessorImpl.java:25)
	at java.lang.reflect.Method.invoke(Method.java:592)
	at org.codehaus.classworlds.Launcher.launchEnhanced(Launcher.java:315)
	at org.codehaus.classworlds.Launcher.launch(Launcher.java:255)
	at hudson.maven.agent.Main.launch(Main.java:185)
	at hudson.maven.MavenBuilder.call(MavenBuilder.java:164)
	at hudson.maven.MavenModuleSetBuild$Builder.call(MavenModuleSetBuild.java:987)
	at hudson.maven.MavenModuleSetBuild$Builder.call(MavenModuleSetBuild.java:918)
	at hudson.remoting.UserRequest.perform(UserRequest.java:118)
	at hudson.remoting.UserRequest.perform(UserRequest.java:48)
	at hudson.remoting.Request$2.run(Request.java:270)
	at java.util.concurrent.Executors$RunnableAdapter.call(Executors.java:417)
	at java.util.concurrent.FutureTask$Sync.innerRun(FutureTask.java:269)
	at java.util.concurrent.FutureTask.run(FutureTask.java:123)
	at java.util.concurrent.ThreadPoolExecutor$Worker.runTask(ThreadPoolExecutor.java:651)
	at java.util.concurrent.ThreadPoolExecutor$Worker.run(ThreadPoolExecutor.java:676)
	at java.lang.Thread.run(Thread.java:595)
Caused by: org.codehaus.mojo.gwt.shell.ForkedProcessExecutionException: Command [[
/bin/sh -c /x1/jenkins/tools/java/jdk1.5.0_22-32/jre/bin/java -Xmx512m -classpath "<https://builds.apache.org/job/CXF-2.4.x/ws/2.4.x-fixes/rt/management-web/src/main/java">:"<https://builds.apache.org/job/CXF-2.4.x/ws/2.4.x-fixes/rt/management-web/src/main/resources">:"<https://builds.apache.org/job/CXF-2.4.x/ws/2.4.x-fixes/rt/management-web/src/main/resources-filtered">:"<https://builds.apache.org/job/CXF-2.4.x/ws/2.4.x-fixes/rt/management-web/target/generated/src/main/resources">:"<https://builds.apache.org/job/CXF-2.4.x/ws/2.4.x-fixes/rt/management-web/target/maven-shared-archive-resources">:"<https://builds.apache.org/job/CXF-2.4.x/ws/2.4.x-fixes/rt/management-web/target/war/WEB-INF/classes">:"<https://builds.apache.org/job/CXF-2.4.x/ws/.repository/commons-lang/commons-lang/2.6/commons-lang-2.6.jar">:"<https://builds.apache.org/job/CXF-2.4.x/ws/.repository/org/apache/abdera/abdera-core/1.1.2/abdera-core-1.1.2.jar">:"<https://builds.apache.org/job/CXF-2.4.x/ws/.repository/org/apache/abdera/abdera-i18n/1.1.2/abdera-i18n-1.1.2.jar">:"<https://builds.apache.org/job/CXF-2.4.x/ws/.repository/commons-codec/commons-codec/1.4/commons-codec-1.4.jar">:"<https://builds.apache.org/job/CXF-2.4.x/ws/.repository/commons-logging/commons-logging/1.1.1/commons-logging-1.1.1.jar">:"<https://builds.apache.org/job/CXF-2.4.x/ws/.repository/org/apache/abdera/abdera-parser/1.1.2/abdera-parser-1.1.2.jar">:"<https://builds.apache.org/job/CXF-2.4.x/ws/.repository/org/apache/ws/commons/axiom/axiom-impl/1.2.10/axiom-impl-1.2.10.jar">:"<https://builds.apache.org/job/CXF-2.4.x/ws/.repository/org/apache/ws/commons/axiom/axiom-api/1.2.10/axiom-api-1.2.10.jar">:"<https://builds.apache.org/job/CXF-2.4.x/ws/.repository/org/apache/geronimo/specs/geronimo-javamail_1.4_spec/1.7.1/geronimo-javamail_1.4_spec-1.7.1.jar">:"<https://builds.apache.org/job/CXF-2.4.x/ws/.repository/jaxen/jaxen/1.1.1/jaxen-1.1.1.jar">:"<https://builds.apache.org/job/CXF-2.4.x/ws/.repository/org/apache/abdera/abdera-extensions-json/1.1.2/abdera-extensions-json-1.1.2.jar">:"<https://builds.apache.org/job/CXF-2.4.x/ws/.repository/org/apache/abdera/abdera-extensions-main/1.1.2/abdera-extensions-main-1.1.2.jar">:"<https://builds.apache.org/job/CXF-2.4.x/ws/2.4.x-fixes/common/common/target/cxf-common-utilities-2.4.2-SNAPSHOT.jar">:"<https://builds.apache.org/job/CXF-2.4.x/ws/.repository/org/apache/ws/xmlschema/xmlschema-core/2.0/xmlschema-core-2.0.jar">:"<https://builds.apache.org/job/CXF-2.4.x/ws/.repository/org/codehaus/woodstox/woodstox-core-asl/4.1.1/woodstox-core-asl-4.1.1.jar">:"<https://builds.apache.org/job/CXF-2.4.x/ws/.repository/org/codehaus/woodstox/stax2-api/3.1.1/stax2-api-3.1.1.jar">:"<https://builds.apache.org/job/CXF-2.4.x/ws/.repository/org/apache/geronimo/specs/geronimo-stax-api_1.0_spec/1.0.1/geronimo-stax-api_1.0_spec-1.0.1.jar">:"<https://builds.apache.org/job/CXF-2.4.x/ws/.repository/org/apache/geronimo/specs/geronimo-annotation_1.0_spec/1.1.1/geronimo-annotation_1.0_spec-1.1.1.jar">:"<https://builds.apache.org/job/CXF-2.4.x/ws/.repository/javax/xml/bind/jaxb-api/2.2.1/jaxb-api-2.2.1.jar">:"<https://builds.apache.org/job/CXF-2.4.x/ws/2.4.x-fixes/api/target/cxf-api-2.4.2-SNAPSHOT.jar">:"<https://builds.apache.org/job/CXF-2.4.x/ws/.repository/org/apache/neethi/neethi/3.0.0/neethi-3.0.0.jar">:"<https://builds.apache.org/job/CXF-2.4.x/ws/.repository/wsdl4j/wsdl4j/1.6.2/wsdl4j-1.6.2.jar">:"<https://builds.apache.org/job/CXF-2.4.x/ws/.repository/org/apache/geronimo/specs/geronimo-activation_1.1_spec/1.1/geronimo-activation_1.1_spec-1.1.jar">:"<https://builds.apache.org/job/CXF-2.4.x/ws/2.4.x-fixes/rt/core/target/cxf-rt-core-2.4.2-SNAPSHOT.jar">:"<https://builds.apache.org/job/CXF-2.4.x/ws/.repository/com/sun/xml/bind/jaxb-impl/2.2.1.1/jaxb-impl-2.2.1.1.jar">:"<https://builds.apache.org/job/CXF-2.4.x/ws/.repository/org/apache/geronimo/specs/geronimo-servlet_3.0_spec/1.0/geronimo-servlet_3.0_spec-1.0.jar">:"<https://builds.apache.org/job/CXF-2.4.x/ws/.repository/org/springframework/spring-core/3.0.5.RELEASE/spring-core-3.0.5.RELEASE.jar">:"<https://builds.apache.org/job/CXF-2.4.x/ws/.repository/org/springframework/spring-asm/3.0.5.RELEASE/spring-asm-3.0.5.RELEASE.jar">:"<https://builds.apache.org/job/CXF-2.4.x/ws/2.4.x-fixes/rt/management/target/cxf-rt-management-2.4.2-SNAPSHOT.jar">:"<https://builds.apache.org/job/CXF-2.4.x/ws/2.4.x-fixes/rt/frontend/jaxrs/target/cxf-rt-frontend-jaxrs-2.4.2-SNAPSHOT.jar">:"<https://builds.apache.org/job/CXF-2.4.x/ws/.repository/javax/ws/rs/jsr311-api/1.1.1/jsr311-api-1.1.1.jar">:"<https://builds.apache.org/job/CXF-2.4.x/ws/2.4.x-fixes/rt/bindings/xml/target/cxf-rt-bindings-xml-2.4.2-SNAPSHOT.jar">:"<https://builds.apache.org/job/CXF-2.4.x/ws/2.4.x-fixes/rt/transports/http/target/cxf-rt-transports-http-2.4.2-SNAPSHOT.jar">:"<https://builds.apache.org/job/CXF-2.4.x/ws/2.4.x-fixes/rt/transports/common/target/cxf-rt-transports-common-2.4.2-SNAPSHOT.jar">:"<https://builds.apache.org/job/CXF-2.4.x/ws/.repository/org/springframework/spring-web/3.0.5.RELEASE/spring-web-3.0.5.RELEASE.jar">:"<https://builds.apache.org/job/CXF-2.4.x/ws/.repository/aopalliance/aopalliance/1.0/aopalliance-1.0.jar">:"<https://builds.apache.org/job/CXF-2.4.x/ws/.repository/org/springframework/spring-beans/3.0.5.RELEASE/spring-beans-3.0.5.RELEASE.jar">:"<https://builds.apache.org/job/CXF-2.4.x/ws/.repository/org/springframework/spring-context/3.0.5.RELEASE/spring-context-3.0.5.RELEASE.jar">:"<https://builds.apache.org/job/CXF-2.4.x/ws/.repository/org/springframework/spring-aop/3.0.5.RELEASE/spring-aop-3.0.5.RELEASE.jar">:"<https://builds.apache.org/job/CXF-2.4.x/ws/.repository/org/springframework/spring-expression/3.0.5.RELEASE/spring-expression-3.0.5.RELEASE.jar">:"<https://builds.apache.org/job/CXF-2.4.x/ws/.repository/org/codehaus/jettison/jettison/1.3/jettison-1.3.jar">:"<https://builds.apache.org/job/CXF-2.4.x/ws/.repository/com/google/gwt/gwt-servlet/2.0.3/gwt-servlet-2.0.3.jar">:"<https://builds.apache.org/job/CXF-2.4.x/ws/.repository/com/google/gwt/gwt-user/2.0.3/gwt-user-2.0.3.jar">:"<https://builds.apache.org/job/CXF-2.4.x/ws/.repository/com/googlecode/gwt/inject/gin/1.0/gin-1.0.jar">:"<https://builds.apache.org/job/CXF-2.4.x/ws/.repository/com/google/inject/guice/2.0/guice-2.0.jar">:"<https://builds.apache.org/job/CXF-2.4.x/ws/.repository/com/google/code/findbugs/jsr305/1.3.9/jsr305-1.3.9.jar">:"<https://builds.apache.org/job/CXF-2.4.x/ws/.repository/com/google/gwt/gwt-dev/2.0.3/gwt-dev-2.0.3.jar">
com.google.gwt.dev.Compiler -gen "<https://builds.apache.org/job/CXF-2.4.x/ws/2.4.x-fixes/rt/management-web/target/generated-sources/gwt">
-logLevel INFO -style OBF -war "<https://builds.apache.org/job/CXF-2.4.x/ws/2.4.x-fixes/rt/management-web/target/war/WEB-INF/classes/static-content">
-localWorkers 24 -XdisableClassMetadata -XdisableCastChecking org.apache.cxf.management.web.browser.LogBrowser
]] failed with status 1
	at org.codehaus.mojo.gwt.shell.AbstractGwtShellMojo$JavaCommand.execute(AbstractGwtShellMojo.java:409)
	at org.codehaus.mojo.gwt.shell.CompileMojo.compile(CompileMojo.java:232)
	at org.codehaus.mojo.gwt.shell.CompileMojo.doExecute(CompileMojo.java:159)
	at org.codehaus.mojo.gwt.shell.AbstractGwtShellMojo.execute(AbstractGwtShellMojo.java:119)
	at org.apache.maven.plugin.DefaultPluginManager.executeMojo(DefaultPluginManager.java:490)
	at hudson.maven.agent.PluginManagerInterceptor.executeMojo(PluginManagerInterceptor.java:182)
	at org.apache.maven.lifecycle.DefaultLifecycleExecutor.executeGoals(DefaultLifecycleExecutor.java:694)
	... 28 more
[INFO] ------------------------------------------------------------------------
[INFO] Total time: 9 minutes 18 seconds
[INFO] Finished at: Thu Jul 21 20:15:45 GMT 2011
[INFO] Final Memory: 212M/278M
[INFO] ------------------------------------------------------------------------
Sending e-mails to: notifications@cxf.apache.org
Sending e-mails to: notifications@cxf.apache.org
Sending e-mails to: notifications@cxf.apache.org
Sending e-mails to: notifications@cxf.apache.org
channel stopped


Mime
View raw message