cxf-notifications mailing list archives

Site index · List index
Message view « Date » · « Thread »
Top « Date » · « Thread »
From Apache Jenkins Server <jenk...@builds.apache.org>
Subject Build failed in Jenkins: CXF-DOSGi-deploy #202
Date Mon, 18 Jul 2011 05:02:05 GMT
See <https://builds.apache.org/job/CXF-DOSGi-deploy/202/>

------------------------------------------
Started by timer
Building remotely on ubuntu3
Updating http://svn.apache.org/repos/asf/cxf/dosgi/trunk
At revision 1147744
WARNING: clock of the subversion server appears to be out of sync. This can result in inconsistent
check out behavior.
no change for http://svn.apache.org/repos/asf/cxf/dosgi/trunk since the previous build
ERROR: Ignore Problem expanding maven opts macros org.jenkinsci.plugins.tokenmacro.TokenMacro
Found mavenVersion 2.0.9 from file jar:file:/home/hudson/tools/maven/apache-maven-2.0.9/lib/maven-2.0.9-uber.jar!/META-INF/maven/org.apache.maven/maven-core/pom.properties
Parsing POMs
ERROR: Ignore Problem expanding maven opts macros org.jenkinsci.plugins.tokenmacro.TokenMacro
[trunk] $ /home/hudson/tools/java/latest1.6/bin/java -da -dsa -XX:MaxPermSize=192m -Xmx512M
-cp /home/jenkins/jenkins-slave/maven-agent.jar:/home/jenkins/jenkins-slave/classworlds.jar
hudson.maven.agent.Main /home/hudson/tools/maven/apache-maven-2.0.9 /x1/jenkins/jenkins-slave/slave.jar
/home/jenkins/jenkins-slave/maven-interceptor.jar 34158
<===[HUDSON REMOTING CAPACITY]===>channel started
   Executing Maven:  -B -f <https://builds.apache.org/job/CXF-DOSGi-deploy/ws/trunk/pom.xml>
-Dmaven.repo.local=<https://builds.apache.org/job/CXF-DOSGi-deploy/ws/.repository> -U
-B -e clean deploy -Pdeploy,everything,nochecks -Dmaven.test.skip.exec=true
+ Error stacktraces are turned on.
[INFO] Scanning for projects...
[INFO] ------------------------------------------------------------------------
[ERROR] BUILD FAILURE
[INFO] ------------------------------------------------------------------------
[INFO] Unable to build project '<https://builds.apache.org/job/CXF-DOSGi-deploy/ws/trunk/pom.xml;>
it requires Maven version 2.2.1
[INFO] ------------------------------------------------------------------------
[INFO] Trace
org.apache.maven.BuildFailureException: Unable to build project '<https://builds.apache.org/job/CXF-DOSGi-deploy/ws/trunk/pom.xml;>
it requires Maven version 2.2.1
	at org.apache.maven.DefaultMaven.collectProjects(DefaultMaven.java:473)
	at org.apache.maven.DefaultMaven.getProjects(DefaultMaven.java:365)
	at org.apache.maven.DefaultMaven.doExecute(DefaultMaven.java:292)
	at org.apache.maven.DefaultMaven.execute(DefaultMaven.java:129)
	at org.apache.maven.cli.MavenCli.main(MavenCli.java:287)
	at sun.reflect.NativeMethodAccessorImpl.invoke0(Native Method)
	at sun.reflect.NativeMethodAccessorImpl.invoke(NativeMethodAccessorImpl.java:39)
	at sun.reflect.DelegatingMethodAccessorImpl.invoke(DelegatingMethodAccessorImpl.java:25)
	at java.lang.reflect.Method.invoke(Method.java:597)
	at org.codehaus.classworlds.Launcher.launchEnhanced(Launcher.java:315)
	at org.codehaus.classworlds.Launcher.launch(Launcher.java:255)
	at hudson.maven.agent.Main.launch(Main.java:185)
	at hudson.maven.MavenBuilder.call(MavenBuilder.java:164)
	at hudson.maven.MavenModuleSetBuild$Builder.call(MavenModuleSetBuild.java:987)
	at hudson.maven.MavenModuleSetBuild$Builder.call(MavenModuleSetBuild.java:918)
	at hudson.remoting.UserRequest.perform(UserRequest.java:118)
	at hudson.remoting.UserRequest.perform(UserRequest.java:48)
	at hudson.remoting.Request$2.run(Request.java:270)
	at java.util.concurrent.Executors$RunnableAdapter.call(Executors.java:441)
	at java.util.concurrent.FutureTask$Sync.innerRun(FutureTask.java:303)
	at java.util.concurrent.FutureTask.run(FutureTask.java:138)
	at java.util.concurrent.ThreadPoolExecutor$Worker.runTask(ThreadPoolExecutor.java:886)
	at java.util.concurrent.ThreadPoolExecutor$Worker.run(ThreadPoolExecutor.java:908)
	at java.lang.Thread.run(Thread.java:619)
[INFO] ------------------------------------------------------------------------
[INFO] Total time: < 1 second
[INFO] Finished at: Mon Jul 18 04:56:16 UTC 2011
[INFO] Final Memory: 2M/61M
[INFO] ------------------------------------------------------------------------
channel stopped


Mime
View raw message