cxf-notifications mailing list archives

Site index · List index
Message view « Date » · « Thread »
Top « Date » · « Thread »
From Apache Jenkins Server <jenk...@builds.apache.org>
Subject Build failed in Jenkins: CXF-xjc-utils #11
Date Fri, 22 Jul 2011 05:06:47 GMT
See <https://builds.apache.org/job/CXF-xjc-utils/11/changes>

Changes:

[dkulp] [CXF-3676] Add @threadSafe to xjc plugin

------------------------------------------
[...truncated 178 lines...]
A         bug671/src/main/java/org/apache/cxf
A         bug671/src/main/java/org/apache/cxf/xjc
A         bug671/src/main/java/org/apache/cxf/xjc/bug671
AU        bug671/src/main/java/org/apache/cxf/xjc/bug671/Bug671Plugin.java
A         bug671/src/main/java/com
A         bug671/src/main/java/com/sun
A         bug671/src/main/java/com/sun/tools
A         bug671/src/main/java/com/sun/tools/xjc
A         bug671/src/main/java/com/sun/tools/xjc/addon
A         bug671/src/main/java/com/sun/tools/xjc/addon/apache_cxf
A         bug671/src/main/java/com/sun/tools/xjc/addon/apache_cxf/bug671
AU        bug671/src/main/java/com/sun/tools/xjc/addon/apache_cxf/bug671/Bug671Plugin.java
A         bug671/src/main/resources
A         bug671/src/main/resources/META-INF
A         bug671/src/main/resources/META-INF/services
A         bug671/src/main/resources/META-INF/services/com.sun.tools.xjc.Plugin
AU        bug671/pom.xml
A         boolean-test
A         boolean-test/src
A         boolean-test/src/test
A         boolean-test/src/test/java
A         boolean-test/src/test/java/org
A         boolean-test/src/test/java/org/apache
A         boolean-test/src/test/java/org/apache/cxf
A         boolean-test/src/test/java/org/apache/cxf/xjc
A         boolean-test/src/test/java/org/apache/cxf/xjc/bg
AU        boolean-test/src/test/java/org/apache/cxf/xjc/bg/BooleanGetterPluginTest.java
A         boolean-test/src/test/resources
A         boolean-test/src/test/resources/schemas
A         boolean-test/src/test/resources/schemas/configuration
AU        boolean-test/src/test/resources/schemas/configuration/foo.xsd
AU        boolean-test/pom.xml
A         cxf-xjc-plugin
A         cxf-xjc-plugin/src
A         cxf-xjc-plugin/src/main
A         cxf-xjc-plugin/src/main/java
A         cxf-xjc-plugin/src/main/java/org
A         cxf-xjc-plugin/src/main/java/org/apache
A         cxf-xjc-plugin/src/main/java/org/apache/cxf
A         cxf-xjc-plugin/src/main/java/org/apache/cxf/maven_plugin
AU        cxf-xjc-plugin/src/main/java/org/apache/cxf/maven_plugin/XsdOption.java
AU        cxf-xjc-plugin/src/main/java/org/apache/cxf/maven_plugin/TestXSDToJavaMojo.java
AU        cxf-xjc-plugin/src/main/java/org/apache/cxf/maven_plugin/XSDToJavaMojo.java
AU        cxf-xjc-plugin/src/main/java/org/apache/cxf/maven_plugin/AbstractXSDToJavaMojo.java
AU        cxf-xjc-plugin/pom.xml
 U        .
At revision 1149466
WARNING: clock of the subversion server appears to be out of sync. This can result in inconsistent
check out behavior.
ERROR: Ignore Problem expanding maven opts macros org.jenkinsci.plugins.tokenmacro.TokenMacro
Found mavenVersion 2.2.1 from file jar:file:/home/hudson/tools/maven/apache-maven-2.2.1/lib/maven-2.2.1-uber.jar!/META-INF/maven/org.apache.maven/maven-core/pom.properties
Parsing POMs
downloaded artifact http://repo1.maven.org/maven2//org/apache/apache/8/apache-8.pom
ERROR: Ignore Problem expanding maven opts macros org.jenkinsci.plugins.tokenmacro.TokenMacro
[xjc-utils-trunk] $ /home/hudson/tools/java/latest1.6/bin/java -da -dsa -XX:MaxPermSize=192m
-Xmx768M -cp /home/jenkins/jenkins-slave/maven-agent.jar:/home/jenkins/jenkins-slave/classworlds.jar
hudson.maven.agent.Main /home/hudson/tools/maven/apache-maven-2.2.1 /x1/jenkins/jenkins-slave/slave.jar
/home/jenkins/jenkins-slave/maven-interceptor.jar 36669 /home/jenkins/jenkins-slave/maven2.1-interceptor.jar
<===[HUDSON REMOTING CAPACITY]===>   channel started
Executing Maven:  -B -f <https://builds.apache.org/job/CXF-xjc-utils/ws/xjc-utils-trunk/pom.xml>
-Dmaven.repo.local=<https://builds.apache.org/job/CXF-xjc-utils/ws/.repository> -U -cpu
-e -B clean deploy
+ Error stacktraces are turned on.
[INFO] Scanning for projects...
[INFO] Reactor build order: 
[INFO]   Apache CXF XJC Utils
[INFO]   Apache CXF XSD2Java Plugin
[INFO]   Apache CXF XJC Default Value Plugin
[INFO]   Apache CXF XJC Default Value Plugin Tests
[INFO]   Apache CXF XJC toString Plugin
[INFO]   Apache CXF XJC toString Plugin Tests
[INFO]   Apache CXF XJC Boolean Getter Plugin
[INFO]   Apache CXF XJC Boolean Getter Plugin Tests
[INFO]   Apache CXF XJC WSDL Extension Plugin
[INFO]   Apache CXF XJC WSDL Extension Plugin Tests
[INFO]   Apache CXF XJC Plugin To Workaround JAXB Bug 671
[INFO]   Apache CXF XJC Property Listener Plugin
[INFO] ------------------------------------------------------------------------
[INFO] Building Apache CXF XJC Utils
[INFO]    task-segment: [clean, deploy]
[INFO] ------------------------------------------------------------------------
Downloading: http://repo1.maven.org/maven2/org/apache/maven/plugins/maven-clean-plugin/2.3/maven-clean-plugin-2.3.pom

Downloading: http://repo1.maven.org/maven2/org/apache/maven/plugins/maven-plugins/12/maven-plugins-12.pom

Downloading: http://repo1.maven.org/maven2/org/apache/maven/maven-parent/9/maven-parent-9.pom

Downloading: http://repo1.maven.org/maven2/org/apache/apache/4/apache-4.pom

Downloading: http://repo1.maven.org/maven2/org/apache/maven/plugins/maven-clean-plugin/2.3/maven-clean-plugin-2.3.jar

Downloading: http://repo1.maven.org/maven2/org/apache/maven/plugins/maven-remote-resources-plugin/1.1/maven-remote-resources-plugin-1.1.pom

Downloading: http://repo1.maven.org/maven2/org/apache/maven/plugins/maven-plugins/14/maven-plugins-14.pom

Downloading: http://repo1.maven.org/maven2/org/apache/maven/maven-parent/13/maven-parent-13.pom

Downloading: http://repo1.maven.org/maven2/org/apache/apache/6/apache-6.pom

Downloading: http://repo1.maven.org/maven2/org/apache/maven/plugins/maven-remote-resources-plugin/1.1/maven-remote-resources-plugin-1.1.jar

Downloading: http://repo1.maven.org/maven2/org/apache/maven/plugins/maven-checkstyle-plugin/2.6/maven-checkstyle-plugin-2.6.pom

Downloading: http://repo1.maven.org/maven2/org/apache/maven/plugins/maven-plugins/18/maven-plugins-18.pom

Downloading: http://repo1.maven.org/maven2/org/apache/maven/maven-parent/16/maven-parent-16.pom

Downloading: http://repo1.maven.org/maven2/org/apache/apache/7/apache-7.pom

Downloading: http://repo1.maven.org/maven2/org/apache/maven/plugins/maven-checkstyle-plugin/2.6/maven-checkstyle-plugin-2.6.jar

Downloading: http://repo1.maven.org/maven2/org/apache/maven/plugins/maven-pmd-plugin/2.4/maven-pmd-plugin-2.4.pom

Downloading: http://repo1.maven.org/maven2/org/apache/maven/plugins/maven-plugins/11/maven-plugins-11.pom

Downloading: http://repo1.maven.org/maven2/org/apache/maven/maven-parent/8/maven-parent-8.pom

Downloading: http://repo1.maven.org/maven2/org/apache/maven/plugins/maven-pmd-plugin/2.4/maven-pmd-plugin-2.4.jar

Downloading: http://repo1.maven.org/maven2/org/apache/maven/maven-project/2.0.6/maven-project-2.0.6.pom

Downloading: http://repo1.maven.org/maven2/org/apache/maven/maven/2.0.6/maven-2.0.6.pom

Downloading: http://repo1.maven.org/maven2/org/apache/maven/maven-parent/5/maven-parent-5.pom

Downloading: http://repo1.maven.org/maven2/org/apache/apache/3/apache-3.pom

Downloading: http://repo1.maven.org/maven2/org/apache/maven/maven-settings/2.0.6/maven-settings-2.0.6.pom

Downloading: http://repo1.maven.org/maven2/org/apache/maven/maven-model/2.0.6/maven-model-2.0.6.pom

Downloading: http://repo1.maven.org/maven2/org/codehaus/plexus/plexus-utils/1.4.1/plexus-utils-1.4.1.pom

Downloading: http://repo1.maven.org/maven2/org/codehaus/plexus/plexus/1.0.11/plexus-1.0.11.pom

Downloading: http://repo1.maven.org/maven2/org/codehaus/plexus/plexus-container-default/1.0-alpha-9-stable-1/plexus-container-default-1.0-alpha-9-stable-1.pom

Downloading: http://repo1.maven.org/maven2/org/codehaus/plexus/plexus-containers/1.0.3/plexus-containers-1.0.3.pom

Downloading: http://repo1.maven.org/maven2/org/codehaus/plexus/plexus/1.0.4/plexus-1.0.4.pom

Downloading: http://repo1.maven.org/maven2/junit/junit/3.8.1/junit-3.8.1.pom

Downloading: http://repo1.maven.org/maven2/org/codehaus/plexus/plexus-utils/1.0.4/plexus-utils-1.0.4.pom

Downloading: http://repo1.maven.org/maven2/classworlds/classworlds/1.1-alpha-2/classworlds-1.1-alpha-2.pom

Downloading: http://repo1.maven.org/maven2/org/apache/maven/maven-profile/2.0.6/maven-profile-2.0.6.pom

Downloading: http://repo1.maven.org/maven2/org/apache/maven/maven-artifact-manager/2.0.6/maven-artifact-manager-2.0.6.pom

Downloading: http://repo1.maven.org/maven2/org/apache/maven/maven-repository-metadata/2.0.6/maven-repository-metadata-2.0.6.pom

Downloading: http://repo1.maven.org/maven2/org/apache/maven/maven-artifact/2.0.6/maven-artifact-2.0.6.pom

Downloading: http://repo1.maven.org/maven2/org/apache/maven/wagon/wagon-provider-api/1.0-beta-2/wagon-provider-api-1.0-beta-2.pom

Downloading: http://repo1.maven.org/maven2/org/apache/maven/wagon/wagon/1.0-beta-2/wagon-1.0-beta-2.pom

Downloading: http://repo1.maven.org/maven2/org/apache/maven/maven-parent/4/maven-parent-4.pom

Downloading: http://repo1.maven.org/maven2/org/apache/maven/maven-plugin-registry/2.0.6/maven-plugin-registry-2.0.6.pom

Downloading: http://repo1.maven.org/maven2/org/apache/maven/maven-plugin-api/2.0.6/maven-plugin-api-2.0.6.pom

Downloading: http://repo1.maven.org/maven2/org/apache/maven/shared/file-management/1.2.1/file-management-1.2.1.pom

Downloading: http://repo1.maven.org/maven2/org/apache/maven/shared/maven-shared-components/10/maven-shared-components-10.pom

Downloading: http://repo1.maven.org/maven2/org/apache/maven/shared/maven-shared-io/1.1/maven-shared-io-1.1.pom

Downloading: http://repo1.maven.org/maven2/org/apache/maven/shared/maven-shared-components/8/maven-shared-components-8.pom

Downloading: http://repo1.maven.org/maven2/org/apache/maven/maven-parent/7/maven-parent-7.pom

Downloading: http://repo1.maven.org/maven2/org/apache/maven/maven-artifact/2.0.2/maven-artifact-2.0.2.pom

Downloading: http://repo1.maven.org/maven2/org/apache/maven/maven/2.0.2/maven-2.0.2.pom

Downloading: http://repo1.maven.org/maven2/org/apache/maven/maven-artifact-manager/2.0.2/maven-artifact-manager-2.0.2.pom

Downloading: http://repo1.maven.org/maven2/org/apache/maven/wagon/wagon-provider-api/1.0-alpha-6/wagon-provider-api-1.0-alpha-6.pom

Downloading: http://repo1.maven.org/maven2/org/apache/maven/wagon/wagon/1.0-alpha-6/wagon-1.0-alpha-6.pom

Downloading: http://repo1.maven.org/maven2/org/codehaus/plexus/plexus-utils/1.4.6/plexus-utils-1.4.6.pom

Downloading: http://repo1.maven.org/maven2/org/codehaus/plexus/plexus-utils/1.5.6/plexus-utils-1.5.6.pom

Downloading: http://repo1.maven.org/maven2/org/codehaus/plexus/plexus/1.0.12/plexus-1.0.12.pom

Downloading: http://repo1.maven.org/maven2/org/codehaus/plexus/plexus-container-default/1.0-alpha-9/plexus-container-default-1.0-alpha-9.pom

Downloading: http://repo1.maven.org/maven2/org/apache/maven/shared/file-management/1.2.1/file-management-1.2.1.jar
Downloading: http://repo1.maven.org/maven2/org/codehaus/plexus/plexus-utils/1.5.6/plexus-utils-1.5.6.jar

Downloading: http://repo1.maven.org/maven2/org/apache/maven/shared/maven-shared-io/1.1/maven-shared-io-1.1.jar


[INFO] [clean:clean {execution: default-clean}]
Downloading: http://repo1.maven.org/maven2/org/apache/maven/plugins/maven-site-plugin/3.0-beta-3/maven-site-plugin-3.0-beta-3.pom

[JENKINS] Archiving <https://builds.apache.org/job/CXF-xjc-utils/ws/xjc-utils-trunk/pom.xml>
to /home/hudson/hudson/jobs/CXF-xjc-utils/modules/org.apache.cxf.xjc-utils$xjc-utils/builds/2011-07-22_05-06-08/archive/org.apache.cxf.xjc-utils/xjc-utils/2.3.3-SNAPSHOT/xjc-utils-2.3.3-SNAPSHOT.pom
[INFO] ------------------------------------------------------------------------
[ERROR] BUILD ERROR
[INFO] ------------------------------------------------------------------------
[INFO] Error resolving version for 'org.apache.maven.plugins:maven-site-plugin': Plugin requires
Maven version 3.0
[INFO] ------------------------------------------------------------------------
[INFO] Trace
org.apache.maven.lifecycle.LifecycleExecutionException: Error resolving version for 'org.apache.maven.plugins:maven-site-plugin':
Plugin requires Maven version 3.0
	at org.apache.maven.lifecycle.DefaultLifecycleExecutor.verifyPlugin(DefaultLifecycleExecutor.java:1549)
	at org.apache.maven.lifecycle.DefaultLifecycleExecutor.getMojoDescriptor(DefaultLifecycleExecutor.java:1851)
	at org.apache.maven.lifecycle.DefaultLifecycleExecutor.bindLifecycleForPackaging(DefaultLifecycleExecutor.java:1311)
	at org.apache.maven.lifecycle.DefaultLifecycleExecutor.constructLifecycleMappings(DefaultLifecycleExecutor.java:1275)
	at org.apache.maven.lifecycle.DefaultLifecycleExecutor.executeGoal(DefaultLifecycleExecutor.java:534)
	at org.apache.maven.lifecycle.DefaultLifecycleExecutor.executeGoalAndHandleFailures(DefaultLifecycleExecutor.java:387)
	at org.apache.maven.lifecycle.DefaultLifecycleExecutor.executeTaskSegments(DefaultLifecycleExecutor.java:348)
	at org.apache.maven.lifecycle.DefaultLifecycleExecutor.execute(DefaultLifecycleExecutor.java:180)
	at org.apache.maven.lifecycle.LifecycleExecutorInterceptor.execute(LifecycleExecutorInterceptor.java:65)
	at org.apache.maven.DefaultMaven.doExecute(DefaultMaven.java:328)
	at org.apache.maven.DefaultMaven.execute(DefaultMaven.java:138)
	at org.apache.maven.cli.MavenCli.main(MavenCli.java:362)
	at sun.reflect.NativeMethodAccessorImpl.invoke0(Native Method)
	at sun.reflect.NativeMethodAccessorImpl.invoke(NativeMethodAccessorImpl.java:39)
	at sun.reflect.DelegatingMethodAccessorImpl.invoke(DelegatingMethodAccessorImpl.java:25)
	at java.lang.reflect.Method.invoke(Method.java:597)
	at org.codehaus.classworlds.Launcher.launchEnhanced(Launcher.java:315)
	at org.codehaus.classworlds.Launcher.launch(Launcher.java:255)
	at hudson.maven.agent.Main.launch(Main.java:185)
	at hudson.maven.MavenBuilder.call(MavenBuilder.java:164)
	at hudson.maven.MavenModuleSetBuild$Builder.call(MavenModuleSetBuild.java:987)
	at hudson.maven.MavenModuleSetBuild$Builder.call(MavenModuleSetBuild.java:918)
	at hudson.remoting.UserRequest.perform(UserRequest.java:118)
	at hudson.remoting.UserRequest.perform(UserRequest.java:48)
	at hudson.remoting.Request$2.run(Request.java:270)
	at java.util.concurrent.Executors$RunnableAdapter.call(Executors.java:441)
	at java.util.concurrent.FutureTask$Sync.innerRun(FutureTask.java:303)
	at java.util.concurrent.FutureTask.run(FutureTask.java:138)
	at java.util.concurrent.ThreadPoolExecutor$Worker.runTask(ThreadPoolExecutor.java:886)
	at java.util.concurrent.ThreadPoolExecutor$Worker.run(ThreadPoolExecutor.java:908)
	at java.lang.Thread.run(Thread.java:619)
Caused by: org.apache.maven.plugin.version.PluginVersionResolutionException: Error resolving
version for 'org.apache.maven.plugins:maven-site-plugin': Plugin requires Maven version 3.0
	at org.apache.maven.plugin.DefaultPluginManager.checkRequiredMavenVersion(DefaultPluginManager.java:286)
	at org.apache.maven.plugin.DefaultPluginManager.verifyVersionedPlugin(DefaultPluginManager.java:205)
	at org.apache.maven.plugin.DefaultPluginManager.verifyPlugin(DefaultPluginManager.java:184)
	at org.apache.maven.plugin.DefaultPluginManager.loadPluginDescriptor(DefaultPluginManager.java:1642)
	at org.apache.maven.lifecycle.DefaultLifecycleExecutor.verifyPlugin(DefaultLifecycleExecutor.java:1540)
	... 30 more
[INFO] ------------------------------------------------------------------------
[INFO] Total time: 31 seconds
[INFO] Finished at: Fri Jul 22 04:59:49 UTC 2011
[INFO] Final Memory: 8M/62M
[INFO] ------------------------------------------------------------------------
Sending e-mails to: notifications@cxf.apache.org
channel stopped


Mime
View raw message