cxf-notifications mailing list archives

Site index · List index
Message view « Date » · « Thread »
Top « Date » · « Thread »
From Apache Jenkins Server <jenk...@builds.apache.org>
Subject Build failed in Jenkins: CXF-2.4.x #51
Date Thu, 21 Jul 2011 21:11:41 GMT
See <https://builds.apache.org/job/CXF-2.4.x/51/changes>

Changes:

[coheigea] [CXF-3674] - Support the Kerberos Token Profile
 - Fixing some incorrect test config

------------------------------------------
[...truncated 941 lines...]
[INFO] skip non existing resourceDirectory <https://builds.apache.org/job/CXF-2.4.x/ws/2.4.x-fixes/tools/wsdlto/databinding/jaxb/target/generated/src/main/resources>
[INFO] Copying 3 resources
[INFO] [compiler:compile {execution: default-compile}]
[INFO] Compiling 5 source files to <https://builds.apache.org/job/CXF-2.4.x/ws/2.4.x-fixes/tools/wsdlto/databinding/jaxb/target/classes>
[INFO] [resources:testResources {execution: default-testResources}]
[INFO] Using 'UTF-8' encoding to copy filtered resources.
[INFO] skip non existing resourceDirectory <https://builds.apache.org/job/CXF-2.4.x/ws/2.4.x-fixes/tools/wsdlto/databinding/jaxb/src/test/java>
[INFO] skip non existing resourceDirectory <https://builds.apache.org/job/CXF-2.4.x/ws/2.4.x-fixes/tools/wsdlto/databinding/jaxb/src/test/resources>
[INFO] skip non existing resourceDirectory <https://builds.apache.org/job/CXF-2.4.x/ws/2.4.x-fixes/tools/wsdlto/databinding/jaxb/target/generated/src/test/resources>
[INFO] Copying 3 resources
[INFO] [compiler:testCompile {execution: default-testCompile}]
[INFO] No sources to compile
[INFO] [surefire:test {execution: default-test}]
[INFO] Surefire report directory: <https://builds.apache.org/job/CXF-2.4.x/ws/2.4.x-fixes/tools/wsdlto/databinding/jaxb/target/surefire-reports>

-------------------------------------------------------
 T E S T S
-------------------------------------------------------
#
# An unexpected error has been detected by HotSpot Virtual Machine:
#
#  SIGBUS (0x7) at pc=0xf76e17a4, pid=26579, tid=4150064832
#
# Java VM: Java HotSpot(TM) Server VM (1.5.0_22-b03 mixed mode)
# Problematic frame:
Segmentation fault
# 

Results :

Tests run: 0, Failures: 0, Errors: 0, Skipped: 0

[JENKINS] Recording test results
[INFO] [jar:jar {execution: default-jar}]
[INFO] Building jar: <https://builds.apache.org/job/CXF-2.4.x/ws/2.4.x-fixes/tools/wsdlto/databinding/jaxb/target/cxf-tools-wsdlto-databinding-jaxb-2.4.2-SNAPSHOT.jar>
[INFO] [install:install {execution: default-install}]
[INFO] Installing <https://builds.apache.org/job/CXF-2.4.x/ws/2.4.x-fixes/tools/wsdlto/databinding/jaxb/target/cxf-tools-wsdlto-databinding-jaxb-2.4.2-SNAPSHOT.jar>
to <https://builds.apache.org/job/CXF-2.4.x/ws/.repository/org/apache/cxf/cxf-tools-wsdlto-databinding-jaxb/2.4.2-SNAPSHOT/cxf-tools-wsdlto-databinding-jaxb-2.4.2-SNAPSHOT.jar>
[JENKINS] Archiving <https://builds.apache.org/job/CXF-2.4.x/ws/2.4.x-fixes/tools/wsdlto/databinding/jaxb/pom.xml>
to /home/hudson/hudson/jobs/CXF-2.4.x/modules/org.apache.cxf$cxf-tools-wsdlto-databinding-jaxb/builds/2011-07-21_21-10-43/archive/org.apache.cxf/cxf-tools-wsdlto-databinding-jaxb/2.4.2-SNAPSHOT/cxf-tools-wsdlto-databinding-jaxb-2.4.2-SNAPSHOT.pom
[JENKINS] Archiving <https://builds.apache.org/job/CXF-2.4.x/ws/2.4.x-fixes/tools/wsdlto/databinding/jaxb/target/cxf-tools-wsdlto-databinding-jaxb-2.4.2-SNAPSHOT.jar>
to /home/hudson/hudson/jobs/CXF-2.4.x/modules/org.apache.cxf$cxf-tools-wsdlto-databinding-jaxb/builds/2011-07-21_21-10-43/archive/org.apache.cxf/cxf-tools-wsdlto-databinding-jaxb/2.4.2-SNAPSHOT/cxf-tools-wsdlto-databinding-jaxb-2.4.2-SNAPSHOT.jar
[INFO] ------------------------------------------------------------------------
[INFO] Building Apache CXF Code Generation Maven2 Plugins
[INFO]    task-segment: [clean, install]
[INFO] ------------------------------------------------------------------------
[INFO] [clean:clean {execution: default-clean}]
[INFO] Deleting <https://builds.apache.org/job/CXF-2.4.x/ws/2.4.x-fixes/maven-plugins/codegen-plugin/target>
[INFO] [cxf-xml2fastinfoset:xml2fastinfoset {execution: xml2fastinfoset}]
[INFO] [plugin:descriptor {execution: default-descriptor}]
[INFO] Using 'UTF-8' encoding to read mojo metadata.
[INFO] Applying mojo extractor for language: java
[INFO] Mojo extractor for language: java found 1 mojo descriptors.
[INFO] Applying mojo extractor for language: bsh
[INFO] Mojo extractor for language: bsh found 0 mojo descriptors.
[INFO] [remote-resources:process {execution: default}]
[INFO] [resources:resources {execution: default-resources}]
[INFO] Using 'UTF-8' encoding to copy filtered resources.
[INFO] Copying 0 resource
[INFO] skip non existing resourceDirectory <https://builds.apache.org/job/CXF-2.4.x/ws/2.4.x-fixes/maven-plugins/codegen-plugin/src/main/resources>
[INFO] skip non existing resourceDirectory <https://builds.apache.org/job/CXF-2.4.x/ws/2.4.x-fixes/maven-plugins/codegen-plugin/src/main/resources-filtered>
[INFO] skip non existing resourceDirectory <https://builds.apache.org/job/CXF-2.4.x/ws/2.4.x-fixes/maven-plugins/codegen-plugin/target/generated/src/main/resources>
[INFO] Copying 3 resources
[INFO] [compiler:compile {execution: default-compile}]
[INFO] Compiling 7 source files to <https://builds.apache.org/job/CXF-2.4.x/ws/2.4.x-fixes/maven-plugins/codegen-plugin/target/classes>
[INFO] [resources:testResources {execution: default-testResources}]
[INFO] Using 'UTF-8' encoding to copy filtered resources.
[INFO] skip non existing resourceDirectory <https://builds.apache.org/job/CXF-2.4.x/ws/2.4.x-fixes/maven-plugins/codegen-plugin/src/test/java>
[INFO] skip non existing resourceDirectory <https://builds.apache.org/job/CXF-2.4.x/ws/2.4.x-fixes/maven-plugins/codegen-plugin/src/test/resources>
[INFO] skip non existing resourceDirectory <https://builds.apache.org/job/CXF-2.4.x/ws/2.4.x-fixes/maven-plugins/codegen-plugin/target/generated/src/test/resources>
[INFO] Copying 3 resources
[INFO] [compiler:testCompile {execution: default-testCompile}]
[INFO] No sources to compile
[INFO] [surefire:test {execution: default-test}]
[INFO] Surefire report directory: <https://builds.apache.org/job/CXF-2.4.x/ws/2.4.x-fixes/maven-plugins/codegen-plugin/target/surefire-reports>

-------------------------------------------------------
 T E S T S
-------------------------------------------------------
#
# An unexpected error has been detected by HotSpot Virtual Machine:
#
#  SIGBUS (0x7) at pc=0xf772c7a4, pid=26615, tid=4150372032
#
# Java VM: Java HotSpot(TM) Server VM (1.5.0_22-b03 mixed mode)
# Problematic frame:
Segmentation fault
# 

Results :

Tests run: 0, Failures: 0, Errors: 0, Skipped: 0

[JENKINS] Recording test results
[INFO] [jar:jar {execution: default-jar}]
[INFO] Building jar: <https://builds.apache.org/job/CXF-2.4.x/ws/2.4.x-fixes/maven-plugins/codegen-plugin/target/cxf-codegen-plugin-2.4.2-SNAPSHOT.jar>
[INFO] [plugin:addPluginArtifactMetadata {execution: default-addPluginArtifactMetadata}]
[INFO] [install:install {execution: default-install}]
[INFO] Installing <https://builds.apache.org/job/CXF-2.4.x/ws/2.4.x-fixes/maven-plugins/codegen-plugin/target/cxf-codegen-plugin-2.4.2-SNAPSHOT.jar>
to <https://builds.apache.org/job/CXF-2.4.x/ws/.repository/org/apache/cxf/cxf-codegen-plugin/2.4.2-SNAPSHOT/cxf-codegen-plugin-2.4.2-SNAPSHOT.jar>
[JENKINS] Archiving <https://builds.apache.org/job/CXF-2.4.x/ws/2.4.x-fixes/maven-plugins/codegen-plugin/pom.xml>
to /home/hudson/hudson/jobs/CXF-2.4.x/modules/org.apache.cxf$cxf-codegen-plugin/builds/2011-07-21_21-10-43/archive/org.apache.cxf/cxf-codegen-plugin/2.4.2-SNAPSHOT/cxf-codegen-plugin-2.4.2-SNAPSHOT.pom
[JENKINS] Archiving <https://builds.apache.org/job/CXF-2.4.x/ws/2.4.x-fixes/maven-plugins/codegen-plugin/target/cxf-codegen-plugin-2.4.2-SNAPSHOT.jar>
to /home/hudson/hudson/jobs/CXF-2.4.x/modules/org.apache.cxf$cxf-codegen-plugin/builds/2011-07-21_21-10-43/archive/org.apache.cxf/cxf-codegen-plugin/2.4.2-SNAPSHOT/cxf-codegen-plugin-2.4.2-SNAPSHOT.jar
[INFO] ------------------------------------------------------------------------
[INFO] Building Apache CXF Test Utilities
[INFO]    task-segment: [clean, install]
[INFO] ------------------------------------------------------------------------
[INFO] [clean:clean {execution: default-clean}]
[INFO] Deleting <https://builds.apache.org/job/CXF-2.4.x/ws/2.4.x-fixes/testutils/target>
[WARNING] DEPRECATED [sourceRoot]: Use the build-helper-maven-plugin to bind source directories
[INFO] [antrun:run {execution: validate}]
project.artifactId
[INFO] Executing tasks
    [mkdir] Created dir: <https://builds.apache.org/job/CXF-2.4.x/ws/2.4.x-fixes/testutils/target/generated/src/main/resources/wsdl/type_test>
     [xslt] Processing <https://builds.apache.org/job/CXF-2.4.x/ws/2.4.x-fixes/testutils/src/main/resources/wsdl/type_test/type_test.xsd>
to <https://builds.apache.org/job/CXF-2.4.x/ws/2.4.x-fixes/testutils/target/generated/src/main/resources/wsdl/type_test/type_test_1.xsd>
     [xslt] Loading stylesheet <https://builds.apache.org/job/CXF-2.4.x/ws/2.4.x-fixes/testutils/src/main/resources/wsdl/type_test/type_test_ID_xsd.xsl>
     [xslt] Processing <https://builds.apache.org/job/CXF-2.4.x/ws/2.4.x-fixes/testutils/src/main/resources/wsdl/type_test/type_test.xsd>
to <https://builds.apache.org/job/CXF-2.4.x/ws/2.4.x-fixes/testutils/target/generated/src/main/resources/wsdl/type_test/type_test_2.xsd>
     [xslt] Loading stylesheet <https://builds.apache.org/job/CXF-2.4.x/ws/2.4.x-fixes/testutils/src/main/resources/wsdl/type_test/type_test_ID_xsd.xsl>
     [xslt] Processing <https://builds.apache.org/job/CXF-2.4.x/ws/2.4.x-fixes/testutils/src/main/resources/wsdl/type_test/type_test.xsd>
to <https://builds.apache.org/job/CXF-2.4.x/ws/2.4.x-fixes/testutils/target/generated/src/main/resources/wsdl/type_test/type_test_3.xsd>
     [xslt] Loading stylesheet <https://builds.apache.org/job/CXF-2.4.x/ws/2.4.x-fixes/testutils/src/main/resources/wsdl/type_test/type_test_ID_xsd.xsl>
     [xslt] Processing <https://builds.apache.org/job/CXF-2.4.x/ws/2.4.x-fixes/testutils/src/main/resources/wsdl/type_test/type_test.xsd>
to <https://builds.apache.org/job/CXF-2.4.x/ws/2.4.x-fixes/testutils/target/generated/src/main/resources/wsdl/type_test/type_test_doclit.wsdl>
     [xslt] Loading stylesheet <https://builds.apache.org/job/CXF-2.4.x/ws/2.4.x-fixes/testutils/src/main/resources/wsdl/type_test/type_test_wsdl.xsl>
     [xslt] Processing <https://builds.apache.org/job/CXF-2.4.x/ws/2.4.x-fixes/testutils/src/main/resources/wsdl/type_test/type_test.xsd>
to <https://builds.apache.org/job/CXF-2.4.x/ws/2.4.x-fixes/testutils/target/generated/src/main/resources/wsdl/type_test/type_test_rpclit.wsdl>
     [xslt] Loading stylesheet <https://builds.apache.org/job/CXF-2.4.x/ws/2.4.x-fixes/testutils/src/main/resources/wsdl/type_test/type_test_wsdl.xsl>
     [xslt] Processing <https://builds.apache.org/job/CXF-2.4.x/ws/2.4.x-fixes/testutils/src/main/resources/wsdl/type_test/type_test.xsd>
to <https://builds.apache.org/job/CXF-2.4.x/ws/2.4.x-fixes/testutils/target/generated/src/main/resources/wsdl/type_test/type_test_xml_inc.wsdl>
     [xslt] Loading stylesheet <https://builds.apache.org/job/CXF-2.4.x/ws/2.4.x-fixes/testutils/src/main/resources/wsdl/type_test/type_test_wsdl.xsl>
     [xslt] Processing <https://builds.apache.org/job/CXF-2.4.x/ws/2.4.x-fixes/testutils/src/main/resources/wsdl/type_test/type_test.xsd>
to <https://builds.apache.org/job/CXF-2.4.x/ws/2.4.x-fixes/testutils/target/generated/src/main/resources/wsdl/type_test/type_test_xml.wsdl>
     [xslt] Loading stylesheet <https://builds.apache.org/job/CXF-2.4.x/ws/2.4.x-fixes/testutils/src/main/resources/wsdl/type_test/type_test_xml_wsdl.xsl>
     [xslt] Processing <https://builds.apache.org/job/CXF-2.4.x/ws/2.4.x-fixes/testutils/src/main/resources/wsdl/type_test/type_test.xsd>
to <https://builds.apache.org/job/CXF-2.4.x/ws/2.4.x-fixes/testutils/target/generated/src/main/resources/wsdl/type_test/type_test_doclit_soap.wsdl>
     [xslt] Loading stylesheet <https://builds.apache.org/job/CXF-2.4.x/ws/2.4.x-fixes/testutils/src/main/resources/wsdl/type_test/type_test_soap_wsdl.xsl>
     [xslt] Processing <https://builds.apache.org/job/CXF-2.4.x/ws/2.4.x-fixes/testutils/src/main/resources/wsdl/type_test/type_test.xsd>
to <https://builds.apache.org/job/CXF-2.4.x/ws/2.4.x-fixes/testutils/target/generated/src/main/resources/wsdl/type_test/type_test_rpclit_soap.wsdl>
     [xslt] Loading stylesheet <https://builds.apache.org/job/CXF-2.4.x/ws/2.4.x-fixes/testutils/src/main/resources/wsdl/type_test/type_test_soap_wsdl.xsl>
    [mkdir] Created dir: <https://builds.apache.org/job/CXF-2.4.x/ws/2.4.x-fixes/testutils/target/generated/src/main/java/org/apache/cxf/systest/type_test>
     [xslt] Processing <https://builds.apache.org/job/CXF-2.4.x/ws/2.4.x-fixes/testutils/src/main/resources/wsdl/type_test/type_test.xsd>
to <https://builds.apache.org/job/CXF-2.4.x/ws/2.4.x-fixes/testutils/target/generated/src/main/java/org/apache/cxf/systest/type_test/TypeTestImpl.java>
     [xslt] Loading stylesheet <https://builds.apache.org/job/CXF-2.4.x/ws/2.4.x-fixes/testutils/src/main/resources/wsdl/type_test/type_test_impl_java.xsl>
     [xslt] Processing <https://builds.apache.org/job/CXF-2.4.x/ws/2.4.x-fixes/testutils/src/main/resources/wsdl/type_test/type_test.xsd>
to <https://builds.apache.org/job/CXF-2.4.x/ws/2.4.x-fixes/testutils/target/generated/src/main/java/org/apache/cxf/systest/type_test/TypeTestTester.java>
     [xslt] Loading stylesheet <https://builds.apache.org/job/CXF-2.4.x/ws/2.4.x-fixes/testutils/src/main/resources/wsdl/type_test/type_test_tester_java.xsl>
[INFO] Executed tasks
[INFO] Registering compile source root <https://builds.apache.org/job/CXF-2.4.x/ws/2.4.x-fixes/testutils/target/generated/src/main/java>
[INFO] [cxf-xml2fastinfoset:xml2fastinfoset {execution: xml2fastinfoset}]
[INFO] [cxf-codegen:wsdl2java {execution: generate-sources}]
[INFO] Running wsdl2java in fork mode...
[INFO] Building jar: /tmp/cxf-tmp-7940/cxf-codegen4232114627893426922.jar
[JENKINS] Archiving <https://builds.apache.org/job/CXF-2.4.x/ws/2.4.x-fixes/testutils/pom.xml>
to /home/hudson/hudson/jobs/CXF-2.4.x/modules/org.apache.cxf$cxf-testutils/builds/2011-07-21_21-10-43/archive/org.apache.cxf/cxf-testutils/2.4.2-SNAPSHOT/cxf-testutils-2.4.2-SNAPSHOT.pom
[INFO] ------------------------------------------------------------------------
[ERROR] BUILD ERROR
[INFO] ------------------------------------------------------------------------
[INFO] Could not create runtime jar

Embedded error: Problem creating jar: No space left on device
[INFO] ------------------------------------------------------------------------
[INFO] Trace
org.apache.maven.lifecycle.LifecycleExecutionException: Could not create runtime jar
	at org.apache.maven.lifecycle.DefaultLifecycleExecutor.executeGoals(DefaultLifecycleExecutor.java:719)
	at org.apache.maven.lifecycle.DefaultLifecycleExecutor.executeGoalWithLifecycle(DefaultLifecycleExecutor.java:556)
	at org.apache.maven.lifecycle.DefaultLifecycleExecutor.executeGoal(DefaultLifecycleExecutor.java:535)
	at org.apache.maven.lifecycle.DefaultLifecycleExecutor.executeGoalAndHandleFailures(DefaultLifecycleExecutor.java:387)
	at org.apache.maven.lifecycle.DefaultLifecycleExecutor.executeTaskSegments(DefaultLifecycleExecutor.java:348)
	at org.apache.maven.lifecycle.DefaultLifecycleExecutor.execute(DefaultLifecycleExecutor.java:180)
	at org.apache.maven.lifecycle.LifecycleExecutorInterceptor.execute(LifecycleExecutorInterceptor.java:65)
	at org.apache.maven.DefaultMaven.doExecute(DefaultMaven.java:328)
	at org.apache.maven.DefaultMaven.execute(DefaultMaven.java:138)
	at org.apache.maven.cli.MavenCli.main(MavenCli.java:362)
	at sun.reflect.NativeMethodAccessorImpl.invoke0(Native Method)
	at sun.reflect.NativeMethodAccessorImpl.invoke(NativeMethodAccessorImpl.java:39)
	at sun.reflect.DelegatingMethodAccessorImpl.invoke(DelegatingMethodAccessorImpl.java:25)
	at java.lang.reflect.Method.invoke(Method.java:592)
	at org.codehaus.classworlds.Launcher.launchEnhanced(Launcher.java:315)
	at org.codehaus.classworlds.Launcher.launch(Launcher.java:255)
	at hudson.maven.agent.Main.launch(Main.java:185)
	at hudson.maven.MavenBuilder.call(MavenBuilder.java:164)
	at hudson.maven.MavenModuleSetBuild$Builder.call(MavenModuleSetBuild.java:987)
	at hudson.maven.MavenModuleSetBuild$Builder.call(MavenModuleSetBuild.java:918)
	at hudson.remoting.UserRequest.perform(UserRequest.java:118)
	at hudson.remoting.UserRequest.perform(UserRequest.java:48)
	at hudson.remoting.Request$2.run(Request.java:270)
	at java.util.concurrent.Executors$RunnableAdapter.call(Executors.java:417)
	at java.util.concurrent.FutureTask$Sync.innerRun(FutureTask.java:269)
	at java.util.concurrent.FutureTask.run(FutureTask.java:123)
	at java.util.concurrent.ThreadPoolExecutor$Worker.runTask(ThreadPoolExecutor.java:651)
	at java.util.concurrent.ThreadPoolExecutor$Worker.run(ThreadPoolExecutor.java:676)
	at java.lang.Thread.run(Thread.java:595)
Caused by: org.apache.maven.plugin.MojoExecutionException: Could not create runtime jar
	at org.apache.cxf.maven_plugin.WSDL2JavaMojo.runForked(WSDL2JavaMojo.java:685)
	at org.apache.cxf.maven_plugin.WSDL2JavaMojo.forkOnce(WSDL2JavaMojo.java:530)
	at org.apache.cxf.maven_plugin.WSDL2JavaMojo.execute(WSDL2JavaMojo.java:433)
	at org.apache.maven.plugin.DefaultPluginManager.executeMojo(DefaultPluginManager.java:490)
	at hudson.maven.agent.PluginManagerInterceptor.executeMojo(PluginManagerInterceptor.java:182)
	at org.apache.maven.lifecycle.DefaultLifecycleExecutor.executeGoals(DefaultLifecycleExecutor.java:694)
	... 28 more
Caused by: org.codehaus.plexus.archiver.ArchiverException: Problem creating jar: No space
left on device
	at org.codehaus.plexus.archiver.AbstractArchiver.createArchive(AbstractArchiver.java:888)
	at org.apache.cxf.maven_plugin.WSDL2JavaMojo.runForked(WSDL2JavaMojo.java:678)
	... 33 more
Caused by: java.io.IOException: No space left on device
	at java.io.RandomAccessFile.writeBytes(Native Method)
	at java.io.RandomAccessFile.write(RandomAccessFile.java:456)
	at org.codehaus.plexus.archiver.zip.ZipOutputStream.writeOut(ZipOutputStream.java:925)
	at org.codehaus.plexus.archiver.zip.ZipOutputStream.writeOut(ZipOutputStream.java:912)
	at org.codehaus.plexus.archiver.zip.ZipOutputStream.writeLocalFileHeader(ZipOutputStream.java:627)
	at org.codehaus.plexus.archiver.zip.ZipOutputStream.putNextEntry(ZipOutputStream.java:451)
	at org.codehaus.plexus.archiver.zip.AbstractZipArchiver.zipDir(AbstractZipArchiver.java:640)
	at org.codehaus.plexus.archiver.jar.JarArchiver.writeManifest(JarArchiver.java:408)
	at org.codehaus.plexus.archiver.jar.JarArchiver.initZipOutputStream(JarArchiver.java:344)
	at org.codehaus.plexus.archiver.zip.AbstractZipArchiver.createArchiveMain(AbstractZipArchiver.java:346)
	at org.codehaus.plexus.archiver.zip.AbstractZipArchiver.execute(AbstractZipArchiver.java:250)
	at org.codehaus.plexus.archiver.AbstractArchiver.createArchive(AbstractArchiver.java:871)
	... 34 more
[INFO] ------------------------------------------------------------------------
[INFO] Total time: 49 seconds
[INFO] Finished at: Thu Jul 21 21:04:48 GMT 2011
[INFO] Final Memory: 95M/125M
[INFO] ------------------------------------------------------------------------
Sending e-mails to: notifications@cxf.apache.org
Sending e-mails to: notifications@cxf.apache.org
channel stopped
ERROR: Failed to parse POMs
java.io.IOException: Remote call on Channel to Maven [/home/hudson/tools/java/latest1.5/bin/java,
-da, -dsa, -XX:MaxPermSize=192m, -Xmx512M, -cp, /home/jenkins/jenkins-slave/maven-agent.jar:/home/jenkins/jenkins-slave/classworlds.jar,
hudson.maven.agent.Main, /home/hudson/tools/maven/apache-maven-2.2.1, /x1/jenkins/jenkins-slave/slave.jar,
/home/jenkins/jenkins-slave/maven-interceptor.jar, 49253, /home/jenkins/jenkins-slave/maven2.1-interceptor.jar]
failed
	at hudson.remoting.Channel.call(Channel.java:670)
	at hudson.maven.ProcessCache$MavenProcess.call(ProcessCache.java:156)
	at hudson.maven.MavenModuleSetBuild$RunnerImpl.doRun(MavenModuleSetBuild.java:736)
	at hudson.model.AbstractBuild$AbstractRunner.run(AbstractBuild.java:429)
	at hudson.model.Run.run(Run.java:1374)
	at hudson.maven.MavenModuleSetBuild.run(MavenModuleSetBuild.java:467)
	at hudson.model.ResourceController.execute(ResourceController.java:88)
	at hudson.model.Executor.run(Executor.java:145)
Caused by: java.lang.Error: Unable to load resource hudson/maven/Messages.properties
	at hudson.remoting.RemoteClassLoader.findResource(RemoteClassLoader.java:198)
	at java.lang.ClassLoader.getResource(ClassLoader.java:979)
	at java.lang.Class.getResource(Class.java:2042)
	at org.jvnet.localizer.ResourceBundleHolder.get(ResourceBundleHolder.java:83)
	at org.jvnet.localizer.ResourceBundleHolder.get(ResourceBundleHolder.java:102)
	at org.jvnet.localizer.ResourceBundleHolder.get(ResourceBundleHolder.java:102)
	at org.jvnet.localizer.ResourceBundleHolder.format(ResourceBundleHolder.java:139)
	at hudson.maven.Messages.MavenBuilder_Waiting(Messages.java:347)
	at hudson.maven.MavenBuilder.call(MavenBuilder.java:173)
	at hudson.maven.MavenModuleSetBuild$Builder.call(MavenModuleSetBuild.java:987)
	at hudson.maven.MavenModuleSetBuild$Builder.call(MavenModuleSetBuild.java:918)
	at hudson.remoting.UserRequest.perform(UserRequest.java:118)
	at hudson.remoting.UserRequest.perform(UserRequest.java:48)
	at hudson.remoting.Request$2.run(Request.java:270)
	at java.util.concurrent.Executors$RunnableAdapter.call(Executors.java:417)
	at java.util.concurrent.FutureTask$Sync.innerRun(FutureTask.java:269)
	at java.util.concurrent.FutureTask.run(FutureTask.java:123)
	at java.util.concurrent.ThreadPoolExecutor$Worker.runTask(ThreadPoolExecutor.java:651)
	at java.util.concurrent.ThreadPoolExecutor$Worker.run(ThreadPoolExecutor.java:676)
	at java.lang.Thread.run(Thread.java:595)
Caused by: java.io.FileNotFoundException: /tmp/hudson-remoting1282919277065078324/hudson/maven/Messages.properties
(No such file or directory)
	at java.io.FileOutputStream.open(Native Method)
	at java.io.FileOutputStream.<init>(FileOutputStream.java:179)
	at java.io.FileOutputStream.<init>(FileOutputStream.java:131)
	at hudson.remoting.RemoteClassLoader.makeResource(RemoteClassLoader.java:266)
	at hudson.remoting.RemoteClassLoader.findResource(RemoteClassLoader.java:194)
	... 19 more


Mime
View raw message