cxf-notifications mailing list archives

Site index · List index
Message view « Date » · « Thread »
Top « Date » · « Thread »
From Apache Jenkins Server <jenk...@builds.apache.org>
Subject Build failed in Jenkins: CXF-Trunk-JDK15 #2204
Date Fri, 08 Jul 2011 18:14:30 GMT
See <https://builds.apache.org/job/CXF-Trunk-JDK15/2204/changes>

Changes:

[coheigea] [CXF-3624] - BinarySecurityToken validated by STSTokenValidator doesn't satisfy
IssuedToken policy

[sergeyb] [CXF-3588] Referencing rs-security system test module

------------------------------------------
Started by an SCM change
Building remotely on ubuntu3
Updating http://svn.apache.org/repos/asf/cxf/trunk
U         rt/ws/security/src/main/java/org/apache/cxf/ws/security/policy/interceptors/IssuedTokenInterceptorProvider.java
U         rt/ws/security/src/main/java/org/apache/cxf/ws/security/wss4j/policyvalidators/IssuedTokenPolicyValidator.java
U         rt/ws/security/src/main/java/org/apache/cxf/ws/security/wss4j/policyvalidators/SamlTokenPolicyValidator.java
U         rt/ws/security/src/main/java/org/apache/cxf/ws/security/wss4j/policyvalidators/UsernameTokenPolicyValidator.java
U         systests/pom.xml
At revision 1144411
WARNING: clock of the subversion server appears to be out of sync. This can result in inconsistent
check out behavior.
ERROR: Ignore Problem expanding maven opts macros org.jenkinsci.plugins.tokenmacro.TokenMacro
Found mavenVersion 2.2.1 from file jar:file:/home/hudson/tools/maven/apache-maven-2.2.1/lib/maven-2.2.1-uber.jar!/META-INF/maven/org.apache.maven/maven-core/pom.properties
[locks-and-latches] Checking to see if we really have the locks
[locks-and-latches] Have all the locks, build can start
Parsing POMs
ERROR: Ignore Problem expanding maven opts macros org.jenkinsci.plugins.tokenmacro.TokenMacro
[trunk] $ /home/hudson/tools/java/latest1.5/bin/java -ea -XX:MaxPermSize=192m -Xmx512M -cp
/home/jenkins/jenkins-slave/maven-agent.jar:/home/jenkins/jenkins-slave/classworlds.jar hudson.maven.agent.Main
/home/hudson/tools/maven/apache-maven-2.2.1 /x1/jenkins/jenkins-slave/slave.jar /home/jenkins/jenkins-slave/maven-interceptor.jar
56266 /home/jenkins/jenkins-slave/maven2.1-interceptor.jar
<===[HUDSON REMOTING CAPACITY]===>   channel started
Executing Maven:  -B -f <https://builds.apache.org/job/CXF-Trunk-JDK15/ws/trunk/pom.xml>
-Dmaven.repo.local=<https://builds.apache.org/job/CXF-Trunk-JDK15/ws/.repository> -U
-cpu -B -e clean install
+ Error stacktraces are turned on.
[INFO] Scanning for projects...
[INFO] ------------------------------------------------------------------------
[ERROR] BUILD FAILURE
[INFO] ------------------------------------------------------------------------
[INFO] Project 'org.apache.cxf.systests:cxf-systests-jaxrs' is duplicated in the reactor
[INFO] ------------------------------------------------------------------------
[INFO] Trace
org.apache.maven.BuildFailureException: Project 'org.apache.cxf.systests:cxf-systests-jaxrs'
is duplicated in the reactor
	at org.apache.maven.DefaultMaven.doExecute(DefaultMaven.java:300)
	at org.apache.maven.DefaultMaven.execute(DefaultMaven.java:138)
	at org.apache.maven.cli.MavenCli.main(MavenCli.java:362)
	at sun.reflect.NativeMethodAccessorImpl.invoke0(Native Method)
	at sun.reflect.NativeMethodAccessorImpl.invoke(NativeMethodAccessorImpl.java:39)
	at sun.reflect.DelegatingMethodAccessorImpl.invoke(DelegatingMethodAccessorImpl.java:25)
	at java.lang.reflect.Method.invoke(Method.java:592)
	at org.codehaus.classworlds.Launcher.launchEnhanced(Launcher.java:315)
	at org.codehaus.classworlds.Launcher.launch(Launcher.java:255)
	at hudson.maven.agent.Main.launch(Main.java:185)
	at hudson.maven.MavenBuilder.call(MavenBuilder.java:164)
	at hudson.maven.MavenModuleSetBuild$Builder.call(MavenModuleSetBuild.java:987)
	at hudson.maven.MavenModuleSetBuild$Builder.call(MavenModuleSetBuild.java:918)
	at hudson.remoting.UserRequest.perform(UserRequest.java:118)
	at hudson.remoting.UserRequest.perform(UserRequest.java:48)
	at hudson.remoting.Request$2.run(Request.java:270)
	at java.util.concurrent.Executors$RunnableAdapter.call(Executors.java:417)
	at java.util.concurrent.FutureTask$Sync.innerRun(FutureTask.java:269)
	at java.util.concurrent.FutureTask.run(FutureTask.java:123)
	at java.util.concurrent.ThreadPoolExecutor$Worker.runTask(ThreadPoolExecutor.java:651)
	at java.util.concurrent.ThreadPoolExecutor$Worker.run(ThreadPoolExecutor.java:676)
	at java.lang.Thread.run(Thread.java:595)
Caused by: org.apache.maven.project.DuplicateProjectException: Project 'org.apache.cxf.systests:cxf-systests-jaxrs'
is duplicated in the reactor
	at org.apache.maven.project.ProjectSorter.<init>(ProjectSorter.java:93)
	at org.apache.maven.execution.ReactorManager.<init>(ReactorManager.java:99)
	at org.apache.maven.DefaultMaven.doExecute(DefaultMaven.java:288)
	... 21 more
[INFO] ------------------------------------------------------------------------
[INFO] Total time: 3 seconds
[INFO] Finished at: Fri Jul 08 18:11:28 GMT 2011
[INFO] Final Memory: 13M/55M
[INFO] ------------------------------------------------------------------------
channel stopped
[locks-and-latches] Releasing all the locks
[locks-and-latches] All the locks released


Mime
View raw message