cxf-notifications mailing list archives

Site index · List index
Message view « Date » · « Thread »
Top « Date » · « Thread »
From Apache Jenkins Server <jenk...@builds.apache.org>
Subject Build failed in Jenkins: CXF-Trunk-JDK15 » Apache CXF Test Utilities #2237
Date Thu, 21 Jul 2011 19:40:47 GMT
See <https://builds.apache.org/job/CXF-Trunk-JDK15/org.apache.cxf$cxf-testutils/2237/>

------------------------------------------
[INFO] ------------------------------------------------------------------------
[INFO] Building Apache CXF Test Utilities
[INFO]    task-segment: [clean, install]
[INFO] ------------------------------------------------------------------------
[INFO] [clean:clean {execution: default-clean}]
[INFO] Deleting <https://builds.apache.org/job/CXF-Trunk-JDK15/org.apache.cxf$cxf-testutils/ws/target>
[WARNING] DEPRECATED [sourceRoot]: Use the build-helper-maven-plugin to bind source directories
[INFO] [antrun:run {execution: validate}]
project.artifactId
[INFO] Executing tasks
    [mkdir] Created dir: <https://builds.apache.org/job/CXF-Trunk-JDK15/org.apache.cxf$cxf-testutils/ws/target/generated/src/main/resources/wsdl/type_test>
     [xslt] Processing <https://builds.apache.org/job/CXF-Trunk-JDK15/org.apache.cxf$cxf-testutils/ws/src/main/resources/wsdl/type_test/type_test.xsd>
to <https://builds.apache.org/job/CXF-Trunk-JDK15/org.apache.cxf$cxf-testutils/ws/target/generated/src/main/resources/wsdl/type_test/type_test_1.xsd>
     [xslt] Loading stylesheet <https://builds.apache.org/job/CXF-Trunk-JDK15/org.apache.cxf$cxf-testutils/ws/src/main/resources/wsdl/type_test/type_test_ID_xsd.xsl>
     [xslt] Processing <https://builds.apache.org/job/CXF-Trunk-JDK15/org.apache.cxf$cxf-testutils/ws/src/main/resources/wsdl/type_test/type_test.xsd>
to <https://builds.apache.org/job/CXF-Trunk-JDK15/org.apache.cxf$cxf-testutils/ws/target/generated/src/main/resources/wsdl/type_test/type_test_2.xsd>
     [xslt] Loading stylesheet <https://builds.apache.org/job/CXF-Trunk-JDK15/org.apache.cxf$cxf-testutils/ws/src/main/resources/wsdl/type_test/type_test_ID_xsd.xsl>
     [xslt] Processing <https://builds.apache.org/job/CXF-Trunk-JDK15/org.apache.cxf$cxf-testutils/ws/src/main/resources/wsdl/type_test/type_test.xsd>
to <https://builds.apache.org/job/CXF-Trunk-JDK15/org.apache.cxf$cxf-testutils/ws/target/generated/src/main/resources/wsdl/type_test/type_test_3.xsd>
     [xslt] Loading stylesheet <https://builds.apache.org/job/CXF-Trunk-JDK15/org.apache.cxf$cxf-testutils/ws/src/main/resources/wsdl/type_test/type_test_ID_xsd.xsl>
     [xslt] Processing <https://builds.apache.org/job/CXF-Trunk-JDK15/org.apache.cxf$cxf-testutils/ws/src/main/resources/wsdl/type_test/type_test.xsd>
to <https://builds.apache.org/job/CXF-Trunk-JDK15/org.apache.cxf$cxf-testutils/ws/target/generated/src/main/resources/wsdl/type_test/type_test_doclit.wsdl>
     [xslt] Loading stylesheet <https://builds.apache.org/job/CXF-Trunk-JDK15/org.apache.cxf$cxf-testutils/ws/src/main/resources/wsdl/type_test/type_test_wsdl.xsl>
     [xslt] Processing <https://builds.apache.org/job/CXF-Trunk-JDK15/org.apache.cxf$cxf-testutils/ws/src/main/resources/wsdl/type_test/type_test.xsd>
to <https://builds.apache.org/job/CXF-Trunk-JDK15/org.apache.cxf$cxf-testutils/ws/target/generated/src/main/resources/wsdl/type_test/type_test_rpclit.wsdl>
     [xslt] Loading stylesheet <https://builds.apache.org/job/CXF-Trunk-JDK15/org.apache.cxf$cxf-testutils/ws/src/main/resources/wsdl/type_test/type_test_wsdl.xsl>
     [xslt] Processing <https://builds.apache.org/job/CXF-Trunk-JDK15/org.apache.cxf$cxf-testutils/ws/src/main/resources/wsdl/type_test/type_test.xsd>
to <https://builds.apache.org/job/CXF-Trunk-JDK15/org.apache.cxf$cxf-testutils/ws/target/generated/src/main/resources/wsdl/type_test/type_test_xml_inc.wsdl>
     [xslt] Loading stylesheet <https://builds.apache.org/job/CXF-Trunk-JDK15/org.apache.cxf$cxf-testutils/ws/src/main/resources/wsdl/type_test/type_test_wsdl.xsl>
     [xslt] Processing <https://builds.apache.org/job/CXF-Trunk-JDK15/org.apache.cxf$cxf-testutils/ws/src/main/resources/wsdl/type_test/type_test.xsd>
to <https://builds.apache.org/job/CXF-Trunk-JDK15/org.apache.cxf$cxf-testutils/ws/target/generated/src/main/resources/wsdl/type_test/type_test_xml.wsdl>
     [xslt] Loading stylesheet <https://builds.apache.org/job/CXF-Trunk-JDK15/org.apache.cxf$cxf-testutils/ws/src/main/resources/wsdl/type_test/type_test_xml_wsdl.xsl>
     [xslt] Processing <https://builds.apache.org/job/CXF-Trunk-JDK15/org.apache.cxf$cxf-testutils/ws/src/main/resources/wsdl/type_test/type_test.xsd>
to <https://builds.apache.org/job/CXF-Trunk-JDK15/org.apache.cxf$cxf-testutils/ws/target/generated/src/main/resources/wsdl/type_test/type_test_doclit_soap.wsdl>
     [xslt] Loading stylesheet <https://builds.apache.org/job/CXF-Trunk-JDK15/org.apache.cxf$cxf-testutils/ws/src/main/resources/wsdl/type_test/type_test_soap_wsdl.xsl>
     [xslt] Processing <https://builds.apache.org/job/CXF-Trunk-JDK15/org.apache.cxf$cxf-testutils/ws/src/main/resources/wsdl/type_test/type_test.xsd>
to <https://builds.apache.org/job/CXF-Trunk-JDK15/org.apache.cxf$cxf-testutils/ws/target/generated/src/main/resources/wsdl/type_test/type_test_rpclit_soap.wsdl>
     [xslt] Loading stylesheet <https://builds.apache.org/job/CXF-Trunk-JDK15/org.apache.cxf$cxf-testutils/ws/src/main/resources/wsdl/type_test/type_test_soap_wsdl.xsl>
    [mkdir] Created dir: <https://builds.apache.org/job/CXF-Trunk-JDK15/org.apache.cxf$cxf-testutils/ws/target/generated/src/main/java/org/apache/cxf/systest/type_test>
     [xslt] Processing <https://builds.apache.org/job/CXF-Trunk-JDK15/org.apache.cxf$cxf-testutils/ws/src/main/resources/wsdl/type_test/type_test.xsd>
to <https://builds.apache.org/job/CXF-Trunk-JDK15/org.apache.cxf$cxf-testutils/ws/target/generated/src/main/java/org/apache/cxf/systest/type_test/TypeTestImpl.java>
     [xslt] Loading stylesheet <https://builds.apache.org/job/CXF-Trunk-JDK15/org.apache.cxf$cxf-testutils/ws/src/main/resources/wsdl/type_test/type_test_impl_java.xsl>
     [xslt] Processing <https://builds.apache.org/job/CXF-Trunk-JDK15/org.apache.cxf$cxf-testutils/ws/src/main/resources/wsdl/type_test/type_test.xsd>
to <https://builds.apache.org/job/CXF-Trunk-JDK15/org.apache.cxf$cxf-testutils/ws/target/generated/src/main/java/org/apache/cxf/systest/type_test/TypeTestTester.java>
     [xslt] Loading stylesheet <https://builds.apache.org/job/CXF-Trunk-JDK15/org.apache.cxf$cxf-testutils/ws/src/main/resources/wsdl/type_test/type_test_tester_java.xsl>
[INFO] Executed tasks
[INFO] Registering compile source root <https://builds.apache.org/job/CXF-Trunk-JDK15/org.apache.cxf$cxf-testutils/ws/target/generated/src/main/java>
[INFO] [cxf-xml2fastinfoset:xml2fastinfoset {execution: xml2fastinfoset}]
[INFO] [cxf-codegen:wsdl2java {execution: generate-sources}]
[INFO] Running wsdl2java in fork mode...
[INFO] Building jar: /tmp/cxf-tmp-772267/cxf-codegen3240974204323468232.jar
[INFO] 
#
# An unexpected error has been detected by HotSpot Virtual Machine:
#
#  SIGBUS (0x7) at pc=0xf76d17a4, pid=32313, tid=4149999296
#
# Java VM: Java HotSpot(TM) Server VM (1.5.0_22-b03 mixed mode)
# Problematic frame:
#
[JENKINS] Archiving <https://builds.apache.org/job/CXF-Trunk-JDK15/org.apache.cxf$cxf-testutils/ws/pom.xml>
to /home/hudson/hudson/jobs/CXF-Trunk-JDK15/modules/org.apache.cxf$cxf-testutils/builds/2011-07-21_19-39-23/archive/org.apache.cxf/cxf-testutils/2.5.0-SNAPSHOT/cxf-testutils-2.5.0-SNAPSHOT.pom
[INFO] ------------------------------------------------------------------------
[ERROR] BUILD ERROR
[INFO] ------------------------------------------------------------------------
[INFO] 
Exit code: 139 - Segmentation fault

Command line was: /x1/jenkins/tools/java/jdk1.5.0_22-32/jre/bin/java -jar /tmp/cxf-tmp-772267/cxf-codegen3240974204323468232.jar
/tmp/cxf-tmp-772267/cxf-w2j7035677637471845169args


[INFO] ------------------------------------------------------------------------
[INFO] Trace
org.apache.maven.lifecycle.LifecycleExecutionException: 
Exit code: 139 - Segmentation fault

Command line was: /x1/jenkins/tools/java/jdk1.5.0_22-32/jre/bin/java -jar /tmp/cxf-tmp-772267/cxf-codegen3240974204323468232.jar
/tmp/cxf-tmp-772267/cxf-w2j7035677637471845169args


	at org.apache.maven.lifecycle.DefaultLifecycleExecutor.executeGoals(DefaultLifecycleExecutor.java:719)
	at org.apache.maven.lifecycle.DefaultLifecycleExecutor.executeGoalWithLifecycle(DefaultLifecycleExecutor.java:556)
	at org.apache.maven.lifecycle.DefaultLifecycleExecutor.executeGoal(DefaultLifecycleExecutor.java:535)
	at org.apache.maven.lifecycle.DefaultLifecycleExecutor.executeGoalAndHandleFailures(DefaultLifecycleExecutor.java:387)
	at org.apache.maven.lifecycle.DefaultLifecycleExecutor.executeTaskSegments(DefaultLifecycleExecutor.java:348)
	at org.apache.maven.lifecycle.DefaultLifecycleExecutor.execute(DefaultLifecycleExecutor.java:180)
	at org.apache.maven.lifecycle.LifecycleExecutorInterceptor.execute(LifecycleExecutorInterceptor.java:65)
	at org.apache.maven.DefaultMaven.doExecute(DefaultMaven.java:328)
	at org.apache.maven.DefaultMaven.execute(DefaultMaven.java:138)
	at org.apache.maven.cli.MavenCli.main(MavenCli.java:362)
	at sun.reflect.NativeMethodAccessorImpl.invoke0(Native Method)
	at sun.reflect.NativeMethodAccessorImpl.invoke(NativeMethodAccessorImpl.java:39)
	at sun.reflect.DelegatingMethodAccessorImpl.invoke(DelegatingMethodAccessorImpl.java:25)
	at java.lang.reflect.Method.invoke(Method.java:592)
	at org.codehaus.classworlds.Launcher.launchEnhanced(Launcher.java:315)
	at org.codehaus.classworlds.Launcher.launch(Launcher.java:255)
	at hudson.maven.agent.Main.launch(Main.java:185)
	at hudson.maven.MavenBuilder.call(MavenBuilder.java:164)
	at hudson.maven.MavenModuleSetBuild$Builder.call(MavenModuleSetBuild.java:987)
	at hudson.maven.MavenModuleSetBuild$Builder.call(MavenModuleSetBuild.java:918)
	at hudson.remoting.UserRequest.perform(UserRequest.java:118)
	at hudson.remoting.UserRequest.perform(UserRequest.java:48)
	at hudson.remoting.Request$2.run(Request.java:270)
	at java.util.concurrent.Executors$RunnableAdapter.call(Executors.java:417)
	at java.util.concurrent.FutureTask$Sync.innerRun(FutureTask.java:269)
	at java.util.concurrent.FutureTask.run(FutureTask.java:123)
	at java.util.concurrent.ThreadPoolExecutor$Worker.runTask(ThreadPoolExecutor.java:651)
	at java.util.concurrent.ThreadPoolExecutor$Worker.run(ThreadPoolExecutor.java:676)
	at java.lang.Thread.run(Thread.java:595)
Caused by: org.apache.maven.plugin.MojoExecutionException: 
Exit code: 139 - Segmentation fault

Command line was: /x1/jenkins/tools/java/jdk1.5.0_22-32/jre/bin/java -jar /tmp/cxf-tmp-772267/cxf-codegen3240974204323468232.jar
/tmp/cxf-tmp-772267/cxf-w2j7035677637471845169args


	at org.apache.cxf.maven_plugin.WSDL2JavaMojo.runForked(WSDL2JavaMojo.java:718)
	at org.apache.cxf.maven_plugin.WSDL2JavaMojo.forkOnce(WSDL2JavaMojo.java:530)
	at org.apache.cxf.maven_plugin.WSDL2JavaMojo.execute(WSDL2JavaMojo.java:433)
	at org.apache.maven.plugin.DefaultPluginManager.executeMojo(DefaultPluginManager.java:490)
	at hudson.maven.agent.PluginManagerInterceptor.executeMojo(PluginManagerInterceptor.java:182)
	at org.apache.maven.lifecycle.DefaultLifecycleExecutor.executeGoals(DefaultLifecycleExecutor.java:694)
	... 28 more
[INFO] ------------------------------------------------------------------------
[INFO] Total time: 1 minute 12 seconds
[INFO] Finished at: Thu Jul 21 19:33:53 GMT 2011
[INFO] Final Memory: 95M/150M
[INFO] ------------------------------------------------------------------------


Mime
View raw message