cxf-notifications mailing list archives

Site index · List index
Message view « Date » · « Thread »
Top « Date » · « Thread »
From Apache Jenkins Server <jenk...@builds.apache.org>
Subject Build failed in Jenkins: CXF-Trunk-JDK15 » Apache CXF Runtime Colocated Binding #2140
Date Wed, 08 Jun 2011 08:59:06 GMT
See <https://builds.apache.org/job/CXF-Trunk-JDK15/org.apache.cxf$cxf-rt-bindings-coloc/2140/changes>

Changes:

[ay] [CXF-3577] add dispatch source support for coloc

------------------------------------------
[INFO] ------------------------------------------------------------------------
[INFO] Building Apache CXF Runtime Colocated Binding
[INFO]    task-segment: [clean, install]
[INFO] ------------------------------------------------------------------------
[INFO] [clean:clean {execution: default-clean}]
[INFO] Deleting <https://builds.apache.org/job/CXF-Trunk-JDK15/org.apache.cxf$cxf-rt-bindings-coloc/ws/target>
[INFO] [cxf-xml2fastinfoset:xml2fastinfoset {execution: xml2fastinfoset}]
[INFO] [remote-resources:process {execution: default}]
[INFO] [resources:resources {execution: default-resources}]
[INFO] Using 'UTF-8' encoding to copy filtered resources.
[INFO] Copying 1 resource
[INFO] Copying 4 resources
[INFO] skip non existing resourceDirectory <https://builds.apache.org/job/CXF-Trunk-JDK15/org.apache.cxf$cxf-rt-bindings-coloc/ws/src/main/resources-filtered>
[INFO] skip non existing resourceDirectory <https://builds.apache.org/job/CXF-Trunk-JDK15/org.apache.cxf$cxf-rt-bindings-coloc/ws/target/generated/src/main/resources>
[INFO] Copying 3 resources
[INFO] [compiler:compile {execution: default-compile}]
[INFO] Compiling 11 source files to <https://builds.apache.org/job/CXF-Trunk-JDK15/org.apache.cxf$cxf-rt-bindings-coloc/ws/target/classes>
[INFO] -------------------------------------------------------------
[ERROR] COMPILATION ERROR : 
[INFO] -------------------------------------------------------------
[ERROR] <https://builds.apache.org/job/CXF-Trunk-JDK15/org.apache.cxf$cxf-rt-bindings-coloc/ws/src/main/java/org/apache/cxf/binding/coloc/ColocUtil.java>:[31,22]
package javax.xml.soap does not exist
[ERROR] <https://builds.apache.org/job/CXF-Trunk-JDK15/org.apache.cxf$cxf-rt-bindings-coloc/ws/src/main/java/org/apache/cxf/binding/coloc/ColocUtil.java>:[185,49]
cannot find symbol
symbol  : class SOAPMessage
location: class org.apache.cxf.binding.coloc.ColocUtil
[ERROR] <https://builds.apache.org/job/CXF-Trunk-JDK15/org.apache.cxf$cxf-rt-bindings-coloc/ws/src/main/java/org/apache/cxf/binding/coloc/ColocUtil.java>:[186,49]
cannot find symbol
symbol  : class SOAPMessage
location: class org.apache.cxf.binding.coloc.ColocUtil
[INFO] 3 errors 
[INFO] -------------------------------------------------------------
[JENKINS] Archiving <https://builds.apache.org/job/CXF-Trunk-JDK15/org.apache.cxf$cxf-rt-bindings-coloc/ws/pom.xml>
to /home/hudson/hudson/jobs/CXF-Trunk-JDK15/modules/org.apache.cxf$cxf-rt-bindings-coloc/builds/2011-06-08_08-47-41/archive/org.apache.cxf/cxf-rt-bindings-coloc/2.4.1-SNAPSHOT/cxf-rt-bindings-coloc-2.4.1-SNAPSHOT.pom
[INFO] ------------------------------------------------------------------------
[ERROR] BUILD FAILURE
[INFO] ------------------------------------------------------------------------
[INFO] Compilation failure

<https://builds.apache.org/job/CXF-Trunk-JDK15/org.apache.cxf$cxf-rt-bindings-coloc/ws/src/main/java/org/apache/cxf/binding/coloc/ColocUtil.java>:[31,22]
package javax.xml.soap does not exist
<https://builds.apache.org/job/CXF-Trunk-JDK15/org.apache.cxf$cxf-rt-bindings-coloc/ws/src/main/java/org/apache/cxf/binding/coloc/ColocUtil.java>:[185,49]
cannot find symbol
symbol  : class SOAPMessage
location: class org.apache.cxf.binding.coloc.ColocUtil
<https://builds.apache.org/job/CXF-Trunk-JDK15/org.apache.cxf$cxf-rt-bindings-coloc/ws/src/main/java/org/apache/cxf/binding/coloc/ColocUtil.java>:[186,49]
cannot find symbol
symbol  : class SOAPMessage
location: class org.apache.cxf.binding.coloc.ColocUtil

[INFO] ------------------------------------------------------------------------
[INFO] Trace
org.apache.maven.BuildFailureException: Compilation failure
	at org.apache.maven.lifecycle.DefaultLifecycleExecutor.executeGoals(DefaultLifecycleExecutor.java:715)
	at org.apache.maven.lifecycle.DefaultLifecycleExecutor.executeGoalWithLifecycle(DefaultLifecycleExecutor.java:556)
	at org.apache.maven.lifecycle.DefaultLifecycleExecutor.executeGoal(DefaultLifecycleExecutor.java:535)
	at org.apache.maven.lifecycle.DefaultLifecycleExecutor.executeGoalAndHandleFailures(DefaultLifecycleExecutor.java:387)
	at org.apache.maven.lifecycle.DefaultLifecycleExecutor.executeTaskSegments(DefaultLifecycleExecutor.java:348)
	at org.apache.maven.lifecycle.DefaultLifecycleExecutor.execute(DefaultLifecycleExecutor.java:180)
	at org.apache.maven.lifecycle.LifecycleExecutorInterceptor.execute(LifecycleExecutorInterceptor.java:65)
	at org.apache.maven.DefaultMaven.doExecute(DefaultMaven.java:328)
	at org.apache.maven.DefaultMaven.execute(DefaultMaven.java:138)
	at org.apache.maven.cli.MavenCli.main(MavenCli.java:362)
	at sun.reflect.NativeMethodAccessorImpl.invoke0(Native Method)
	at sun.reflect.NativeMethodAccessorImpl.invoke(NativeMethodAccessorImpl.java:39)
	at sun.reflect.DelegatingMethodAccessorImpl.invoke(DelegatingMethodAccessorImpl.java:25)
	at java.lang.reflect.Method.invoke(Method.java:592)
	at org.codehaus.classworlds.Launcher.launchEnhanced(Launcher.java:315)
	at org.codehaus.classworlds.Launcher.launch(Launcher.java:255)
	at hudson.maven.agent.Main.launch(Main.java:185)
	at hudson.maven.MavenBuilder.call(MavenBuilder.java:164)
	at hudson.maven.MavenModuleSetBuild$Builder.call(MavenModuleSetBuild.java:987)
	at hudson.maven.MavenModuleSetBuild$Builder.call(MavenModuleSetBuild.java:918)
	at hudson.remoting.UserRequest.perform(UserRequest.java:118)
	at hudson.remoting.UserRequest.perform(UserRequest.java:48)
	at hudson.remoting.Request$2.run(Request.java:270)
	at java.util.concurrent.Executors$RunnableAdapter.call(Executors.java:417)
	at java.util.concurrent.FutureTask$Sync.innerRun(FutureTask.java:269)
	at java.util.concurrent.FutureTask.run(FutureTask.java:123)
	at java.util.concurrent.ThreadPoolExecutor$Worker.runTask(ThreadPoolExecutor.java:651)
	at java.util.concurrent.ThreadPoolExecutor$Worker.run(ThreadPoolExecutor.java:676)
	at java.lang.Thread.run(Thread.java:595)
Caused by: org.apache.maven.plugin.CompilationFailureException: Compilation failure
	at org.apache.maven.plugin.AbstractCompilerMojo.execute(AbstractCompilerMojo.java:656)
	at org.apache.maven.plugin.CompilerMojo.execute(CompilerMojo.java:128)
	at org.apache.maven.plugin.DefaultPluginManager.executeMojo(DefaultPluginManager.java:490)
	at hudson.maven.agent.PluginManagerInterceptor.executeMojo(PluginManagerInterceptor.java:182)
	at org.apache.maven.lifecycle.DefaultLifecycleExecutor.executeGoals(DefaultLifecycleExecutor.java:694)
	... 28 more
[INFO] ------------------------------------------------------------------------
[INFO] Total time: 10 minutes 45 seconds
[INFO] Finished at: Wed Jun 08 08:59:05 UTC 2011
[INFO] Final Memory: 97M/145M
[INFO] ------------------------------------------------------------------------


Mime
View raw message