cxf-notifications mailing list archives

Site index · List index
Message view « Date » · « Thread »
Top « Date » · « Thread »
From Apache Jenkins Server <jenk...@builds.apache.org>
Subject Build failed in Jenkins: CXF-2.3.x-windows #170
Date Tue, 07 Jun 2011 16:18:29 GMT
See <https://builds.apache.org/job/CXF-2.3.x-windows/170/changes>

Changes:

[dkulp] Merged revisions 1133026 via svnmerge from 
https://svn.apache.org/repos/asf/cxf/trunk

........
  r1133026 | dkulp | 2011-06-07 10:32:10 -0400 (Tue, 07 Jun 2011) | 1 line
  
  Remove wstrust 1.3 from build as it's down right now.
........

[dkulp] Merged revisions 1133009 via svnmerge from 
https://svn.apache.org/repos/asf/cxf/trunk

........
  r1133009 | ningjiang | 2011-06-07 09:43:53 -0400 (Tue, 07 Jun 2011) | 1 line
  
  CXF-3572 Add a check of the message content list to avoid the OoM error from the HolderOutInterceptor
........

[dkulp] Merged revisions 1132762 via svnmerge from 
https://svn.apache.org/repos/asf/cxf/trunk

........
  r1132762 | dkulp | 2011-06-06 16:50:28 -0400 (Mon, 06 Jun 2011) | 1 line
  
  LocalTransportFactory isn't thread safe
........

[dkulp] Merged revisions 1130684 via svnmerge from 
https://svn.apache.org/repos/asf/cxf/trunk

........
  r1130684 | dkulp | 2011-06-02 13:45:05 -0400 (Thu, 02 Jun 2011) | 1 line
  
  [CXF-3453] Add more error codes for the invalid attribute issues
........

[dkulp] Merged revisions 1130181 via svnmerge from 
https://svn.apache.org/repos/asf/cxf/trunk

........
  r1130181 | dkulp | 2011-06-01 11:10:09 -0400 (Wed, 01 Jun 2011) | 1 line
  
  Use the methods in Compiler class to find javac
........

[dkulp] Merged revisions 1129987 via svnmerge from 
https://svn.apache.org/repos/asf/cxf/trunk

........
  r1129987 | dkulp | 2011-05-31 23:06:39 -0400 (Tue, 31 May 2011) | 2 lines
  
  [CXF-3477] Stick a better error message in (rather than an NPE) if an
  attachment couldn't be found.
........

------------------------------------------
[...truncated 1219 lines...]

-------------------------------------------------------
 T E S T S
-------------------------------------------------------
Running org.apache.cxf.jaxb.BareInInterceptorTest
Tests run: 4, Failures: 0, Errors: 0, Skipped: 0, Time elapsed: 0.939 sec
Running org.apache.cxf.jaxb.BareOutInterceptorTest
Tests run: 2, Failures: 0, Errors: 0, Skipped: 0, Time elapsed: 0.109 sec
Running org.apache.cxf.jaxb.DocLiteralInInterceptorTest
Tests run: 3, Failures: 0, Errors: 0, Skipped: 0, Time elapsed: 0.079 sec
Running org.apache.cxf.jaxb.JAXBDataBindingTest
Tests run: 7, Failures: 0, Errors: 0, Skipped: 0, Time elapsed: 0.293 sec
Running org.apache.cxf.jaxb.JAXBEncoderDecoderTest
Tests run: 11, Failures: 0, Errors: 0, Skipped: 0, Time elapsed: 0.208 sec
Running org.apache.cxf.jaxb.JAXBWrapperHelperTest
Tests run: 1, Failures: 0, Errors: 0, Skipped: 0, Time elapsed: 0.021 sec
Running org.apache.cxf.jaxb.WrappedInInterceptorTest
Tests run: 2, Failures: 0, Errors: 0, Skipped: 0, Time elapsed: 0.057 sec
Running org.apache.cxf.jaxb.io.XMLStreamDataReaderTest
Tests run: 4, Failures: 0, Errors: 0, Skipped: 0, Time elapsed: 0.018 sec
Running org.apache.cxf.jaxb.io.XMLStreamDataWriterTest
Tests run: 5, Failures: 0, Errors: 0, Skipped: 0, Time elapsed: 0.016 sec

Results :

Tests run: 39, Failures: 0, Errors: 0, Skipped: 0

[JENKINS] Recording test results
[INFO] [jar:jar {execution: default-jar}]
[INFO] Building jar: C:\hudson\hudson-slave\workspace\CXF-2.3.x-windows\2.3.x-fixes\rt\databinding\jaxb\target\cxf-rt-databinding-jaxb-2.3.5-SNAPSHOT.jar
[INFO] [install:install {execution: default-install}]
[INFO] Installing C:\hudson\hudson-slave\workspace\CXF-2.3.x-windows\2.3.x-fixes\rt\databinding\jaxb\target\cxf-rt-databinding-jaxb-2.3.5-SNAPSHOT.jar
to <https://builds.apache.org/job/CXF-2.3.x-windows/ws/.repository\org\apache\cxf\cxf-rt-databinding-jaxb\2.3.5-SNAPSHOT\cxf-rt-databinding-jaxb-2.3.5-SNAPSHOT.jar>
[JENKINS] Archiving C:\hudson\hudson-slave\workspace\CXF-2.3.x-windows\2.3.x-fixes\rt\databinding\jaxb\target\cxf-rt-databinding-jaxb-2.3.5-SNAPSHOT.jar
to /home/hudson/hudson/jobs/CXF-2.3.x-windows/modules/org.apache.cxf$cxf-rt-databinding-jaxb/builds/2011-06-07_16-13-37/archive/org.apache.cxf/cxf-rt-databinding-jaxb/2.3.5-SNAPSHOT/cxf-rt-databinding-jaxb-2.3.5-SNAPSHOT.jar
[INFO] ------------------------------------------------------------------------
[INFO] Building Apache CXF Runtime XML Binding
[INFO]    task-segment: [clean, install]
[INFO] ------------------------------------------------------------------------
[INFO] [clean:clean {execution: default-clean}]
[INFO] Deleting C:\hudson\hudson-slave\workspace\CXF-2.3.x-windows\2.3.x-fixes\rt\bindings\xml\target
[INFO] [checkstyle:checkstyle {execution: validate}]
[INFO] Starting audit...
Audit done.

[INFO] Preparing pmd:check
[JENKINS] Archiving C:\hudson\hudson-slave\workspace\CXF-2.3.x-windows\2.3.x-fixes\rt\bindings\xml\pom.xml
to /home/hudson/hudson/jobs/CXF-2.3.x-windows/modules/org.apache.cxf$cxf-rt-bindings-xml/builds/2011-06-07_16-13-37/archive/org.apache.cxf/cxf-rt-bindings-xml/2.3.5-SNAPSHOT/cxf-rt-bindings-xml-2.3.5-SNAPSHOT.pom
[INFO] [pmd:pmd {execution: pmd}]
[INFO] [pmd:check {execution: validate}]
[INFO] 
[INFO] [cxf-xml2fastinfoset:xml2fastinfoset {execution: xml2fastinfoset}]
[INFO] [cxf-xjc:xsdtojava {execution: generate-sources}]
[INFO] [remote-resources:process {execution: default}]
[INFO] [resources:resources {execution: default-resources}]
[INFO] Using 'UTF-8' encoding to copy filtered resources.
[INFO] Copying 1 resource
[INFO] Copying 8 resources
[INFO] skip non existing resourceDirectory C:\hudson\hudson-slave\workspace\CXF-2.3.x-windows\2.3.x-fixes\rt\bindings\xml\src\main\resources-filtered
[INFO] Copying 1 resource
[INFO] Copying 3 resources
[INFO] [compiler:compile {execution: default-compile}]
[INFO] Compiling 17 source files to C:\hudson\hudson-slave\workspace\CXF-2.3.x-windows\2.3.x-fixes\rt\bindings\xml\target\classes
[INFO] [resources:testResources {execution: default-testResources}]
[INFO] Using 'UTF-8' encoding to copy filtered resources.
[INFO] Copying 0 resource
[INFO] Copying 4 resources
[INFO] skip non existing resourceDirectory C:\hudson\hudson-slave\workspace\CXF-2.3.x-windows\2.3.x-fixes\rt\bindings\xml\target\generated\src\test\resources
[INFO] Copying 3 resources
[INFO] [compiler:testCompile {execution: default-testCompile}]
[INFO] Compiling 6 source files to C:\hudson\hudson-slave\workspace\CXF-2.3.x-windows\2.3.x-fixes\rt\bindings\xml\target\test-classes
[INFO] [surefire:test {execution: default-test}]
[INFO] Surefire report directory: C:\hudson\hudson-slave\workspace\CXF-2.3.x-windows\2.3.x-fixes\rt\bindings\xml\target\surefire-reports

-------------------------------------------------------
 T E S T S
-------------------------------------------------------
Running org.apache.cxf.binding.xml.XMLBindingFactoryTest
Tests run: 1, Failures: 0, Errors: 0, Skipped: 0, Time elapsed: 0.202 sec
Running org.apache.cxf.binding.xml.interceptor.XMLFaultInterceptorsTest
Tests run: 1, Failures: 0, Errors: 0, Skipped: 0, Time elapsed: 0.831 sec
Running org.apache.cxf.binding.xml.interceptor.XMLFaultOutInterceptorTest
Tests run: 1, Failures: 0, Errors: 0, Skipped: 0, Time elapsed: 0.027 sec
Running org.apache.cxf.binding.xml.interceptor.XMLMessageInInterceptorTest
Tests run: 3, Failures: 0, Errors: 0, Skipped: 0, Time elapsed: 0.134 sec
Running org.apache.cxf.binding.xml.interceptor.XMLMessageOutInterceptorTest
Tests run: 3, Failures: 0, Errors: 0, Skipped: 0, Time elapsed: 0.095 sec

Results :

Tests run: 9, Failures: 0, Errors: 0, Skipped: 0

[JENKINS] Recording test results
[INFO] [jar:jar {execution: default-jar}]
[INFO] Building jar: C:\hudson\hudson-slave\workspace\CXF-2.3.x-windows\2.3.x-fixes\rt\bindings\xml\target\cxf-rt-bindings-xml-2.3.5-SNAPSHOT.jar
[INFO] [install:install {execution: default-install}]
[INFO] Installing C:\hudson\hudson-slave\workspace\CXF-2.3.x-windows\2.3.x-fixes\rt\bindings\xml\target\cxf-rt-bindings-xml-2.3.5-SNAPSHOT.jar
to <https://builds.apache.org/job/CXF-2.3.x-windows/ws/.repository\org\apache\cxf\cxf-rt-bindings-xml\2.3.5-SNAPSHOT\cxf-rt-bindings-xml-2.3.5-SNAPSHOT.jar>
[JENKINS] Archiving C:\hudson\hudson-slave\workspace\CXF-2.3.x-windows\2.3.x-fixes\rt\bindings\xml\target\cxf-rt-bindings-xml-2.3.5-SNAPSHOT.jar
to /home/hudson/hudson/jobs/CXF-2.3.x-windows/modules/org.apache.cxf$cxf-rt-bindings-xml/builds/2011-06-07_16-13-37/archive/org.apache.cxf/cxf-rt-bindings-xml/2.3.5-SNAPSHOT/cxf-rt-bindings-xml-2.3.5-SNAPSHOT.jar
[INFO] ------------------------------------------------------------------------
[INFO] Building Apache CXF Runtime SOAP Binding
[INFO]    task-segment: [clean, install]
[INFO] ------------------------------------------------------------------------
[INFO] [clean:clean {execution: default-clean}]
[INFO] Deleting C:\hudson\hudson-slave\workspace\CXF-2.3.x-windows\2.3.x-fixes\rt\bindings\soap\target
[INFO] [checkstyle:checkstyle {execution: validate}]
[INFO] Starting audit...
Audit done.

[INFO] Preparing pmd:check
[JENKINS] Archiving C:\hudson\hudson-slave\workspace\CXF-2.3.x-windows\2.3.x-fixes\rt\bindings\soap\pom.xml
to /home/hudson/hudson/jobs/CXF-2.3.x-windows/modules/org.apache.cxf$cxf-rt-bindings-soap/builds/2011-06-07_16-13-37/archive/org.apache.cxf/cxf-rt-bindings-soap/2.3.5-SNAPSHOT/cxf-rt-bindings-soap-2.3.5-SNAPSHOT.pom
[INFO] [pmd:pmd {execution: pmd}]
[INFO] [pmd:check {execution: validate}]
[INFO] 
[INFO] [cxf-xml2fastinfoset:xml2fastinfoset {execution: xml2fastinfoset}]
[INFO] [remote-resources:process {execution: default}]
[INFO] [resources:resources {execution: default-resources}]
[INFO] Using 'UTF-8' encoding to copy filtered resources.
[INFO] Copying 3 resources
[INFO] Copying 7 resources
[INFO] skip non existing resourceDirectory C:\hudson\hudson-slave\workspace\CXF-2.3.x-windows\2.3.x-fixes\rt\bindings\soap\src\main\resources-filtered
[INFO] Copying 1 resource
[INFO] Copying 3 resources
[INFO] [compiler:compile {execution: default-compile}]
[INFO] Compiling 69 source files to C:\hudson\hudson-slave\workspace\CXF-2.3.x-windows\2.3.x-fixes\rt\bindings\soap\target\classes
[WARNING] \hudson\hudson-slave\workspace\CXF-2.3.x-windows\2.3.x-fixes\rt\bindings\soap\src\main\java\org\apache\cxf\binding\soap\Soap12.java:[141,18]
[deprecation] getPrefix() in org.apache.cxf.binding.soap.SoapVersion has been deprecated
[WARNING] \hudson\hudson-slave\workspace\CXF-2.3.x-windows\2.3.x-fixes\rt\bindings\soap\src\main\java\org\apache\cxf\binding\soap\Soap11.java:[161,18]
[deprecation] getPrefix() in org.apache.cxf.binding.soap.SoapVersion has been deprecated
[INFO] [resources:testResources {execution: default-testResources}]
[INFO] Using 'UTF-8' encoding to copy filtered resources.
[INFO] Copying 4 resources
[INFO] Copying 12 resources
[INFO] skip non existing resourceDirectory C:\hudson\hudson-slave\workspace\CXF-2.3.x-windows\2.3.x-fixes\rt\bindings\soap\target\generated\src\test\resources
[INFO] Copying 3 resources
[INFO] [compiler:testCompile {execution: default-testCompile}]
[INFO] Compiling 16 source files to C:\hudson\hudson-slave\workspace\CXF-2.3.x-windows\2.3.x-fixes\rt\bindings\soap\target\test-classes
[INFO] [surefire:test {execution: default-test}]
[INFO] Surefire report directory: C:\hudson\hudson-slave\workspace\CXF-2.3.x-windows\2.3.x-fixes\rt\bindings\soap\target\surefire-reports

-------------------------------------------------------
 T E S T S
-------------------------------------------------------
Running org.apache.cxf.binding.soap.MustUnderstandInterceptorTest
Tests run: 4, Failures: 0, Errors: 0, Skipped: 0, Time elapsed: 0.683 sec
Running org.apache.cxf.binding.soap.RPCInInterceptorTest
Tests run: 2, Failures: 0, Errors: 0, Skipped: 0, Time elapsed: 0.299 sec
Running org.apache.cxf.binding.soap.RPCOutInterceptorTest
Tests run: 2, Failures: 0, Errors: 0, Skipped: 0, Time elapsed: 0.096 sec
Running org.apache.cxf.binding.soap.ReadHeaderInterceptorTest
Tests run: 3, Failures: 0, Errors: 0, Skipped: 0, Time elapsed: 0.012 sec
Running org.apache.cxf.binding.soap.ServiceModelUtilTest
Tests run: 1, Failures: 0, Errors: 0, Skipped: 0, Time elapsed: 0.014 sec
Running org.apache.cxf.binding.soap.SoapActionInterceptorTest
Tests run: 1, Failures: 0, Errors: 0, Skipped: 0, Time elapsed: 0.004 sec
Running org.apache.cxf.binding.soap.SoapBindingFactoryTest
Tests run: 3, Failures: 0, Errors: 0, Skipped: 0, Time elapsed: 0.068 sec
Running org.apache.cxf.binding.soap.SoapBindingTest
Tests run: 1, Failures: 0, Errors: 0, Skipped: 0, Time elapsed: 0.001 sec
Running org.apache.cxf.binding.soap.SoapDestinationFactoryTest
Tests run: 1, Failures: 0, Errors: 0, Skipped: 0, Time elapsed: 0.005 sec
Running org.apache.cxf.binding.soap.SoapOutInterceptorTest
Tests run: 2, Failures: 0, Errors: 0, Skipped: 0, Time elapsed: 0.014 sec
Running org.apache.cxf.binding.soap.interceptor.SoapFaultSerializerTest
Tests run: 4, Failures: 0, Errors: 0, Skipped: 0, Time elapsed: 0.085 sec
Running org.apache.cxf.binding.soap.jms.interceptor.SoapFaultFactoryTest
Tests run: 2, Failures: 0, Errors: 0, Skipped: 0, Time elapsed: 0.173 sec
Running org.apache.cxf.binding.soap.saaj.SAAJInInterceptorTest
Tests run: 2, Failures: 0, Errors: 0, Skipped: 0, Time elapsed: 0.043 sec
Running org.apache.cxf.binding.soap.tcp.TCPConduitTest
Tests run: 1, Failures: 0, Errors: 0, Skipped: 1, Time elapsed: 0 sec

Results :

Tests run: 29, Failures: 0, Errors: 0, Skipped: 1

[JENKINS] Recording test results
[INFO] [jar:jar {execution: default-jar}]
[INFO] Building jar: C:\hudson\hudson-slave\workspace\CXF-2.3.x-windows\2.3.x-fixes\rt\bindings\soap\target\cxf-rt-bindings-soap-2.3.5-SNAPSHOT.jar
[INFO] [install:install {execution: default-install}]
[INFO] Installing C:\hudson\hudson-slave\workspace\CXF-2.3.x-windows\2.3.x-fixes\rt\bindings\soap\target\cxf-rt-bindings-soap-2.3.5-SNAPSHOT.jar
to <https://builds.apache.org/job/CXF-2.3.x-windows/ws/.repository\org\apache\cxf\cxf-rt-bindings-soap\2.3.5-SNAPSHOT\cxf-rt-bindings-soap-2.3.5-SNAPSHOT.jar>
[JENKINS] Archiving C:\hudson\hudson-slave\workspace\CXF-2.3.x-windows\2.3.x-fixes\rt\bindings\soap\target\cxf-rt-bindings-soap-2.3.5-SNAPSHOT.jar
to /home/hudson/hudson/jobs/CXF-2.3.x-windows/modules/org.apache.cxf$cxf-rt-bindings-soap/builds/2011-06-07_16-13-37/archive/org.apache.cxf/cxf-rt-bindings-soap/2.3.5-SNAPSHOT/cxf-rt-bindings-soap-2.3.5-SNAPSHOT.jar
[INFO] ------------------------------------------------------------------------
[INFO] Building Apache CXF Runtime Local Transport
[INFO]    task-segment: [clean, install]
[INFO] ------------------------------------------------------------------------
[INFO] [clean:clean {execution: default-clean}]
[INFO] Deleting C:\hudson\hudson-slave\workspace\CXF-2.3.x-windows\2.3.x-fixes\rt\transports\local\target
[INFO] [checkstyle:checkstyle {execution: validate}]
[INFO] Starting audit...
C:\hudson\hudson-slave\workspace\CXF-2.3.x-windows\2.3.x-fixes\rt\transports\local\src\main\java\org\apache\cxf\transport\local\LocalTransportFactory.java:30:8:
Unused import - java.util.concurrent.Executor.
Audit done.

[JENKINS] Archiving C:\hudson\hudson-slave\workspace\CXF-2.3.x-windows\2.3.x-fixes\rt\transports\local\pom.xml
to /home/hudson/hudson/jobs/CXF-2.3.x-windows/modules/org.apache.cxf$cxf-rt-transports-local/builds/2011-06-07_16-13-37/archive/org.apache.cxf/cxf-rt-transports-local/2.3.5-SNAPSHOT/cxf-rt-transports-local-2.3.5-SNAPSHOT.pom
[INFO] ------------------------------------------------------------------------
[ERROR] BUILD ERROR
[INFO] ------------------------------------------------------------------------
[INFO] An error has occurred in Checkstyle report generation.

Embedded error: Failed during checkstyle execution
There are 1 checkstyle errors.
[INFO] ------------------------------------------------------------------------
[INFO] Trace
org.apache.maven.lifecycle.LifecycleExecutionException: An error has occurred in Checkstyle
report generation.
	at org.apache.maven.lifecycle.DefaultLifecycleExecutor.executeGoals(DefaultLifecycleExecutor.java:719)
	at org.apache.maven.lifecycle.DefaultLifecycleExecutor.executeGoalWithLifecycle(DefaultLifecycleExecutor.java:556)
	at org.apache.maven.lifecycle.DefaultLifecycleExecutor.executeGoal(DefaultLifecycleExecutor.java:535)
	at org.apache.maven.lifecycle.DefaultLifecycleExecutor.executeGoalAndHandleFailures(DefaultLifecycleExecutor.java:387)
	at org.apache.maven.lifecycle.DefaultLifecycleExecutor.executeTaskSegments(DefaultLifecycleExecutor.java:348)
	at org.apache.maven.lifecycle.DefaultLifecycleExecutor.execute(DefaultLifecycleExecutor.java:180)
	at org.apache.maven.lifecycle.LifecycleExecutorInterceptor.execute(LifecycleExecutorInterceptor.java:65)
	at org.apache.maven.DefaultMaven.doExecute(DefaultMaven.java:328)
	at org.apache.maven.DefaultMaven.execute(DefaultMaven.java:138)
	at org.apache.maven.cli.MavenCli.main(MavenCli.java:362)
	at sun.reflect.NativeMethodAccessorImpl.invoke0(Native Method)
	at sun.reflect.NativeMethodAccessorImpl.invoke(NativeMethodAccessorImpl.java:39)
	at sun.reflect.DelegatingMethodAccessorImpl.invoke(DelegatingMethodAccessorImpl.java:25)
	at java.lang.reflect.Method.invoke(Method.java:597)
	at org.codehaus.classworlds.Launcher.launchEnhanced(Launcher.java:315)
	at org.codehaus.classworlds.Launcher.launch(Launcher.java:255)
	at hudson.maven.agent.Main.launch(Main.java:185)
	at hudson.maven.MavenBuilder.call(MavenBuilder.java:164)
	at hudson.maven.MavenModuleSetBuild$Builder.call(MavenModuleSetBuild.java:987)
	at hudson.maven.MavenModuleSetBuild$Builder.call(MavenModuleSetBuild.java:918)
	at hudson.remoting.UserRequest.perform(UserRequest.java:118)
	at hudson.remoting.UserRequest.perform(UserRequest.java:48)
	at hudson.remoting.Request$2.run(Request.java:270)
	at java.util.concurrent.Executors$RunnableAdapter.call(Executors.java:441)
	at java.util.concurrent.FutureTask$Sync.innerRun(FutureTask.java:303)
	at java.util.concurrent.FutureTask.run(FutureTask.java:138)
	at java.util.concurrent.ThreadPoolExecutor$Worker.runTask(ThreadPoolExecutor.java:886)
	at java.util.concurrent.ThreadPoolExecutor$Worker.run(ThreadPoolExecutor.java:908)
	at java.lang.Thread.run(Thread.java:619)
Caused by: org.apache.maven.plugin.MojoExecutionException: An error has occurred in Checkstyle
report generation.
	at org.apache.maven.reporting.AbstractMavenReport.execute(AbstractMavenReport.java:122)
	at org.apache.maven.plugin.DefaultPluginManager.executeMojo(DefaultPluginManager.java:490)
	at hudson.maven.agent.PluginManagerInterceptor.executeMojo(PluginManagerInterceptor.java:182)
	at org.apache.maven.lifecycle.DefaultLifecycleExecutor.executeGoals(DefaultLifecycleExecutor.java:694)
	... 28 more
Caused by: org.apache.maven.reporting.MavenReportException: Failed during checkstyle execution
	at org.apache.maven.plugin.checkstyle.CheckstyleReport.executeReport(CheckstyleReport.java:597)
	at org.apache.maven.reporting.AbstractMavenReport.generate(AbstractMavenReport.java:190)
	at org.apache.maven.reporting.AbstractMavenReport.execute(AbstractMavenReport.java:99)
	... 31 more
Caused by: org.apache.maven.plugin.checkstyle.CheckstyleExecutorException: There are 1 checkstyle
errors.
	at org.apache.maven.plugin.checkstyle.DefaultCheckstyleExecutor.executeCheckstyle(DefaultCheckstyleExecutor.java:216)
	at org.apache.maven.plugin.checkstyle.CheckstyleReport.executeReport(CheckstyleReport.java:578)
	... 33 more
[INFO] ------------------------------------------------------------------------
[INFO] Total time: 4 minutes 37 seconds
[INFO] Finished at: Tue Jun 07 17:18:15 BST 2011
[INFO] Final Memory: 271M/444M
[INFO] ------------------------------------------------------------------------
Sending e-mails to: notifications@cxf.apache.org dkulp_apache@dankulp.com
channel stopped


Mime
View raw message