cxf-notifications mailing list archives

Site index · List index
Message view « Date » · « Thread »
Top « Date » · « Thread »
From Apache Jenkins Server <hud...@hudson.apache.org>
Subject Build failed in Jenkins: CXF-trunk-deploy #582
Date Thu, 02 Jun 2011 07:02:06 GMT
See <https://builds.apache.org/hudson/job/CXF-trunk-deploy/582/changes>

Changes:

[coheigea] [CXF-3565] - Support pluggable way of configuring WS-Trust ActAs and OnBehalfOf
behaviour

[dkulp] Use the methods in Compiler class to find javac

[coheigea] [CXF-3535] - Use the Requested(Un)AttachedReference returned from an STS to refer
to a SecurityToken for signature

[coheigea] [CXF-3524] - Support Derived Keys with the Symmetric Binding + SAML Assertions

[coheigea] [CXF-3521] - WebServiceContext.getUserPrincipal() is null for incoming SAML Token
or transformed token
 - Upgrading to WSS4J 1.6.1-SNAPSHOT

[ay] [CXF-3563] WS-RM RetransmissionQueueTest to correctly simulate the testing condition

------------------------------------------
[...truncated 15177 lines...]
download:
    [mkdir] Created dir: <https://builds.apache.org/hudson/job/CXF-trunk-deploy/ws/trunk/distribution/src/main/release/samples/ws_security/interopfest/wssec10/target>

download.internal:
    [mkdir] Created dir: <https://builds.apache.org/hudson/job/CXF-trunk-deploy/ws/trunk/distribution/src/main/release/samples/ws_security/interopfest/wssec10/target/generated/src/main/resources/certs>
    [mkdir] Created dir: <https://builds.apache.org/hudson/job/CXF-trunk-deploy/ws/trunk/distribution/src/main/release/samples/ws_security/interopfest/wssec10/target/wsdl>
     [copy] Copying 1 file to <https://builds.apache.org/hudson/job/CXF-trunk-deploy/ws/trunk/distribution/src/main/release/samples/ws_security/interopfest/wssec10/target>
      [get] Getting: http://131.107.153.205/Security_WsSecurity_Service_Indigo/WsSecurity10.svc?wsdl
      [get] To: <https://builds.apache.org/hudson/job/CXF-trunk-deploy/ws/trunk/distribution/src/main/release/samples/ws_security/interopfest/wssec10/target/wsdl/WsSecurity10.wsdl>
      [get] Getting: http://131.107.153.205/Security_WsSecurity_Service_Indigo/WsSecurity10.svc?wsdl=wsdl0
      [get] To: <https://builds.apache.org/hudson/job/CXF-trunk-deploy/ws/trunk/distribution/src/main/release/samples/ws_security/interopfest/wssec10/target/wsdl/WsSecurity10_policy.wsdl>
      [get] Getting: http://131.107.153.205/Security_WsSecurity_Service_Indigo/WsSecurity10.svc?xsd=xsd0
      [get] To: <https://builds.apache.org/hudson/job/CXF-trunk-deploy/ws/trunk/distribution/src/main/release/samples/ws_security/interopfest/wssec10/target/wsdl/WsSecurity10_0.xsd>
      [get] Getting: http://131.107.153.205/Security_WsSecurity_Service_Indigo/WsSecurity10.svc?xsd=xsd1
      [get] To: <https://builds.apache.org/hudson/job/CXF-trunk-deploy/ws/trunk/distribution/src/main/release/samples/ws_security/interopfest/wssec10/target/wsdl/WsSecurity10_1.xsd>
      [get] Getting: http://131.107.153.205/Security_WsSecurity_Service_Indigo/WsSecurity10.svc?xsd=xsd2
      [get] To: <https://builds.apache.org/hudson/job/CXF-trunk-deploy/ws/trunk/distribution/src/main/release/samples/ws_security/interopfest/wssec10/target/wsdl/WsSecurity10_2.xsd>
      [get] Getting: http://131.107.153.205/Security_WsSecurity_Service_Indigo/WsSecurity10.svc?xsd=xsd3
      [get] To: <https://builds.apache.org/hudson/job/CXF-trunk-deploy/ws/trunk/distribution/src/main/release/samples/ws_security/interopfest/wssec10/target/wsdl/WsSecurity10_3.xsd>

transform:
    [mkdir] Created dir: <https://builds.apache.org/hudson/job/CXF-trunk-deploy/ws/trunk/distribution/src/main/release/samples/ws_security/interopfest/wssec10/target/wsdl2>
     [xslt] Transforming into <https://builds.apache.org/hudson/job/CXF-trunk-deploy/ws/trunk/distribution/src/main/release/samples/ws_security/interopfest/wssec10/target/wsdl2>
     [xslt] Processing <https://builds.apache.org/hudson/job/CXF-trunk-deploy/ws/trunk/distribution/src/main/release/samples/ws_security/interopfest/wssec10/target/wsdl/WsSecurity10.wsdl>
to <https://builds.apache.org/hudson/job/CXF-trunk-deploy/ws/trunk/distribution/src/main/release/samples/ws_security/interopfest/wssec10/target/wsdl2/WsSecurity10.wsdl>
     [xslt] Loading stylesheet <https://builds.apache.org/hudson/job/CXF-trunk-deploy/ws/trunk/distribution/src/main/release/samples/ws_security/interopfest/wssec10/src/style/makelocal.xsl>
     [xslt] Processing <https://builds.apache.org/hudson/job/CXF-trunk-deploy/ws/trunk/distribution/src/main/release/samples/ws_security/interopfest/wssec10/target/wsdl/WsSecurity10_0.xsd>
to <https://builds.apache.org/hudson/job/CXF-trunk-deploy/ws/trunk/distribution/src/main/release/samples/ws_security/interopfest/wssec10/target/wsdl2/WsSecurity10_0.xsd>
     [xslt] Processing <https://builds.apache.org/hudson/job/CXF-trunk-deploy/ws/trunk/distribution/src/main/release/samples/ws_security/interopfest/wssec10/target/wsdl/WsSecurity10_1.xsd>
to <https://builds.apache.org/hudson/job/CXF-trunk-deploy/ws/trunk/distribution/src/main/release/samples/ws_security/interopfest/wssec10/target/wsdl2/WsSecurity10_1.xsd>
     [xslt] Processing <https://builds.apache.org/hudson/job/CXF-trunk-deploy/ws/trunk/distribution/src/main/release/samples/ws_security/interopfest/wssec10/target/wsdl/WsSecurity10_2.xsd>
to <https://builds.apache.org/hudson/job/CXF-trunk-deploy/ws/trunk/distribution/src/main/release/samples/ws_security/interopfest/wssec10/target/wsdl2/WsSecurity10_2.xsd>
     [xslt] Processing <https://builds.apache.org/hudson/job/CXF-trunk-deploy/ws/trunk/distribution/src/main/release/samples/ws_security/interopfest/wssec10/target/wsdl/WsSecurity10_3.xsd>
to <https://builds.apache.org/hudson/job/CXF-trunk-deploy/ws/trunk/distribution/src/main/release/samples/ws_security/interopfest/wssec10/target/wsdl2/WsSecurity10_3.xsd>
     [xslt] Processing <https://builds.apache.org/hudson/job/CXF-trunk-deploy/ws/trunk/distribution/src/main/release/samples/ws_security/interopfest/wssec10/target/wsdl/WsSecurity10_policy.wsdl>
to <https://builds.apache.org/hudson/job/CXF-trunk-deploy/ws/trunk/distribution/src/main/release/samples/ws_security/interopfest/wssec10/target/wsdl2/WsSecurity10_policy.wsdl>
    [unzip] Expanding: <https://builds.apache.org/hudson/job/CXF-trunk-deploy/ws/trunk/distribution/src/main/release/samples/ws_security/interopfest/wssec10/target/Certs.zip>
into <https://builds.apache.org/hudson/job/CXF-trunk-deploy/ws/trunk/distribution/src/main/release/samples/ws_security/interopfest/wssec10/target/generated/src/main/resources/certs>
[INFO] Executed tasks
Downloading: http://repository.apache.org/snapshots/org/apache/ws/security/wss4j/1.6.1-SNAPSHOT/wss4j-1.6.1-SNAPSHOT.jar
[INFO] [cxf-codegen:wsdl2java {execution: generate-sources}]
[INFO] [resources:resources {execution: default-resources}]
[INFO] Using 'UTF-8' encoding to copy filtered resources.
[INFO] Copying 0 resource
[INFO] Copying 4 resources
[INFO] Copying 11 resources
Downloading: http://repository.apache.org/snapshots/org/apache/ws/security/wss4j/1.6.1-SNAPSHOT/wss4j-1.6.1-SNAPSHOT.jar
[INFO] [compiler:compile {execution: default-compile}]
[INFO] Compiling 33 source files to <https://builds.apache.org/hudson/job/CXF-trunk-deploy/ws/trunk/distribution/src/main/release/samples/ws_security/interopfest/wssec10/target/classes>
[INFO] [resources:testResources {execution: default-testResources}]
[INFO] Using 'UTF-8' encoding to copy filtered resources.
[INFO] skip non existing resourceDirectory <https://builds.apache.org/hudson/job/CXF-trunk-deploy/ws/trunk/distribution/src/main/release/samples/ws_security/interopfest/wssec10/src/test/resources>
Downloading: http://repository.apache.org/snapshots/org/apache/ws/security/wss4j/1.6.1-SNAPSHOT/wss4j-1.6.1-SNAPSHOT.jar
[INFO] [compiler:testCompile {execution: default-testCompile}]
[INFO] No sources to compile
Downloading: http://repository.apache.org/snapshots/org/apache/ws/security/wss4j/1.6.1-SNAPSHOT/wss4j-1.6.1-SNAPSHOT.jar
[INFO] [surefire:test {execution: default-test}]
[INFO] Tests are skipped.
Downloading: http://repository.apache.org/snapshots/org/apache/ws/security/wss4j/1.6.1-SNAPSHOT/wss4j-1.6.1-SNAPSHOT.jar
[INFO] [jar:jar {execution: default-jar}]
[INFO] Building jar: <https://builds.apache.org/hudson/job/CXF-trunk-deploy/ws/trunk/distribution/src/main/release/samples/ws_security/interopfest/wssec10/target/ws-sec10-2.4.1-SNAPSHOT.jar>
[INFO] [install:install {execution: default-install}]
[INFO] Installing <https://builds.apache.org/hudson/job/CXF-trunk-deploy/ws/trunk/distribution/src/main/release/samples/ws_security/interopfest/wssec10/target/ws-sec10-2.4.1-SNAPSHOT.jar>
to <https://builds.apache.org/hudson/job/CXF-trunk-deploy/ws/.repository/org/apache/cxf/samples/interopfest/ws-sec10/2.4.1-SNAPSHOT/ws-sec10-2.4.1-SNAPSHOT.jar>
[INFO] [deploy:deploy {execution: default-deploy}]
[INFO]  skipping artifact deployement 
[JENKINS] Archiving <https://builds.apache.org/hudson/job/CXF-trunk-deploy/ws/trunk/distribution/src/main/release/samples/ws_security/interopfest/wssec10/pom.xml>
to /home/hudson/hudson/jobs/CXF-trunk-deploy/modules/org.apache.cxf.samples.interopfest$ws-sec10/builds/2011-06-02_06-20-27/archive/org.apache.cxf.samples.interopfest/ws-sec10/2.4.1-SNAPSHOT/ws-sec10-2.4.1-SNAPSHOT.pom
[JENKINS] Archiving <https://builds.apache.org/hudson/job/CXF-trunk-deploy/ws/trunk/distribution/src/main/release/samples/ws_security/interopfest/wssec10/target/ws-sec10-2.4.1-SNAPSHOT.jar>
to /home/hudson/hudson/jobs/CXF-trunk-deploy/modules/org.apache.cxf.samples.interopfest$ws-sec10/builds/2011-06-02_06-20-27/archive/org.apache.cxf.samples.interopfest/ws-sec10/2.4.1-SNAPSHOT/ws-sec10-2.4.1-SNAPSHOT.jar
[INFO] ------------------------------------------------------------------------
[INFO] Building CXF Interopfest WS-SEC11 Demo
[INFO]    task-segment: [clean, deploy]
[INFO] ------------------------------------------------------------------------
[INFO] [clean:clean {execution: default-clean}]
[INFO] Deleting directory <https://builds.apache.org/hudson/job/CXF-trunk-deploy/ws/trunk/distribution/src/main/release/samples/ws_security/interopfest/wssec11/target>
Downloading: http://repository.apache.org/snapshots/org/apache/ws/security/wss4j/1.6.1-SNAPSHOT/wss4j-1.6.1-SNAPSHOT.jar
[INFO] [antrun:run {execution: download-certs-wsdl}]
project.artifactId
[INFO] Executing tasks

download:
    [mkdir] Created dir: <https://builds.apache.org/hudson/job/CXF-trunk-deploy/ws/trunk/distribution/src/main/release/samples/ws_security/interopfest/wssec11/target>

download.internal:
    [mkdir] Created dir: <https://builds.apache.org/hudson/job/CXF-trunk-deploy/ws/trunk/distribution/src/main/release/samples/ws_security/interopfest/wssec11/target/generated/src/main/resources/certs>
    [mkdir] Created dir: <https://builds.apache.org/hudson/job/CXF-trunk-deploy/ws/trunk/distribution/src/main/release/samples/ws_security/interopfest/wssec11/target/wsdl>
     [copy] Copying 1 file to <https://builds.apache.org/hudson/job/CXF-trunk-deploy/ws/trunk/distribution/src/main/release/samples/ws_security/interopfest/wssec11/target>
      [get] Getting: http://131.107.153.205/Security_WsSecurity_Service_Indigo/WsSecurity11.svc?wsdl
      [get] To: <https://builds.apache.org/hudson/job/CXF-trunk-deploy/ws/trunk/distribution/src/main/release/samples/ws_security/interopfest/wssec11/target/wsdl/WsSecurity11.wsdl>
      [get] Getting: http://131.107.153.205/Security_WsSecurity_Service_Indigo/WsSecurity11.svc?wsdl=wsdl0
      [get] To: <https://builds.apache.org/hudson/job/CXF-trunk-deploy/ws/trunk/distribution/src/main/release/samples/ws_security/interopfest/wssec11/target/wsdl/WsSecurity11_policy.wsdl>
      [get] Getting: http://131.107.153.205/Security_WsSecurity_Service_Indigo/WsSecurity11.svc?xsd=xsd0
      [get] To: <https://builds.apache.org/hudson/job/CXF-trunk-deploy/ws/trunk/distribution/src/main/release/samples/ws_security/interopfest/wssec11/target/wsdl/WsSecurity11_0.xsd>
      [get] Getting: http://131.107.153.205/Security_WsSecurity_Service_Indigo/WsSecurity11.svc?xsd=xsd1
      [get] To: <https://builds.apache.org/hudson/job/CXF-trunk-deploy/ws/trunk/distribution/src/main/release/samples/ws_security/interopfest/wssec11/target/wsdl/WsSecurity11_1.xsd>
      [get] Getting: http://131.107.153.205/Security_WsSecurity_Service_Indigo/WsSecurity11.svc?xsd=xsd2
      [get] To: <https://builds.apache.org/hudson/job/CXF-trunk-deploy/ws/trunk/distribution/src/main/release/samples/ws_security/interopfest/wssec11/target/wsdl/WsSecurity11_2.xsd>
      [get] Getting: http://131.107.153.205/Security_WsSecurity_Service_Indigo/WsSecurity11.svc?xsd=xsd3
      [get] To: <https://builds.apache.org/hudson/job/CXF-trunk-deploy/ws/trunk/distribution/src/main/release/samples/ws_security/interopfest/wssec11/target/wsdl/WsSecurity11_3.xsd>

transform:
    [mkdir] Created dir: <https://builds.apache.org/hudson/job/CXF-trunk-deploy/ws/trunk/distribution/src/main/release/samples/ws_security/interopfest/wssec11/target/wsdl2>
     [xslt] Transforming into <https://builds.apache.org/hudson/job/CXF-trunk-deploy/ws/trunk/distribution/src/main/release/samples/ws_security/interopfest/wssec11/target/wsdl2>
     [xslt] Processing <https://builds.apache.org/hudson/job/CXF-trunk-deploy/ws/trunk/distribution/src/main/release/samples/ws_security/interopfest/wssec11/target/wsdl/WsSecurity11.wsdl>
to <https://builds.apache.org/hudson/job/CXF-trunk-deploy/ws/trunk/distribution/src/main/release/samples/ws_security/interopfest/wssec11/target/wsdl2/WsSecurity11.wsdl>
     [xslt] Loading stylesheet <https://builds.apache.org/hudson/job/CXF-trunk-deploy/ws/trunk/distribution/src/main/release/samples/ws_security/interopfest/wssec11/src/style/makelocal.xsl>
     [xslt] Processing <https://builds.apache.org/hudson/job/CXF-trunk-deploy/ws/trunk/distribution/src/main/release/samples/ws_security/interopfest/wssec11/target/wsdl/WsSecurity11_0.xsd>
to <https://builds.apache.org/hudson/job/CXF-trunk-deploy/ws/trunk/distribution/src/main/release/samples/ws_security/interopfest/wssec11/target/wsdl2/WsSecurity11_0.xsd>
     [xslt] Processing <https://builds.apache.org/hudson/job/CXF-trunk-deploy/ws/trunk/distribution/src/main/release/samples/ws_security/interopfest/wssec11/target/wsdl/WsSecurity11_1.xsd>
to <https://builds.apache.org/hudson/job/CXF-trunk-deploy/ws/trunk/distribution/src/main/release/samples/ws_security/interopfest/wssec11/target/wsdl2/WsSecurity11_1.xsd>
     [xslt] Processing <https://builds.apache.org/hudson/job/CXF-trunk-deploy/ws/trunk/distribution/src/main/release/samples/ws_security/interopfest/wssec11/target/wsdl/WsSecurity11_2.xsd>
to <https://builds.apache.org/hudson/job/CXF-trunk-deploy/ws/trunk/distribution/src/main/release/samples/ws_security/interopfest/wssec11/target/wsdl2/WsSecurity11_2.xsd>
     [xslt] Processing <https://builds.apache.org/hudson/job/CXF-trunk-deploy/ws/trunk/distribution/src/main/release/samples/ws_security/interopfest/wssec11/target/wsdl/WsSecurity11_3.xsd>
to <https://builds.apache.org/hudson/job/CXF-trunk-deploy/ws/trunk/distribution/src/main/release/samples/ws_security/interopfest/wssec11/target/wsdl2/WsSecurity11_3.xsd>
     [xslt] Processing <https://builds.apache.org/hudson/job/CXF-trunk-deploy/ws/trunk/distribution/src/main/release/samples/ws_security/interopfest/wssec11/target/wsdl/WsSecurity11_policy.wsdl>
to <https://builds.apache.org/hudson/job/CXF-trunk-deploy/ws/trunk/distribution/src/main/release/samples/ws_security/interopfest/wssec11/target/wsdl2/WsSecurity11_policy.wsdl>
    [unzip] Expanding: <https://builds.apache.org/hudson/job/CXF-trunk-deploy/ws/trunk/distribution/src/main/release/samples/ws_security/interopfest/wssec11/target/Certs.zip>
into <https://builds.apache.org/hudson/job/CXF-trunk-deploy/ws/trunk/distribution/src/main/release/samples/ws_security/interopfest/wssec11/target/generated/src/main/resources/certs>
[INFO] Executed tasks
Downloading: http://repository.apache.org/snapshots/org/apache/ws/security/wss4j/1.6.1-SNAPSHOT/wss4j-1.6.1-SNAPSHOT.jar
[INFO] [cxf-codegen:wsdl2java {execution: generate-sources}]
[INFO] [resources:resources {execution: default-resources}]
[INFO] Using 'UTF-8' encoding to copy filtered resources.
[INFO] Copying 0 resource
[INFO] Copying 4 resources
[INFO] Copying 11 resources
Downloading: http://repository.apache.org/snapshots/org/apache/ws/security/wss4j/1.6.1-SNAPSHOT/wss4j-1.6.1-SNAPSHOT.jar
[INFO] [compiler:compile {execution: default-compile}]
[INFO] Compiling 30 source files to <https://builds.apache.org/hudson/job/CXF-trunk-deploy/ws/trunk/distribution/src/main/release/samples/ws_security/interopfest/wssec11/target/classes>
[INFO] [resources:testResources {execution: default-testResources}]
[INFO] Using 'UTF-8' encoding to copy filtered resources.
[INFO] skip non existing resourceDirectory <https://builds.apache.org/hudson/job/CXF-trunk-deploy/ws/trunk/distribution/src/main/release/samples/ws_security/interopfest/wssec11/src/test/resources>
Downloading: http://repository.apache.org/snapshots/org/apache/ws/security/wss4j/1.6.1-SNAPSHOT/wss4j-1.6.1-SNAPSHOT.jar
[INFO] [compiler:testCompile {execution: default-testCompile}]
[INFO] No sources to compile
Downloading: http://repository.apache.org/snapshots/org/apache/ws/security/wss4j/1.6.1-SNAPSHOT/wss4j-1.6.1-SNAPSHOT.jar
[INFO] [surefire:test {execution: default-test}]
[INFO] Tests are skipped.
Downloading: http://repository.apache.org/snapshots/org/apache/ws/security/wss4j/1.6.1-SNAPSHOT/wss4j-1.6.1-SNAPSHOT.jar
[INFO] [jar:jar {execution: default-jar}]
[INFO] Building jar: <https://builds.apache.org/hudson/job/CXF-trunk-deploy/ws/trunk/distribution/src/main/release/samples/ws_security/interopfest/wssec11/target/ws-sec11-2.4.1-SNAPSHOT.jar>
[INFO] [install:install {execution: default-install}]
[INFO] Installing <https://builds.apache.org/hudson/job/CXF-trunk-deploy/ws/trunk/distribution/src/main/release/samples/ws_security/interopfest/wssec11/target/ws-sec11-2.4.1-SNAPSHOT.jar>
to <https://builds.apache.org/hudson/job/CXF-trunk-deploy/ws/.repository/org/apache/cxf/samples/interopfest/ws-sec11/2.4.1-SNAPSHOT/ws-sec11-2.4.1-SNAPSHOT.jar>
[INFO] [deploy:deploy {execution: default-deploy}]
[INFO]  skipping artifact deployement 
[JENKINS] Archiving <https://builds.apache.org/hudson/job/CXF-trunk-deploy/ws/trunk/distribution/src/main/release/samples/ws_security/interopfest/wssec11/pom.xml>
to /home/hudson/hudson/jobs/CXF-trunk-deploy/modules/org.apache.cxf.samples.interopfest$ws-sec11/builds/2011-06-02_06-20-27/archive/org.apache.cxf.samples.interopfest/ws-sec11/2.4.1-SNAPSHOT/ws-sec11-2.4.1-SNAPSHOT.pom
[JENKINS] Archiving <https://builds.apache.org/hudson/job/CXF-trunk-deploy/ws/trunk/distribution/src/main/release/samples/ws_security/interopfest/wssec11/target/ws-sec11-2.4.1-SNAPSHOT.jar>
to /home/hudson/hudson/jobs/CXF-trunk-deploy/modules/org.apache.cxf.samples.interopfest$ws-sec11/builds/2011-06-02_06-20-27/archive/org.apache.cxf.samples.interopfest/ws-sec11/2.4.1-SNAPSHOT/ws-sec11-2.4.1-SNAPSHOT.jar
[INFO] ------------------------------------------------------------------------
[INFO] Building CXF Interopfest WS-TRUST13 Demo
[INFO]    task-segment: [clean, deploy]
[INFO] ------------------------------------------------------------------------
[INFO] [clean:clean {execution: default-clean}]
[INFO] Deleting directory <https://builds.apache.org/hudson/job/CXF-trunk-deploy/ws/trunk/distribution/src/main/release/samples/ws_security/interopfest/wstrust13/target>
Downloading: http://repository.apache.org/snapshots/org/apache/ws/security/wss4j/1.6.1-SNAPSHOT/wss4j-1.6.1-SNAPSHOT.jar
[INFO] [antrun:run {execution: download-certs-wsdl}]
project.artifactId
[INFO] Executing tasks

download:
    [mkdir] Created dir: <https://builds.apache.org/hudson/job/CXF-trunk-deploy/ws/trunk/distribution/src/main/release/samples/ws_security/interopfest/wstrust13/target>

download.internal:
    [mkdir] Created dir: <https://builds.apache.org/hudson/job/CXF-trunk-deploy/ws/trunk/distribution/src/main/release/samples/ws_security/interopfest/wstrust13/target/generated/src/main/resources/certs>
    [mkdir] Created dir: <https://builds.apache.org/hudson/job/CXF-trunk-deploy/ws/trunk/distribution/src/main/release/samples/ws_security/interopfest/wstrust13/target/wsdl>
     [copy] Copying 1 file to <https://builds.apache.org/hudson/job/CXF-trunk-deploy/ws/trunk/distribution/src/main/release/samples/ws_security/interopfest/wstrust13/target>
      [get] Getting: http://131.107.153.205/PingService?wsdl
      [get] To: <https://builds.apache.org/hudson/job/CXF-trunk-deploy/ws/trunk/distribution/src/main/release/samples/ws_security/interopfest/wstrust13/target/wsdl/PingService.wsdl>
      [get] Error opening connection java.io.FileNotFoundException: http://131.107.153.205/PingService?wsdl
      [get] Error opening connection java.io.FileNotFoundException: http://131.107.153.205/PingService?wsdl
      [get] Error opening connection java.io.FileNotFoundException: http://131.107.153.205/PingService?wsdl
      [get] Can't get http://131.107.153.205/PingService?wsdl to <https://builds.apache.org/hudson/job/CXF-trunk-deploy/ws/trunk/distribution/src/main/release/samples/ws_security/interopfest/wstrust13/target/wsdl/PingService.wsdl>
[JENKINS] Archiving <https://builds.apache.org/hudson/job/CXF-trunk-deploy/ws/trunk/distribution/src/main/release/samples/ws_security/interopfest/wstrust13/pom.xml>
to /home/hudson/hudson/jobs/CXF-trunk-deploy/modules/org.apache.cxf.samples.interopfest$ws-trust13/builds/2011-06-02_06-20-27/archive/org.apache.cxf.samples.interopfest/ws-trust13/2.4.1-SNAPSHOT/ws-trust13-2.4.1-SNAPSHOT.pom
[INFO] ------------------------------------------------------------------------
[ERROR] BUILD ERROR
[INFO] ------------------------------------------------------------------------
[INFO] An Ant BuildException has occured: The following error occurred while executing this
line:
<https://builds.apache.org/hudson/job/CXF-trunk-deploy/ws/trunk/distribution/src/main/release/samples/ws_security/interopfest/wstrust13/download_wsdl.xml>:57:
The following error occurred while executing this line:
<https://builds.apache.org/hudson/job/CXF-trunk-deploy/ws/trunk/distribution/src/main/release/samples/ws_security/interopfest/wstrust13/download_wsdl.xml>:29:
Can't get http://131.107.153.205/PingService?wsdl to <https://builds.apache.org/hudson/job/CXF-trunk-deploy/ws/trunk/distribution/src/main/release/samples/ws_security/interopfest/wstrust13/target/wsdl/PingService.wsdl>

[INFO] ------------------------------------------------------------------------
[INFO] Trace
org.apache.maven.lifecycle.LifecycleExecutionException: An Ant BuildException has occured:
The following error occurred while executing this line:
<https://builds.apache.org/hudson/job/CXF-trunk-deploy/ws/trunk/distribution/src/main/release/samples/ws_security/interopfest/wstrust13/download_wsdl.xml>:57:
The following error occurred while executing this line:
<https://builds.apache.org/hudson/job/CXF-trunk-deploy/ws/trunk/distribution/src/main/release/samples/ws_security/interopfest/wstrust13/download_wsdl.xml>:29:
Can't get http://131.107.153.205/PingService?wsdl to <https://builds.apache.org/hudson/job/CXF-trunk-deploy/ws/trunk/distribution/src/main/release/samples/ws_security/interopfest/wstrust13/target/wsdl/PingService.wsdl>
	at org.apache.maven.lifecycle.DefaultLifecycleExecutor.executeGoals(DefaultLifecycleExecutor.java:719)
	at org.apache.maven.lifecycle.DefaultLifecycleExecutor.executeGoalWithLifecycle(DefaultLifecycleExecutor.java:556)
	at org.apache.maven.lifecycle.DefaultLifecycleExecutor.executeGoal(DefaultLifecycleExecutor.java:535)
	at org.apache.maven.lifecycle.DefaultLifecycleExecutor.executeGoalAndHandleFailures(DefaultLifecycleExecutor.java:387)
	at org.apache.maven.lifecycle.DefaultLifecycleExecutor.executeTaskSegments(DefaultLifecycleExecutor.java:348)
	at org.apache.maven.lifecycle.DefaultLifecycleExecutor.execute(DefaultLifecycleExecutor.java:180)
	at org.apache.maven.lifecycle.LifecycleExecutorInterceptor.execute(LifecycleExecutorInterceptor.java:65)
	at org.apache.maven.DefaultMaven.doExecute(DefaultMaven.java:328)
	at org.apache.maven.DefaultMaven.execute(DefaultMaven.java:138)
	at org.apache.maven.cli.MavenCli.main(MavenCli.java:362)
	at sun.reflect.NativeMethodAccessorImpl.invoke0(Native Method)
	at sun.reflect.NativeMethodAccessorImpl.invoke(NativeMethodAccessorImpl.java:39)
	at sun.reflect.DelegatingMethodAccessorImpl.invoke(DelegatingMethodAccessorImpl.java:25)
	at java.lang.reflect.Method.invoke(Method.java:592)
	at org.codehaus.classworlds.Launcher.launchEnhanced(Launcher.java:315)
	at org.codehaus.classworlds.Launcher.launch(Launcher.java:255)
	at hudson.maven.agent.Main.launch(Main.java:185)
	at hudson.maven.MavenBuilder.call(MavenBuilder.java:164)
	at hudson.maven.MavenModuleSetBuild$Builder.call(MavenModuleSetBuild.java:987)
	at hudson.maven.MavenModuleSetBuild$Builder.call(MavenModuleSetBuild.java:918)
	at hudson.remoting.UserRequest.perform(UserRequest.java:118)
	at hudson.remoting.UserRequest.perform(UserRequest.java:48)
	at hudson.remoting.Request$2.run(Request.java:270)
	at java.util.concurrent.Executors$RunnableAdapter.call(Executors.java:417)
	at java.util.concurrent.FutureTask$Sync.innerRun(FutureTask.java:269)
	at java.util.concurrent.FutureTask.run(FutureTask.java:123)
	at java.util.concurrent.ThreadPoolExecutor$Worker.runTask(ThreadPoolExecutor.java:651)
	at java.util.concurrent.ThreadPoolExecutor$Worker.run(ThreadPoolExecutor.java:676)
	at java.lang.Thread.run(Thread.java:595)
Caused by: org.apache.maven.plugin.MojoExecutionException: An Ant BuildException has occured:
The following error occurred while executing this line:
<https://builds.apache.org/hudson/job/CXF-trunk-deploy/ws/trunk/distribution/src/main/release/samples/ws_security/interopfest/wstrust13/download_wsdl.xml>:57:
The following error occurred while executing this line:
<https://builds.apache.org/hudson/job/CXF-trunk-deploy/ws/trunk/distribution/src/main/release/samples/ws_security/interopfest/wstrust13/download_wsdl.xml>:29:
Can't get http://131.107.153.205/PingService?wsdl to <https://builds.apache.org/hudson/job/CXF-trunk-deploy/ws/trunk/distribution/src/main/release/samples/ws_security/interopfest/wstrust13/target/wsdl/PingService.wsdl>
	at org.apache.maven.plugin.antrun.AbstractAntMojo.executeTasks(AbstractAntMojo.java:224)
	at org.apache.maven.plugin.antrun.AntRunMojo.execute(AntRunMojo.java:81)
	at org.apache.maven.plugin.DefaultPluginManager.executeMojo(DefaultPluginManager.java:490)
	at hudson.maven.agent.PluginManagerInterceptor.executeMojo(PluginManagerInterceptor.java:182)
	at org.apache.maven.lifecycle.DefaultLifecycleExecutor.executeGoals(DefaultLifecycleExecutor.java:694)
	... 28 more
Caused by: The following error occurred while executing this line:
<https://builds.apache.org/hudson/job/CXF-trunk-deploy/ws/trunk/distribution/src/main/release/samples/ws_security/interopfest/wstrust13/download_wsdl.xml>:57:
The following error occurred while executing this line:
<https://builds.apache.org/hudson/job/CXF-trunk-deploy/ws/trunk/distribution/src/main/release/samples/ws_security/interopfest/wstrust13/download_wsdl.xml>:29:
Can't get http://131.107.153.205/PingService?wsdl to <https://builds.apache.org/hudson/job/CXF-trunk-deploy/ws/trunk/distribution/src/main/release/samples/ws_security/interopfest/wstrust13/target/wsdl/PingService.wsdl>
	at org.apache.tools.ant.ProjectHelper.addLocationToBuildException(ProjectHelper.java:497)
	at org.apache.tools.ant.taskdefs.Ant.execute(Ant.java:444)
	at org.apache.tools.ant.UnknownElement.execute(UnknownElement.java:291)
	at sun.reflect.GeneratedMethodAccessor169.invoke(Unknown Source)
	at sun.reflect.DelegatingMethodAccessorImpl.invoke(DelegatingMethodAccessorImpl.java:25)
	at java.lang.reflect.Method.invoke(Method.java:592)
	at org.apache.tools.ant.dispatch.DispatchUtils.execute(DispatchUtils.java:106)
	at org.apache.tools.ant.Task.perform(Task.java:348)
	at org.apache.tools.ant.Target.execute(Target.java:390)
	at org.apache.maven.plugin.antrun.AbstractAntMojo.executeTasks(AbstractAntMojo.java:211)
	... 32 more
Caused by: <https://builds.apache.org/hudson/job/CXF-trunk-deploy/ws/trunk/distribution/src/main/release/samples/ws_security/interopfest/wstrust13/download_wsdl.xml>:57:
The following error occurred while executing this line:
<https://builds.apache.org/hudson/job/CXF-trunk-deploy/ws/trunk/distribution/src/main/release/samples/ws_security/interopfest/wstrust13/download_wsdl.xml>:29:
Can't get http://131.107.153.205/PingService?wsdl to <https://builds.apache.org/hudson/job/CXF-trunk-deploy/ws/trunk/distribution/src/main/release/samples/ws_security/interopfest/wstrust13/target/wsdl/PingService.wsdl>
	at org.apache.tools.ant.ProjectHelper.addLocationToBuildException(ProjectHelper.java:497)
	at org.apache.tools.ant.taskdefs.Ant.execute(Ant.java:444)
	at org.apache.tools.ant.taskdefs.CallTarget.execute(CallTarget.java:105)
	at org.apache.tools.ant.UnknownElement.execute(UnknownElement.java:291)
	at sun.reflect.GeneratedMethodAccessor169.invoke(Unknown Source)
	at sun.reflect.DelegatingMethodAccessorImpl.invoke(DelegatingMethodAccessorImpl.java:25)
	at java.lang.reflect.Method.invoke(Method.java:592)
	at org.apache.tools.ant.dispatch.DispatchUtils.execute(DispatchUtils.java:106)
	at org.apache.tools.ant.Task.perform(Task.java:348)
	at org.apache.tools.ant.Target.execute(Target.java:390)
	at org.apache.tools.ant.Target.performTasks(Target.java:411)
	at org.apache.tools.ant.Project.executeSortedTargets(Project.java:1397)
	at org.apache.tools.ant.helper.SingleCheckExecutor.executeTargets(SingleCheckExecutor.java:38)
	at org.apache.tools.ant.Project.executeTargets(Project.java:1249)
	at org.apache.tools.ant.taskdefs.Ant.execute(Ant.java:442)
	... 40 more
Caused by: <https://builds.apache.org/hudson/job/CXF-trunk-deploy/ws/trunk/distribution/src/main/release/samples/ws_security/interopfest/wstrust13/download_wsdl.xml>:29:
Can't get http://131.107.153.205/PingService?wsdl to <https://builds.apache.org/hudson/job/CXF-trunk-deploy/ws/trunk/distribution/src/main/release/samples/ws_security/interopfest/wstrust13/target/wsdl/PingService.wsdl>
	at org.apache.tools.ant.taskdefs.Get$GetThread.downloadFile(Get.java:737)
	at org.apache.tools.ant.taskdefs.Get$GetThread.get(Get.java:588)
	at org.apache.tools.ant.taskdefs.Get$GetThread.run(Get.java:571)
[INFO] ------------------------------------------------------------------------
[INFO] Total time: 41 minutes 5 seconds
[INFO] Finished at: Wed Jun 01 23:02:03 GMT-08:00 2011
[INFO] Final Memory: 182M/289M
[INFO] ------------------------------------------------------------------------
Sending e-mails to: notifications@cxf.apache.org
channel stopped


Mime
View raw message