cxf-notifications mailing list archives

Site index · List index
Message view « Date » · « Thread »
Top « Date » · « Thread »
From Apache Jenkins Server <jenk...@builds.apache.org>
Subject Build failed in Jenkins: CXF-DOSGi #188
Date Wed, 29 Jun 2011 11:56:25 GMT
See <https://builds.apache.org/job/CXF-DOSGi/188/changes>

Changes:

[sergeyb] Reverting the change

------------------------------------------
[...truncated 1868 lines...]
[INFO] [remote-resources:process {execution: default}]
[debug] execute contextualize
[INFO] [resources:resources]
[INFO] Using 'UTF-8' encoding to copy filtered resources.
[INFO] skip non existing resourceDirectory <https://builds.apache.org/job/CXF-DOSGi/ws/trunk/samples/discovery/interface/src/main/resources>
[INFO] Copying 3 resources
[INFO] [compiler:compile]
[INFO] Compiling 1 source file to <https://builds.apache.org/job/CXF-DOSGi/ws/trunk/samples/discovery/interface/target/classes>
[debug] execute contextualize
[INFO] [resources:testResources]
[INFO] Using 'UTF-8' encoding to copy filtered resources.
[INFO] skip non existing resourceDirectory <https://builds.apache.org/job/CXF-DOSGi/ws/trunk/samples/discovery/interface/src/test/resources>
[INFO] Copying 3 resources
[INFO] [compiler:testCompile]
[INFO] No sources to compile
[INFO] [surefire:test]
[INFO] Surefire report directory: <https://builds.apache.org/job/CXF-DOSGi/ws/trunk/samples/discovery/interface/target/surefire-reports>
[WARNING] Build uses Maven 2.0.x, cannot propagate system properties from command line to
tests (cf. SUREFIRE-121)

-------------------------------------------------------
 T E S T S
-------------------------------------------------------
There are no tests to run.

Results :

Tests run: 0, Failures: 0, Errors: 0, Skipped: 0

[JENKINS] Recording test results[INFO] [bundle:bundle]
[INFO] [install:install]
[INFO] Installing <https://builds.apache.org/job/CXF-DOSGi/ws/trunk/samples/discovery/interface/target/cxf-dosgi-ri-samples-discovery-interface-1.3-SNAPSHOT.jar>
to <https://builds.apache.org/job/CXF-DOSGi/ws/.repository/org/apache/cxf/dosgi/samples/cxf-dosgi-ri-samples-discovery-interface/1.3-SNAPSHOT/cxf-dosgi-ri-samples-discovery-interface-1.3-SNAPSHOT.jar>
[INFO] [bundle:install]
[INFO] Parsing <https://builds.apache.org/job/CXF-DOSGi/ws/.repository/repository.xml>
[INFO] Installing org/apache/cxf/dosgi/samples/cxf-dosgi-ri-samples-discovery-interface/1.3-SNAPSHOT/cxf-dosgi-ri-samples-discovery-interface-1.3-SNAPSHOT.jar
[INFO] Writing OBR metadata

[JENKINS] Archiving <https://builds.apache.org/job/CXF-DOSGi/ws/trunk/samples/discovery/interface/pom.xml>
to /home/hudson/hudson/jobs/CXF-DOSGi/modules/org.apache.cxf.dosgi.samples$cxf-dosgi-ri-samples-discovery-interface/builds/2011-06-29_11-53-58/archive/org.apache.cxf.dosgi.samples/cxf-dosgi-ri-samples-discovery-interface/1.3-SNAPSHOT/cxf-dosgi-ri-samples-discovery-interface-1.3-SNAPSHOT.pom
[JENKINS] Archiving <https://builds.apache.org/job/CXF-DOSGi/ws/trunk/samples/discovery/interface/target/cxf-dosgi-ri-samples-discovery-interface-1.3-SNAPSHOT.jar>
to /home/hudson/hudson/jobs/CXF-DOSGi/modules/org.apache.cxf.dosgi.samples$cxf-dosgi-ri-samples-discovery-interface/builds/2011-06-29_11-53-58/archive/org.apache.cxf.dosgi.samples/cxf-dosgi-ri-samples-discovery-interface/1.3-SNAPSHOT/cxf-dosgi-ri-samples-discovery-interface-1.3-SNAPSHOT.jar
[INFO] ------------------------------------------------------------------------
[INFO] Building Distributed OSGI Discovery Sample Implementation Bundle
[INFO]    task-segment: [clean, install]
[INFO] ------------------------------------------------------------------------
[INFO] [clean:clean]
[INFO] Deleting directory <https://builds.apache.org/job/CXF-DOSGi/ws/trunk/samples/discovery/impl/target>
[INFO] [remote-resources:process {execution: default}]
[INFO] snapshot org.apache.cxf.dosgi.samples:cxf-dosgi-ri-samples-discovery-interface:1.3-SNAPSHOT:
checking for updates from apache.snapshots
[INFO] snapshot org.apache.cxf.dosgi.samples:cxf-dosgi-ri-samples-discovery-interface:1.3-SNAPSHOT:
checking for updates from springframework.org
[debug] execute contextualize
[INFO] [resources:resources]
[INFO] Using 'UTF-8' encoding to copy filtered resources.
[INFO] skip non existing resourceDirectory <https://builds.apache.org/job/CXF-DOSGi/ws/trunk/samples/discovery/impl/src/main/resources>
[INFO] Copying 3 resources
[INFO] [compiler:compile]
[INFO] Compiling 2 source files to <https://builds.apache.org/job/CXF-DOSGi/ws/trunk/samples/discovery/impl/target/classes>
[debug] execute contextualize
[INFO] [resources:testResources]
[INFO] Using 'UTF-8' encoding to copy filtered resources.
[INFO] skip non existing resourceDirectory <https://builds.apache.org/job/CXF-DOSGi/ws/trunk/samples/discovery/impl/src/test/resources>
[INFO] Copying 3 resources
[INFO] [compiler:testCompile]
[INFO] No sources to compile
[INFO] [surefire:test]
[INFO] Surefire report directory: <https://builds.apache.org/job/CXF-DOSGi/ws/trunk/samples/discovery/impl/target/surefire-reports>
[WARNING] Build uses Maven 2.0.x, cannot propagate system properties from command line to
tests (cf. SUREFIRE-121)

-------------------------------------------------------
 T E S T S
-------------------------------------------------------
There are no tests to run.

Results :

Tests run: 0, Failures: 0, Errors: 0, Skipped: 0

[JENKINS] Recording test results[INFO] [bundle:bundle]
[INFO] [install:install]
[INFO] Installing <https://builds.apache.org/job/CXF-DOSGi/ws/trunk/samples/discovery/impl/target/cxf-dosgi-ri-samples-discovery-impl-1.3-SNAPSHOT.jar>
to <https://builds.apache.org/job/CXF-DOSGi/ws/.repository/org/apache/cxf/dosgi/samples/cxf-dosgi-ri-samples-discovery-impl/1.3-SNAPSHOT/cxf-dosgi-ri-samples-discovery-impl-1.3-SNAPSHOT.jar>
[INFO] [bundle:install]
[INFO] Parsing <https://builds.apache.org/job/CXF-DOSGi/ws/.repository/repository.xml>

[INFO] Installing org/apache/cxf/dosgi/samples/cxf-dosgi-ri-samples-discovery-impl/1.3-SNAPSHOT/cxf-dosgi-ri-samples-discovery-impl-1.3-SNAPSHOT.jar
[INFO] Writing OBR metadata
[JENKINS] Archiving <https://builds.apache.org/job/CXF-DOSGi/ws/trunk/samples/discovery/impl/pom.xml>
to /home/hudson/hudson/jobs/CXF-DOSGi/modules/org.apache.cxf.dosgi.samples$cxf-dosgi-ri-samples-discovery-impl/builds/2011-06-29_11-53-58/archive/org.apache.cxf.dosgi.samples/cxf-dosgi-ri-samples-discovery-impl/1.3-SNAPSHOT/cxf-dosgi-ri-samples-discovery-impl-1.3-SNAPSHOT.pom
[JENKINS] Archiving <https://builds.apache.org/job/CXF-DOSGi/ws/trunk/samples/discovery/impl/target/cxf-dosgi-ri-samples-discovery-impl-1.3-SNAPSHOT.jar>
to /home/hudson/hudson/jobs/CXF-DOSGi/modules/org.apache.cxf.dosgi.samples$cxf-dosgi-ri-samples-discovery-impl/builds/2011-06-29_11-53-58/archive/org.apache.cxf.dosgi.samples/cxf-dosgi-ri-samples-discovery-impl/1.3-SNAPSHOT/cxf-dosgi-ri-samples-discovery-impl-1.3-SNAPSHOT.jar
[INFO] ------------------------------------------------------------------------
[INFO] Building Distributed OSGI Discovery Sample Client Bundle
[INFO]    task-segment: [clean, install]
[INFO] ------------------------------------------------------------------------
[INFO] [clean:clean]
[INFO] Deleting directory <https://builds.apache.org/job/CXF-DOSGi/ws/trunk/samples/discovery/client/target>
[INFO] [remote-resources:process {execution: default}]
[debug] execute contextualize
[INFO] [resources:resources]
[INFO] Using 'UTF-8' encoding to copy filtered resources.
[INFO] skip non existing resourceDirectory <https://builds.apache.org/job/CXF-DOSGi/ws/trunk/samples/discovery/client/src/main/resources>
[INFO] Copying 3 resources
[INFO] [compiler:compile]
[INFO] Compiling 1 source file to <https://builds.apache.org/job/CXF-DOSGi/ws/trunk/samples/discovery/client/target/classes>
[debug] execute contextualize
[INFO] [resources:testResources]
[INFO] Using 'UTF-8' encoding to copy filtered resources.
[INFO] skip non existing resourceDirectory <https://builds.apache.org/job/CXF-DOSGi/ws/trunk/samples/discovery/client/src/test/resources>
[INFO] Copying 3 resources
[INFO] [compiler:testCompile]
[INFO] No sources to compile
[INFO] [surefire:test]
[INFO] Surefire report directory: <https://builds.apache.org/job/CXF-DOSGi/ws/trunk/samples/discovery/client/target/surefire-reports>
[WARNING] Build uses Maven 2.0.x, cannot propagate system properties from command line to
tests (cf. SUREFIRE-121)

-------------------------------------------------------
 T E S T S
-------------------------------------------------------
There are no tests to run.

Results :

Tests run: 0, Failures: 0, Errors: 0, Skipped: 0

[JENKINS] Recording test results[INFO] [bundle:bundle]
[INFO] [install:install]
[INFO] Installing <https://builds.apache.org/job/CXF-DOSGi/ws/trunk/samples/discovery/client/target/cxf-dosgi-ri-samples-discovery-client-1.3-SNAPSHOT.jar>
to <https://builds.apache.org/job/CXF-DOSGi/ws/.repository/org/apache/cxf/dosgi/samples/cxf-dosgi-ri-samples-discovery-client/1.3-SNAPSHOT/cxf-dosgi-ri-samples-discovery-client-1.3-SNAPSHOT.jar>
[INFO] [bundle:install]
[INFO] Parsing <https://builds.apache.org/job/CXF-DOSGi/ws/.repository/repository.xml>
[INFO] Installing org/apache/cxf/dosgi/samples/cxf-dosgi-ri-samples-discovery-client/1.3-SNAPSHOT/cxf-dosgi-ri-samples-discovery-client-1.3-SNAPSHOT.jar
[INFO] Writing OBR metadata

[JENKINS] Archiving <https://builds.apache.org/job/CXF-DOSGi/ws/trunk/samples/discovery/client/pom.xml>
to /home/hudson/hudson/jobs/CXF-DOSGi/modules/org.apache.cxf.dosgi.samples$cxf-dosgi-ri-samples-discovery-client/builds/2011-06-29_11-53-58/archive/org.apache.cxf.dosgi.samples/cxf-dosgi-ri-samples-discovery-client/1.3-SNAPSHOT/cxf-dosgi-ri-samples-discovery-client-1.3-SNAPSHOT.pom
[JENKINS] Archiving <https://builds.apache.org/job/CXF-DOSGi/ws/trunk/samples/discovery/client/target/cxf-dosgi-ri-samples-discovery-client-1.3-SNAPSHOT.jar>
to /home/hudson/hudson/jobs/CXF-DOSGi/modules/org.apache.cxf.dosgi.samples$cxf-dosgi-ri-samples-discovery-client/builds/2011-06-29_11-53-58/archive/org.apache.cxf.dosgi.samples/cxf-dosgi-ri-samples-discovery-client/1.3-SNAPSHOT/cxf-dosgi-ri-samples-discovery-client-1.3-SNAPSHOT.jar
[INFO] ------------------------------------------------------------------------
[INFO] Building Distributed OSGI Security Sample Bundle
[INFO]    task-segment: [clean, install]
[INFO] ------------------------------------------------------------------------
[INFO] [clean:clean]
[INFO] Deleting directory <https://builds.apache.org/job/CXF-DOSGi/ws/trunk/samples/security_filter/target>
[INFO] [remote-resources:process {execution: default}]
[debug] execute contextualize
[INFO] [resources:resources]
[INFO] Using 'UTF-8' encoding to copy filtered resources.
[INFO] skip non existing resourceDirectory <https://builds.apache.org/job/CXF-DOSGi/ws/trunk/samples/security_filter/src/main/resources>
[INFO] Copying 3 resources
[INFO] [compiler:compile]
[INFO] Compiling 3 source files to <https://builds.apache.org/job/CXF-DOSGi/ws/trunk/samples/security_filter/target/classes>
[debug] execute contextualize
[INFO] [resources:testResources]
[INFO] Using 'UTF-8' encoding to copy filtered resources.
[INFO] skip non existing resourceDirectory <https://builds.apache.org/job/CXF-DOSGi/ws/trunk/samples/security_filter/src/test/resources>
[INFO] Copying 3 resources
[INFO] [compiler:testCompile]
[INFO] No sources to compile
[INFO] [surefire:test]
[INFO] Surefire report directory: <https://builds.apache.org/job/CXF-DOSGi/ws/trunk/samples/security_filter/target/surefire-reports>
[WARNING] Build uses Maven 2.0.x, cannot propagate system properties from command line to
tests (cf. SUREFIRE-121)

-------------------------------------------------------
 T E S T S
-------------------------------------------------------
There are no tests to run.

Results :

Tests run: 0, Failures: 0, Errors: 0, Skipped: 0

[JENKINS] Recording test results[INFO] [bundle:bundle]
[INFO] [install:install]
[INFO] Installing <https://builds.apache.org/job/CXF-DOSGi/ws/trunk/samples/security_filter/target/cxf-dosgi-ri-bundles-sample-security-1.3-SNAPSHOT.jar>
to <https://builds.apache.org/job/CXF-DOSGi/ws/.repository/org/apache/cxf/dosgi/samples/cxf-dosgi-ri-bundles-sample-security/1.3-SNAPSHOT/cxf-dosgi-ri-bundles-sample-security-1.3-SNAPSHOT.jar>
[INFO] [bundle:install]
[INFO] Parsing <https://builds.apache.org/job/CXF-DOSGi/ws/.repository/repository.xml>
[INFO] Installing org/apache/cxf/dosgi/samples/cxf-dosgi-ri-bundles-sample-security/1.3-SNAPSHOT/cxf-dosgi-ri-bundles-sample-security-1.3-SNAPSHOT.jar
[INFO] Writing OBR metadata

[JENKINS] Archiving <https://builds.apache.org/job/CXF-DOSGi/ws/trunk/samples/security_filter/pom.xml>
to /home/hudson/hudson/jobs/CXF-DOSGi/modules/org.apache.cxf.dosgi.samples$cxf-dosgi-ri-bundles-sample-security/builds/2011-06-29_11-53-58/archive/org.apache.cxf.dosgi.samples/cxf-dosgi-ri-bundles-sample-security/1.3-SNAPSHOT/cxf-dosgi-ri-bundles-sample-security-1.3-SNAPSHOT.pom
[JENKINS] Archiving <https://builds.apache.org/job/CXF-DOSGi/ws/trunk/samples/security_filter/target/cxf-dosgi-ri-bundles-sample-security-1.3-SNAPSHOT.jar>
to /home/hudson/hudson/jobs/CXF-DOSGi/modules/org.apache.cxf.dosgi.samples$cxf-dosgi-ri-bundles-sample-security/builds/2011-06-29_11-53-58/archive/org.apache.cxf.dosgi.samples/cxf-dosgi-ri-bundles-sample-security/1.3-SNAPSHOT/cxf-dosgi-ri-bundles-sample-security-1.3-SNAPSHOT.jar
[INFO] ------------------------------------------------------------------------
[INFO] Building Distributed OSGI RI Sample Bundles
[INFO]    task-segment: [clean, install]
[INFO] ------------------------------------------------------------------------
[INFO] [clean:clean]
[INFO] Deleting directory <https://builds.apache.org/job/CXF-DOSGi/ws/trunk/samples/target>
[INFO] [remote-resources:process {execution: default}]
[INFO] [site:attach-descriptor]
[INFO] [install:install]
[INFO] Installing <https://builds.apache.org/job/CXF-DOSGi/ws/trunk/samples/pom.xml>
to <https://builds.apache.org/job/CXF-DOSGi/ws/.repository/org/apache/cxf/dosgi/samples/cxf-dosgi-ri-samples/1.3-SNAPSHOT/cxf-dosgi-ri-samples-1.3-SNAPSHOT.pom>
[JENKINS] Archiving <https://builds.apache.org/job/CXF-DOSGi/ws/trunk/samples/pom.xml>
to /home/hudson/hudson/jobs/CXF-DOSGi/modules/org.apache.cxf.dosgi.samples$cxf-dosgi-ri-samples/builds/2011-06-29_11-53-58/archive/org.apache.cxf.dosgi.samples/cxf-dosgi-ri-samples/1.3-SNAPSHOT/cxf-dosgi-ri-samples-1.3-SNAPSHOT.pom
[INFO] ------------------------------------------------------------------------
[INFO] Building Distributed OSGI Distribution Parent
[INFO]    task-segment: [clean, install]
[INFO] ------------------------------------------------------------------------
[INFO] [clean:clean]
[INFO] Deleting directory <https://builds.apache.org/job/CXF-DOSGi/ws/trunk/distribution/target>
[INFO] [remote-resources:process {execution: default}]
[INFO] [site:attach-descriptor]
[INFO] [install:install]
[INFO] Installing <https://builds.apache.org/job/CXF-DOSGi/ws/trunk/distribution/pom.xml>
to <https://builds.apache.org/job/CXF-DOSGi/ws/.repository/org/apache/cxf/dosgi/cxf-dosgi-ri-distribution-parent/1.3-SNAPSHOT/cxf-dosgi-ri-distribution-parent-1.3-SNAPSHOT.pom>
[JENKINS] Archiving <https://builds.apache.org/job/CXF-DOSGi/ws/trunk/distribution/pom.xml>
to /home/hudson/hudson/jobs/CXF-DOSGi/modules/org.apache.cxf.dosgi$cxf-dosgi-ri-distribution-parent/builds/2011-06-29_11-53-58/archive/org.apache.cxf.dosgi/cxf-dosgi-ri-distribution-parent/1.3-SNAPSHOT/cxf-dosgi-ri-distribution-parent-1.3-SNAPSHOT.pom
[INFO] ------------------------------------------------------------------------
[INFO] Building Distributed OSGI Multi-Bundle Distribution
[INFO]    task-segment: [clean, install]
[INFO] ------------------------------------------------------------------------
[INFO] ------------------------------------------------------------------------
[ERROR] BUILD ERROR
[INFO] ------------------------------------------------------------------------
[INFO] Error resolving version for 'org.apache.maven.plugins:maven-assembly-plugin': Plugin
requires Maven version 2.2.1
[INFO] ------------------------------------------------------------------------
[INFO] Trace
org.apache.maven.lifecycle.LifecycleExecutionException: Error resolving version for 'org.apache.maven.plugins:maven-assembly-plugin':
Plugin requires Maven version 2.2.1
	at org.apache.maven.lifecycle.DefaultLifecycleExecutor.verifyPlugin(DefaultLifecycleExecutor.java:1284)
	at org.apache.maven.lifecycle.DefaultLifecycleExecutor.bindPluginToLifecycle(DefaultLifecycleExecutor.java:1239)
	at org.apache.maven.lifecycle.DefaultLifecycleExecutor.constructLifecycleMappings(DefaultLifecycleExecutor.java:1005)
	at org.apache.maven.lifecycle.DefaultLifecycleExecutor.executeGoal(DefaultLifecycleExecutor.java:478)
	at org.apache.maven.lifecycle.DefaultLifecycleExecutor.executeGoalAndHandleFailures(DefaultLifecycleExecutor.java:331)
	at org.apache.maven.lifecycle.DefaultLifecycleExecutor.executeTaskSegments(DefaultLifecycleExecutor.java:292)
	at org.apache.maven.lifecycle.DefaultLifecycleExecutor.execute(DefaultLifecycleExecutor.java:142)
	at org.apache.maven.lifecycle.LifecycleExecutorInterceptor.execute(LifecycleExecutorInterceptor.java:65)
	at org.apache.maven.DefaultMaven.doExecute(DefaultMaven.java:336)
	at org.apache.maven.DefaultMaven.execute(DefaultMaven.java:129)
	at org.apache.maven.cli.MavenCli.main(MavenCli.java:301)
	at sun.reflect.NativeMethodAccessorImpl.invoke0(Native Method)
	at sun.reflect.NativeMethodAccessorImpl.invoke(NativeMethodAccessorImpl.java:39)
	at sun.reflect.DelegatingMethodAccessorImpl.invoke(DelegatingMethodAccessorImpl.java:25)
	at java.lang.reflect.Method.invoke(Method.java:597)
	at org.codehaus.classworlds.Launcher.launchEnhanced(Launcher.java:315)
	at org.codehaus.classworlds.Launcher.launch(Launcher.java:255)
	at hudson.maven.agent.Main.launch(Main.java:185)
	at hudson.maven.MavenBuilder.call(MavenBuilder.java:164)
	at hudson.maven.MavenModuleSetBuild$Builder.call(MavenModuleSetBuild.java:987)
	at hudson.maven.MavenModuleSetBuild$Builder.call(MavenModuleSetBuild.java:918)
	at hudson.remoting.UserRequest.perform(UserRequest.java:118)
	at hudson.remoting.UserRequest.perform(UserRequest.java:48)
	at hudson.remoting.Request$2.run(Request.java:270)
	at java.util.concurrent.Executors$RunnableAdapter.call(Executors.java:441)
	at java.util.concurrent.FutureTask$Sync.innerRun(FutureTask.java:303)
	at java.util.concurrent.FutureTask.run(FutureTask.java:138)
	at java.util.concurrent.ThreadPoolExecutor$Worker.runTask(ThreadPoolExecutor.java:886)
	at java.util.concurrent.ThreadPoolExecutor$Worker.run(ThreadPoolExecutor.java:908)
	at java.lang.Thread.run(Thread.java:619)
Caused by: org.apache.maven.plugin.version.PluginVersionResolutionException: Error resolving
version for 'org.apache.maven.plugins:maven-assembly-plugin': Plugin requires Maven version
2.2.1
	at org.apache.maven.plugin.DefaultPluginManager.checkRequiredMavenVersion(DefaultPluginManager.java:274)
	at org.apache.maven.plugin.DefaultPluginManager.verifyVersionedPlugin(DefaultPluginManager.java:197)
	at org.apache.maven.plugin.DefaultPluginManager.verifyPlugin(DefaultPluginManager.java:176)
	at org.apache.maven.lifecycle.DefaultLifecycleExecutor.verifyPlugin(DefaultLifecycleExecutor.java:1275)
	... 29 more
[INFO] ------------------------------------------------------------------------
[INFO] Total time: 1 minute 56 seconds
[INFO] Finished at: Wed Jun 29 04:56:23 PDT 2011
[INFO] Final Memory: 127M/281M
[INFO] ------------------------------------------------------------------------
channel stopped
[locks-and-latches] Releasing all the locks
[locks-and-latches] All the locks released


Mime
View raw message