cxf-notifications mailing list archives

Site index · List index
Message view « Date » · « Thread »
Top « Date » · « Thread »
From Apache Jenkins Server <jenk...@builds.apache.org>
Subject Build failed in Jenkins: CXF-Trunk-JDK15 » Apache CXF Test Utilities #2143
Date Wed, 08 Jun 2011 10:54:20 GMT
See <https://builds.apache.org/job/CXF-Trunk-JDK15/org.apache.cxf$cxf-testutils/2143/>

------------------------------------------
[INFO] ------------------------------------------------------------------------
[INFO] Building Apache CXF Test Utilities
[INFO]    task-segment: [clean, install]
[INFO] ------------------------------------------------------------------------
[INFO] [clean:clean {execution: default-clean}]
[INFO] Deleting <https://builds.apache.org/job/CXF-Trunk-JDK15/org.apache.cxf$cxf-testutils/ws/target>
[WARNING] DEPRECATED [sourceRoot]: Use the build-helper-maven-plugin to bind source directories
[INFO] [antrun:run {execution: validate}]
project.artifactId
[INFO] Executing tasks
    [mkdir] Created dir: <https://builds.apache.org/job/CXF-Trunk-JDK15/org.apache.cxf$cxf-testutils/ws/target/generated/src/main/resources/wsdl/type_test>
     [xslt] Processing <https://builds.apache.org/job/CXF-Trunk-JDK15/org.apache.cxf$cxf-testutils/ws/src/main/resources/wsdl/type_test/type_test.xsd>
to <https://builds.apache.org/job/CXF-Trunk-JDK15/org.apache.cxf$cxf-testutils/ws/target/generated/src/main/resources/wsdl/type_test/type_test_1.xsd>
     [xslt] Loading stylesheet <https://builds.apache.org/job/CXF-Trunk-JDK15/org.apache.cxf$cxf-testutils/ws/src/main/resources/wsdl/type_test/type_test_ID_xsd.xsl>
     [xslt] Processing <https://builds.apache.org/job/CXF-Trunk-JDK15/org.apache.cxf$cxf-testutils/ws/src/main/resources/wsdl/type_test/type_test.xsd>
to <https://builds.apache.org/job/CXF-Trunk-JDK15/org.apache.cxf$cxf-testutils/ws/target/generated/src/main/resources/wsdl/type_test/type_test_2.xsd>
     [xslt] Loading stylesheet <https://builds.apache.org/job/CXF-Trunk-JDK15/org.apache.cxf$cxf-testutils/ws/src/main/resources/wsdl/type_test/type_test_ID_xsd.xsl>
     [xslt] Processing <https://builds.apache.org/job/CXF-Trunk-JDK15/org.apache.cxf$cxf-testutils/ws/src/main/resources/wsdl/type_test/type_test.xsd>
to <https://builds.apache.org/job/CXF-Trunk-JDK15/org.apache.cxf$cxf-testutils/ws/target/generated/src/main/resources/wsdl/type_test/type_test_3.xsd>
     [xslt] Loading stylesheet <https://builds.apache.org/job/CXF-Trunk-JDK15/org.apache.cxf$cxf-testutils/ws/src/main/resources/wsdl/type_test/type_test_ID_xsd.xsl>
     [xslt] Processing <https://builds.apache.org/job/CXF-Trunk-JDK15/org.apache.cxf$cxf-testutils/ws/src/main/resources/wsdl/type_test/type_test.xsd>
to <https://builds.apache.org/job/CXF-Trunk-JDK15/org.apache.cxf$cxf-testutils/ws/target/generated/src/main/resources/wsdl/type_test/type_test_doclit.wsdl>
     [xslt] Loading stylesheet <https://builds.apache.org/job/CXF-Trunk-JDK15/org.apache.cxf$cxf-testutils/ws/src/main/resources/wsdl/type_test/type_test_wsdl.xsl>
     [xslt] Processing <https://builds.apache.org/job/CXF-Trunk-JDK15/org.apache.cxf$cxf-testutils/ws/src/main/resources/wsdl/type_test/type_test.xsd>
to <https://builds.apache.org/job/CXF-Trunk-JDK15/org.apache.cxf$cxf-testutils/ws/target/generated/src/main/resources/wsdl/type_test/type_test_rpclit.wsdl>
     [xslt] Loading stylesheet <https://builds.apache.org/job/CXF-Trunk-JDK15/org.apache.cxf$cxf-testutils/ws/src/main/resources/wsdl/type_test/type_test_wsdl.xsl>
     [xslt] Processing <https://builds.apache.org/job/CXF-Trunk-JDK15/org.apache.cxf$cxf-testutils/ws/src/main/resources/wsdl/type_test/type_test.xsd>
to <https://builds.apache.org/job/CXF-Trunk-JDK15/org.apache.cxf$cxf-testutils/ws/target/generated/src/main/resources/wsdl/type_test/type_test_xml_inc.wsdl>
     [xslt] Loading stylesheet <https://builds.apache.org/job/CXF-Trunk-JDK15/org.apache.cxf$cxf-testutils/ws/src/main/resources/wsdl/type_test/type_test_wsdl.xsl>
     [xslt] Processing <https://builds.apache.org/job/CXF-Trunk-JDK15/org.apache.cxf$cxf-testutils/ws/src/main/resources/wsdl/type_test/type_test.xsd>
to <https://builds.apache.org/job/CXF-Trunk-JDK15/org.apache.cxf$cxf-testutils/ws/target/generated/src/main/resources/wsdl/type_test/type_test_xml.wsdl>
     [xslt] Loading stylesheet <https://builds.apache.org/job/CXF-Trunk-JDK15/org.apache.cxf$cxf-testutils/ws/src/main/resources/wsdl/type_test/type_test_xml_wsdl.xsl>
     [xslt] Processing <https://builds.apache.org/job/CXF-Trunk-JDK15/org.apache.cxf$cxf-testutils/ws/src/main/resources/wsdl/type_test/type_test.xsd>
to <https://builds.apache.org/job/CXF-Trunk-JDK15/org.apache.cxf$cxf-testutils/ws/target/generated/src/main/resources/wsdl/type_test/type_test_doclit_soap.wsdl>
     [xslt] Loading stylesheet <https://builds.apache.org/job/CXF-Trunk-JDK15/org.apache.cxf$cxf-testutils/ws/src/main/resources/wsdl/type_test/type_test_soap_wsdl.xsl>
     [xslt] Processing <https://builds.apache.org/job/CXF-Trunk-JDK15/org.apache.cxf$cxf-testutils/ws/src/main/resources/wsdl/type_test/type_test.xsd>
to <https://builds.apache.org/job/CXF-Trunk-JDK15/org.apache.cxf$cxf-testutils/ws/target/generated/src/main/resources/wsdl/type_test/type_test_rpclit_soap.wsdl>
     [xslt] Loading stylesheet <https://builds.apache.org/job/CXF-Trunk-JDK15/org.apache.cxf$cxf-testutils/ws/src/main/resources/wsdl/type_test/type_test_soap_wsdl.xsl>
    [mkdir] Created dir: <https://builds.apache.org/job/CXF-Trunk-JDK15/org.apache.cxf$cxf-testutils/ws/target/generated/src/main/java/org/apache/cxf/systest/type_test>
     [xslt] Processing <https://builds.apache.org/job/CXF-Trunk-JDK15/org.apache.cxf$cxf-testutils/ws/src/main/resources/wsdl/type_test/type_test.xsd>
to <https://builds.apache.org/job/CXF-Trunk-JDK15/org.apache.cxf$cxf-testutils/ws/target/generated/src/main/java/org/apache/cxf/systest/type_test/TypeTestImpl.java>
     [xslt] Loading stylesheet <https://builds.apache.org/job/CXF-Trunk-JDK15/org.apache.cxf$cxf-testutils/ws/src/main/resources/wsdl/type_test/type_test_impl_java.xsl>
     [xslt] Processing <https://builds.apache.org/job/CXF-Trunk-JDK15/org.apache.cxf$cxf-testutils/ws/src/main/resources/wsdl/type_test/type_test.xsd>
to <https://builds.apache.org/job/CXF-Trunk-JDK15/org.apache.cxf$cxf-testutils/ws/target/generated/src/main/java/org/apache/cxf/systest/type_test/TypeTestTester.java>
     [xslt] Loading stylesheet <https://builds.apache.org/job/CXF-Trunk-JDK15/org.apache.cxf$cxf-testutils/ws/src/main/resources/wsdl/type_test/type_test_tester_java.xsl>
[INFO] Executed tasks
[INFO] Registering compile source root <https://builds.apache.org/job/CXF-Trunk-JDK15/org.apache.cxf$cxf-testutils/ws/target/generated/src/main/java>
[INFO] [cxf-xml2fastinfoset:xml2fastinfoset {execution: xml2fastinfoset}]
[INFO] [cxf-codegen:wsdl2java {execution: generate-sources}]
[INFO] Running wsdl2java in fork mode...
[INFO] Building jar: /tmp/cxf-tmp-847671/cxf-codegen4773004913046695885.jar
[JENKINS] Archiving <https://builds.apache.org/job/CXF-Trunk-JDK15/org.apache.cxf$cxf-testutils/ws/pom.xml>
to /home/hudson/hudson/jobs/CXF-Trunk-JDK15/modules/org.apache.cxf$cxf-testutils/builds/2011-06-08_10-51-28/archive/org.apache.cxf/cxf-testutils/2.4.1-SNAPSHOT/cxf-testutils-2.4.1-SNAPSHOT.pom
[INFO] ------------------------------------------------------------------------
[ERROR] BUILD ERROR
[INFO] ------------------------------------------------------------------------
[INFO] 
Exit code: 1 - Unexpected argument: <https://builds.apache.org/job/CXF-Trunk-JDK15/org.apache.cxf$cxf-testutils/ws/src/main/resources/wsdl/jms_test_mtom.wsdl>

Usage : wsdl2java -fe <front-end-name> -db <data-binding-name> -wv <wsdl-version>
-p <[wsdl-namespace =]package-name>* -sn <service-name> -b <binding-file-name>*
-reserveClass <class-name>* -catalog <catalog-file-name> -d <output-directory>
-compile -classdir <compile-classes-directory> -impl -server -client -all -autoNameResolution
-allowElementReferences<=true> -defaultValues<=class-name-for-DefaultValueProvider>
-ant -nexclude <schema-namespace [= java-package-name]>* -exsh <(true, false)>
-noTypes -dns <Default value is true> -dex <(true, false)> -validate -keep -wsdlLocation
<wsdlLocation> -xjc<xjc-arguments>* -noAddressBinding -faultSerialVersionUID -mark-generated
-h -v -verbose -quiet -wsdlList <wsdlurl> 

Exception in thread "main" org.apache.cxf.tools.common.ToolException: org.apache.cxf.tools.common.toolspec.parser.BadUsageException:
Unexpected argument: <https://builds.apache.org/job/CXF-Trunk-JDK15/org.apache.cxf$cxf-testutils/ws/src/main/resources/wsdl/jms_test_mtom.wsdl>

	at org.apache.cxf.tools.common.toolspec.AbstractToolContainer.execute(AbstractToolContainer.java:180)
	at org.apache.cxf.tools.common.AbstractCXFToolContainer.execute(AbstractCXFToolContainer.java:72)
	at org.apache.cxf.tools.wsdlto.WSDLToJavaContainer.execute(WSDLToJavaContainer.java:281)
	at org.apache.cxf.tools.common.toolspec.ToolRunner.runTool(ToolRunner.java:103)
	at org.apache.cxf.tools.wsdlto.WSDLToJava.run(WSDLToJava.java:113)
	at org.apache.cxf.tools.wsdlto.WSDLToJava.run(WSDLToJava.java:86)
	at org.apache.cxf.maven_plugin.ForkOnceWSDL2Java.main(ForkOnceWSDL2Java.java:50)
Caused by: org.apache.cxf.tools.common.toolspec.parser.BadUsageException: Unexpected argument:
<https://builds.apache.org/job/CXF-Trunk-JDK15/org.apache.cxf$cxf-testutils/ws/src/main/resources/wsdl/jms_test_mtom.wsdl>

	at org.apache.cxf.tools.common.toolspec.parser.CommandLineParser.throwUsage(CommandLineParser.java:199)
	at org.apache.cxf.tools.common.toolspec.parser.CommandLineParser.parseArguments(CommandLineParser.java:174)
	at org.apache.cxf.tools.common.toolspec.AbstractToolContainer.parseCommandLine(AbstractToolContainer.java:89)
	at org.apache.cxf.tools.common.toolspec.AbstractToolContainer.execute(AbstractToolContainer.java:178)
	... 6 more

Command line was: /home/hudson/tools/java/jdk1.5.0_22-32/jre/bin/java -jar /tmp/cxf-tmp-847671/cxf-codegen4773004913046695885.jar
/tmp/cxf-tmp-847671/cxf-w2j1865119741372307294args


[INFO] ------------------------------------------------------------------------
[INFO] Trace
org.apache.maven.lifecycle.LifecycleExecutionException: 
Exit code: 1 - Unexpected argument: <https://builds.apache.org/job/CXF-Trunk-JDK15/org.apache.cxf$cxf-testutils/ws/src/main/resources/wsdl/jms_test_mtom.wsdl>

Usage : wsdl2java -fe <front-end-name> -db <data-binding-name> -wv <wsdl-version>
-p <[wsdl-namespace =]package-name>* -sn <service-name> -b <binding-file-name>*
-reserveClass <class-name>* -catalog <catalog-file-name> -d <output-directory>
-compile -classdir <compile-classes-directory> -impl -server -client -all -autoNameResolution
-allowElementReferences<=true> -defaultValues<=class-name-for-DefaultValueProvider>
-ant -nexclude <schema-namespace [= java-package-name]>* -exsh <(true, false)>
-noTypes -dns <Default value is true> -dex <(true, false)> -validate -keep -wsdlLocation
<wsdlLocation> -xjc<xjc-arguments>* -noAddressBinding -faultSerialVersionUID -mark-generated
-h -v -verbose -quiet -wsdlList <wsdlurl> 

Exception in thread "main" org.apache.cxf.tools.common.ToolException: org.apache.cxf.tools.common.toolspec.parser.BadUsageException:
Unexpected argument: <https://builds.apache.org/job/CXF-Trunk-JDK15/org.apache.cxf$cxf-testutils/ws/src/main/resources/wsdl/jms_test_mtom.wsdl>

	at org.apache.cxf.tools.common.toolspec.AbstractToolContainer.execute(AbstractToolContainer.java:180)
	at org.apache.cxf.tools.common.AbstractCXFToolContainer.execute(AbstractCXFToolContainer.java:72)
	at org.apache.cxf.tools.wsdlto.WSDLToJavaContainer.execute(WSDLToJavaContainer.java:281)
	at org.apache.cxf.tools.common.toolspec.ToolRunner.runTool(ToolRunner.java:103)
	at org.apache.cxf.tools.wsdlto.WSDLToJava.run(WSDLToJava.java:113)
	at org.apache.cxf.tools.wsdlto.WSDLToJava.run(WSDLToJava.java:86)
	at org.apache.cxf.maven_plugin.ForkOnceWSDL2Java.main(ForkOnceWSDL2Java.java:50)
Caused by: org.apache.cxf.tools.common.toolspec.parser.BadUsageException: Unexpected argument:
<https://builds.apache.org/job/CXF-Trunk-JDK15/org.apache.cxf$cxf-testutils/ws/src/main/resources/wsdl/jms_test_mtom.wsdl>

	at org.apache.cxf.tools.common.toolspec.parser.CommandLineParser.throwUsage(CommandLineParser.java:199)
	at org.apache.cxf.tools.common.toolspec.parser.CommandLineParser.parseArguments(CommandLineParser.java:174)
	at org.apache.cxf.tools.common.toolspec.AbstractToolContainer.parseCommandLine(AbstractToolContainer.java:89)
	at org.apache.cxf.tools.common.toolspec.AbstractToolContainer.execute(AbstractToolContainer.java:178)
	... 6 more

Command line was: /home/hudson/tools/java/jdk1.5.0_22-32/jre/bin/java -jar /tmp/cxf-tmp-847671/cxf-codegen4773004913046695885.jar
/tmp/cxf-tmp-847671/cxf-w2j1865119741372307294args


	at org.apache.maven.lifecycle.DefaultLifecycleExecutor.executeGoals(DefaultLifecycleExecutor.java:719)
	at org.apache.maven.lifecycle.DefaultLifecycleExecutor.executeGoalWithLifecycle(DefaultLifecycleExecutor.java:556)
	at org.apache.maven.lifecycle.DefaultLifecycleExecutor.executeGoal(DefaultLifecycleExecutor.java:535)
	at org.apache.maven.lifecycle.DefaultLifecycleExecutor.executeGoalAndHandleFailures(DefaultLifecycleExecutor.java:387)
	at org.apache.maven.lifecycle.DefaultLifecycleExecutor.executeTaskSegments(DefaultLifecycleExecutor.java:348)
	at org.apache.maven.lifecycle.DefaultLifecycleExecutor.execute(DefaultLifecycleExecutor.java:180)
	at org.apache.maven.lifecycle.LifecycleExecutorInterceptor.execute(LifecycleExecutorInterceptor.java:65)
	at org.apache.maven.DefaultMaven.doExecute(DefaultMaven.java:328)
	at org.apache.maven.DefaultMaven.execute(DefaultMaven.java:138)
	at org.apache.maven.cli.MavenCli.main(MavenCli.java:362)
	at sun.reflect.NativeMethodAccessorImpl.invoke0(Native Method)
	at sun.reflect.NativeMethodAccessorImpl.invoke(NativeMethodAccessorImpl.java:39)
	at sun.reflect.DelegatingMethodAccessorImpl.invoke(DelegatingMethodAccessorImpl.java:25)
	at java.lang.reflect.Method.invoke(Method.java:592)
	at org.codehaus.classworlds.Launcher.launchEnhanced(Launcher.java:315)
	at org.codehaus.classworlds.Launcher.launch(Launcher.java:255)
	at hudson.maven.agent.Main.launch(Main.java:185)
	at hudson.maven.MavenBuilder.call(MavenBuilder.java:164)
	at hudson.maven.MavenModuleSetBuild$Builder.call(MavenModuleSetBuild.java:987)
	at hudson.maven.MavenModuleSetBuild$Builder.call(MavenModuleSetBuild.java:918)
	at hudson.remoting.UserRequest.perform(UserRequest.java:118)
	at hudson.remoting.UserRequest.perform(UserRequest.java:48)
	at hudson.remoting.Request$2.run(Request.java:270)
	at java.util.concurrent.Executors$RunnableAdapter.call(Executors.java:417)
	at java.util.concurrent.FutureTask$Sync.innerRun(FutureTask.java:269)
	at java.util.concurrent.FutureTask.run(FutureTask.java:123)
	at java.util.concurrent.ThreadPoolExecutor$Worker.runTask(ThreadPoolExecutor.java:651)
	at java.util.concurrent.ThreadPoolExecutor$Worker.run(ThreadPoolExecutor.java:676)
	at java.lang.Thread.run(Thread.java:595)
Caused by: org.apache.maven.plugin.MojoExecutionException: 
Exit code: 1 - Unexpected argument: <https://builds.apache.org/job/CXF-Trunk-JDK15/org.apache.cxf$cxf-testutils/ws/src/main/resources/wsdl/jms_test_mtom.wsdl>

Usage : wsdl2java -fe <front-end-name> -db <data-binding-name> -wv <wsdl-version>
-p <[wsdl-namespace =]package-name>* -sn <service-name> -b <binding-file-name>*
-reserveClass <class-name>* -catalog <catalog-file-name> -d <output-directory>
-compile -classdir <compile-classes-directory> -impl -server -client -all -autoNameResolution
-allowElementReferences<=true> -defaultValues<=class-name-for-DefaultValueProvider>
-ant -nexclude <schema-namespace [= java-package-name]>* -exsh <(true, false)>
-noTypes -dns <Default value is true> -dex <(true, false)> -validate -keep -wsdlLocation
<wsdlLocation> -xjc<xjc-arguments>* -noAddressBinding -faultSerialVersionUID -mark-generated
-h -v -verbose -quiet -wsdlList <wsdlurl> 

Exception in thread "main" org.apache.cxf.tools.common.ToolException: org.apache.cxf.tools.common.toolspec.parser.BadUsageException:
Unexpected argument: <https://builds.apache.org/job/CXF-Trunk-JDK15/org.apache.cxf$cxf-testutils/ws/src/main/resources/wsdl/jms_test_mtom.wsdl>

	at org.apache.cxf.tools.common.toolspec.AbstractToolContainer.execute(AbstractToolContainer.java:180)
	at org.apache.cxf.tools.common.AbstractCXFToolContainer.execute(AbstractCXFToolContainer.java:72)
	at org.apache.cxf.tools.wsdlto.WSDLToJavaContainer.execute(WSDLToJavaContainer.java:281)
	at org.apache.cxf.tools.common.toolspec.ToolRunner.runTool(ToolRunner.java:103)
	at org.apache.cxf.tools.wsdlto.WSDLToJava.run(WSDLToJava.java:113)
	at org.apache.cxf.tools.wsdlto.WSDLToJava.run(WSDLToJava.java:86)
	at org.apache.cxf.maven_plugin.ForkOnceWSDL2Java.main(ForkOnceWSDL2Java.java:50)
Caused by: org.apache.cxf.tools.common.toolspec.parser.BadUsageException: Unexpected argument:
<https://builds.apache.org/job/CXF-Trunk-JDK15/org.apache.cxf$cxf-testutils/ws/src/main/resources/wsdl/jms_test_mtom.wsdl>

	at org.apache.cxf.tools.common.toolspec.parser.CommandLineParser.throwUsage(CommandLineParser.java:199)
	at org.apache.cxf.tools.common.toolspec.parser.CommandLineParser.parseArguments(CommandLineParser.java:174)
	at org.apache.cxf.tools.common.toolspec.AbstractToolContainer.parseCommandLine(AbstractToolContainer.java:89)
	at org.apache.cxf.tools.common.toolspec.AbstractToolContainer.execute(AbstractToolContainer.java:178)
	... 6 more

Command line was: /home/hudson/tools/java/jdk1.5.0_22-32/jre/bin/java -jar /tmp/cxf-tmp-847671/cxf-codegen4773004913046695885.jar
/tmp/cxf-tmp-847671/cxf-w2j1865119741372307294args


	at org.apache.cxf.maven_plugin.WSDL2JavaMojo.runForked(WSDL2JavaMojo.java:716)
	at org.apache.cxf.maven_plugin.WSDL2JavaMojo.forkOnce(WSDL2JavaMojo.java:529)
	at org.apache.cxf.maven_plugin.WSDL2JavaMojo.execute(WSDL2JavaMojo.java:432)
	at org.apache.maven.plugin.DefaultPluginManager.executeMojo(DefaultPluginManager.java:490)
	at hudson.maven.agent.PluginManagerInterceptor.executeMojo(PluginManagerInterceptor.java:182)
	at org.apache.maven.lifecycle.DefaultLifecycleExecutor.executeGoals(DefaultLifecycleExecutor.java:694)
	... 28 more
[INFO] ------------------------------------------------------------------------
[INFO] Total time: 2 minutes 14 seconds
[INFO] Finished at: Wed Jun 08 10:54:19 UTC 2011
[INFO] Final Memory: 70M/125M
[INFO] ------------------------------------------------------------------------


Mime
View raw message