cxf-notifications mailing list archives

Site index · List index
Message view « Date » · « Thread »
Top « Date » · « Thread »
From Apache Jenkins Server <hud...@hudson.apache.org>
Subject Build failed in Jenkins: CXF-2.3.x-windows #155
Date Thu, 26 May 2011 19:15:58 GMT
See <https://builds.apache.org/hudson/job/CXF-2.3.x-windows/155/changes>

Changes:

[dkulp] Blocked revisions 1127874,1127991,1128035 via svnmerge

........
  r1127874 | sergeyb | 2011-05-26 07:28:18 -0400 (Thu, 26 May 2011) | 1 line
  
  [CXF-3549] Support for docLocation attribute
........
  r1127991 | sergeyb | 2011-05-26 12:56:16 -0400 (Thu, 26 May 2011) | 1 line
  
  [CXF-3549] Initial support for serving external schemas
........
  r1128035 | dkulp | 2011-05-26 14:58:55 -0400 (Thu, 26 May 2011) | 4 lines
  
  [CXF-3514] Start splitting the PRE_PROTOCOL phase to reduce the number
  of interceptors that live in it and help make sure the interceptors are
  all run in an order that actually will work.
  (Note to self: Need to run TCK to verify this change)
........

[dkulp] Recorded merge of revisions 1127633 via svnmerge from 
https://svn.apache.org/repos/asf/cxf/trunk

........
  r1127633 | ay | 2011-05-25 15:00:05 -0400 (Wed, 25 May 2011) | 1 line
  
  [CXF-3179] ServerPersistenceTest to use synchronized variables to avoid occasional test
errors
........

[dkulp] Merged revisions 1128036 via svnmerge from 
https://svn.apache.org/repos/asf/cxf/trunk

........
  r1128036 | dkulp | 2011-05-26 14:59:17 -0400 (Thu, 26 May 2011) | 1 line
  
  [CXF-2465, CXF-3182] Output wsdl:documentation information into javadoc
........

[dkulp] Merged revisions 1127694 via svnmerge from 
https://svn.apache.org/repos/asf/cxf/trunk

........
  r1127694 | dkulp | 2011-05-25 17:39:02 -0400 (Wed, 25 May 2011) | 1 line
  
  Remove printlns from tests
........

------------------------------------------
[...truncated 363 lines...]
Tests run: 1, Failures: 0, Errors: 0, Skipped: 0, Time elapsed: 0.004 sec
Running org.apache.cxf.service.model.BindingMessageInfoTest
Tests run: 1, Failures: 0, Errors: 0, Skipped: 0, Time elapsed: 0.002 sec
Running org.apache.cxf.service.model.BindingOperationInfoTest
Tests run: 6, Failures: 0, Errors: 0, Skipped: 0, Time elapsed: 0.008 sec
Running org.apache.cxf.service.model.FaultInfoTest
Tests run: 1, Failures: 0, Errors: 0, Skipped: 0, Time elapsed: 0.002 sec
Running org.apache.cxf.service.model.InterfaceInfoTest
Tests run: 2, Failures: 0, Errors: 0, Skipped: 0, Time elapsed: 0.028 sec
Running org.apache.cxf.service.model.MessageInfoTest
Tests run: 2, Failures: 0, Errors: 0, Skipped: 0, Time elapsed: 0.003 sec
Running org.apache.cxf.service.model.MessagePartInfoTest
Tests run: 3, Failures: 0, Errors: 0, Skipped: 0, Time elapsed: 0.003 sec
Running org.apache.cxf.service.model.OperationInfoTest
Tests run: 5, Failures: 0, Errors: 0, Skipped: 0, Time elapsed: 0.004 sec
Running org.apache.cxf.ws.policy.AssertionInfoMapTest
Tests run: 4, Failures: 0, Errors: 0, Skipped: 0, Time elapsed: 0.013 sec
Running org.apache.cxf.ws.policy.IntersectorTest
Tests run: 3, Failures: 0, Errors: 0, Skipped: 0, Time elapsed: 0.007 sec
Running org.apache.cxf.ws.policy.builder.jaxb.JaxbAssertionBuilderTest
Tests run: 3, Failures: 0, Errors: 0, Skipped: 0, Time elapsed: 0.233 sec
Running org.apache.cxf.ws.policy.builder.jaxb.JaxbAssertionTest
Tests run: 3, Failures: 0, Errors: 0, Skipped: 0, Time elapsed: 0.032 sec
Running org.apache.cxf.ws.policy.builder.primitive.NestedPrimitiveAssertionBuilderTest
Tests run: 6, Failures: 0, Errors: 0, Skipped: 0, Time elapsed: 0.075 sec
Running org.apache.cxf.ws.policy.builder.primitive.NestedPrimitiveAssertionTest
Tests run: 4, Failures: 0, Errors: 0, Skipped: 0, Time elapsed: 0.004 sec
Running org.apache.cxf.wsdl.JAXBExtensionHelperTest
Tests run: 3, Failures: 0, Errors: 0, Skipped: 0, Time elapsed: 0.325 sec

Results :

Tests run: 75, Failures: 0, Errors: 0, Skipped: 0

[JENKINS] Recording test results
[INFO] [jar:jar {execution: default-jar}]
[INFO] Building jar: C:\hudson\hudson-slave\workspace\CXF-2.3.x-windows\2.3.x-fixes\api\target\cxf-api-2.3.5-SNAPSHOT.jar
[INFO] [javadoc:jar {execution: package}]
[WARNING] Are you sure about the <javadocVersion/> parameter? It seems to be 1.6
[INFO] Building jar: C:\hudson\hudson-slave\workspace\CXF-2.3.x-windows\2.3.x-fixes\api\target\cxf-api-2.3.5-SNAPSHOT-javadoc.jar
[INFO] [install:install {execution: default-install}]
[INFO] Installing C:\hudson\hudson-slave\workspace\CXF-2.3.x-windows\2.3.x-fixes\api\target\cxf-api-2.3.5-SNAPSHOT.jar
to <https://builds.apache.org/hudson/job/CXF-2.3.x-windows/ws/.repository\org\apache\cxf\cxf-api\2.3.5-SNAPSHOT\cxf-api-2.3.5-SNAPSHOT.jar>
[INFO] Installing C:\hudson\hudson-slave\workspace\CXF-2.3.x-windows\2.3.x-fixes\api\target\cxf-api-2.3.5-SNAPSHOT-javadoc.jar
to <https://builds.apache.org/hudson/job/CXF-2.3.x-windows/ws/.repository\org\apache\cxf\cxf-api\2.3.5-SNAPSHOT\cxf-api-2.3.5-SNAPSHOT-javadoc.jar>
[JENKINS] Archiving C:\hudson\hudson-slave\workspace\CXF-2.3.x-windows\2.3.x-fixes\api\target\cxf-api-2.3.5-SNAPSHOT.jar
to /home/hudson/hudson/jobs/CXF-2.3.x-windows/modules/org.apache.cxf$cxf-api/builds/2011-05-26_19-14-02/archive/org.apache.cxf/cxf-api/2.3.5-SNAPSHOT/cxf-api-2.3.5-SNAPSHOT.jar
[JENKINS] Archiving C:\hudson\hudson-slave\workspace\CXF-2.3.x-windows\2.3.x-fixes\api\target\cxf-api-2.3.5-SNAPSHOT-javadoc.jar
to /home/hudson/hudson/jobs/CXF-2.3.x-windows/modules/org.apache.cxf$cxf-api/builds/2011-05-26_19-14-02/archive/org.apache.cxf/cxf-api/2.3.5-SNAPSHOT/cxf-api-2.3.5-SNAPSHOT-javadoc.jar
[INFO] ------------------------------------------------------------------------
[INFO] Building Apache CXF Woodstox/MSV Schema Validation
[INFO]    task-segment: [clean, install]
[INFO] ------------------------------------------------------------------------
[INFO] [clean:clean {execution: default-clean}]
[INFO] Deleting C:\hudson\hudson-slave\workspace\CXF-2.3.x-windows\2.3.x-fixes\common\wstx-msv-validation\target
[INFO] [checkstyle:checkstyle {execution: validate}]
[INFO] Starting audit...
Audit done.

[INFO] Preparing pmd:check
[JENKINS] Archiving C:\hudson\hudson-slave\workspace\CXF-2.3.x-windows\2.3.x-fixes\common\wstx-msv-validation\pom.xml
to /home/hudson/hudson/jobs/CXF-2.3.x-windows/modules/org.apache.cxf$cxf-wstx-msv-validation/builds/2011-05-26_19-14-02/archive/org.apache.cxf/cxf-wstx-msv-validation/2.3.5-SNAPSHOT/cxf-wstx-msv-validation-2.3.5-SNAPSHOT.pom
[INFO] [pmd:pmd {execution: pmd}]
[INFO] [pmd:check {execution: validate}]
[INFO] 
[INFO] [cxf-xml2fastinfoset:xml2fastinfoset {execution: xml2fastinfoset}]
[INFO] [remote-resources:process {execution: default}]
[INFO] [resources:resources {execution: default-resources}]
[INFO] Using 'UTF-8' encoding to copy filtered resources.
[INFO] Copying 0 resource
[INFO] Copying 4 resources
[INFO] skip non existing resourceDirectory C:\hudson\hudson-slave\workspace\CXF-2.3.x-windows\2.3.x-fixes\common\wstx-msv-validation\src\main\resources-filtered
[INFO] Copying 1 resource
[INFO] Copying 3 resources
[INFO] [compiler:compile {execution: default-compile}]
[INFO] Compiling 5 source files to C:\hudson\hudson-slave\workspace\CXF-2.3.x-windows\2.3.x-fixes\common\wstx-msv-validation\target\classes
[INFO] [resources:testResources {execution: default-testResources}]
[INFO] Using 'UTF-8' encoding to copy filtered resources.
[INFO] Copying 0 resource
[INFO] skip non existing resourceDirectory C:\hudson\hudson-slave\workspace\CXF-2.3.x-windows\2.3.x-fixes\common\wstx-msv-validation\src\test\resources
[INFO] skip non existing resourceDirectory C:\hudson\hudson-slave\workspace\CXF-2.3.x-windows\2.3.x-fixes\common\wstx-msv-validation\target\generated\src\test\resources
[INFO] Copying 3 resources
[INFO] [compiler:testCompile {execution: default-testCompile}]
[INFO] Nothing to compile - all classes are up to date
[INFO] [surefire:test {execution: default-test}]
[INFO] Surefire report directory: C:\hudson\hudson-slave\workspace\CXF-2.3.x-windows\2.3.x-fixes\common\wstx-msv-validation\target\surefire-reports

-------------------------------------------------------
 T E S T S
-------------------------------------------------------
There are no tests to run.

Results :

Tests run: 0, Failures: 0, Errors: 0, Skipped: 0

[JENKINS] Recording test results
[INFO] [jar:jar {execution: default-jar}]
[INFO] Building jar: C:\hudson\hudson-slave\workspace\CXF-2.3.x-windows\2.3.x-fixes\common\wstx-msv-validation\target\cxf-wstx-msv-validation-2.3.5-SNAPSHOT.jar
[INFO] [install:install {execution: default-install}]
[INFO] Installing C:\hudson\hudson-slave\workspace\CXF-2.3.x-windows\2.3.x-fixes\common\wstx-msv-validation\target\cxf-wstx-msv-validation-2.3.5-SNAPSHOT.jar
to <https://builds.apache.org/hudson/job/CXF-2.3.x-windows/ws/.repository\org\apache\cxf\cxf-wstx-msv-validation\2.3.5-SNAPSHOT\cxf-wstx-msv-validation-2.3.5-SNAPSHOT.jar>
[JENKINS] Archiving C:\hudson\hudson-slave\workspace\CXF-2.3.x-windows\2.3.x-fixes\common\wstx-msv-validation\target\cxf-wstx-msv-validation-2.3.5-SNAPSHOT.jar
to /home/hudson/hudson/jobs/CXF-2.3.x-windows/modules/org.apache.cxf$cxf-wstx-msv-validation/builds/2011-05-26_19-14-02/archive/org.apache.cxf/cxf-wstx-msv-validation/2.3.5-SNAPSHOT/cxf-wstx-msv-validation-2.3.5-SNAPSHOT.jar
[INFO] ------------------------------------------------------------------------
[INFO] Building Apache CXF XML Schema Validation with Xerces
[INFO]    task-segment: [clean, install]
[INFO] ------------------------------------------------------------------------
[INFO] [clean:clean {execution: default-clean}]
[INFO] Deleting C:\hudson\hudson-slave\workspace\CXF-2.3.x-windows\2.3.x-fixes\common\xerces-xsd-validation\target
[INFO] [checkstyle:checkstyle {execution: validate}]
[INFO] Starting audit...
Audit done.

[INFO] Preparing pmd:check
[JENKINS] Archiving C:\hudson\hudson-slave\workspace\CXF-2.3.x-windows\2.3.x-fixes\common\xerces-xsd-validation\pom.xml
to /home/hudson/hudson/jobs/CXF-2.3.x-windows/modules/org.apache.cxf$cxf-xerces-xsd-validation/builds/2011-05-26_19-14-02/archive/org.apache.cxf/cxf-xerces-xsd-validation/2.3.5-SNAPSHOT/cxf-xerces-xsd-validation-2.3.5-SNAPSHOT.pom
[INFO] [pmd:pmd {execution: pmd}]
[INFO] [pmd:check {execution: validate}]
[INFO] 
[INFO] [cxf-xml2fastinfoset:xml2fastinfoset {execution: xml2fastinfoset}]
[INFO] [remote-resources:process {execution: default}]
[INFO] [resources:resources {execution: default-resources}]
[INFO] Using 'UTF-8' encoding to copy filtered resources.
[INFO] Copying 0 resource
[INFO] Copying 3 resources
[INFO] skip non existing resourceDirectory C:\hudson\hudson-slave\workspace\CXF-2.3.x-windows\2.3.x-fixes\common\xerces-xsd-validation\src\main\resources-filtered
[INFO] Copying 1 resource
[INFO] Copying 3 resources
[INFO] [compiler:compile {execution: default-compile}]
[INFO] Compiling 3 source files to C:\hudson\hudson-slave\workspace\CXF-2.3.x-windows\2.3.x-fixes\common\xerces-xsd-validation\target\classes
[INFO] [resources:testResources {execution: default-testResources}]
[INFO] Using 'UTF-8' encoding to copy filtered resources.
[INFO] skip non existing resourceDirectory C:\hudson\hudson-slave\workspace\CXF-2.3.x-windows\2.3.x-fixes\common\xerces-xsd-validation\src\test\java
[INFO] skip non existing resourceDirectory C:\hudson\hudson-slave\workspace\CXF-2.3.x-windows\2.3.x-fixes\common\xerces-xsd-validation\src\test\resources
[INFO] skip non existing resourceDirectory C:\hudson\hudson-slave\workspace\CXF-2.3.x-windows\2.3.x-fixes\common\xerces-xsd-validation\target\generated\src\test\resources
[INFO] Copying 3 resources
[INFO] [compiler:testCompile {execution: default-testCompile}]
[INFO] No sources to compile
[INFO] [surefire:test {execution: default-test}]
[INFO] Surefire report directory: C:\hudson\hudson-slave\workspace\CXF-2.3.x-windows\2.3.x-fixes\common\xerces-xsd-validation\target\surefire-reports

-------------------------------------------------------
 T E S T S
-------------------------------------------------------
There are no tests to run.

Results :

Tests run: 0, Failures: 0, Errors: 0, Skipped: 0

[JENKINS] Recording test results
[INFO] [jar:jar {execution: default-jar}]
[INFO] Building jar: C:\hudson\hudson-slave\workspace\CXF-2.3.x-windows\2.3.x-fixes\common\xerces-xsd-validation\target\cxf-xerces-xsd-validation-2.3.5-SNAPSHOT.jar
[INFO] [install:install {execution: default-install}]
[INFO] Installing C:\hudson\hudson-slave\workspace\CXF-2.3.x-windows\2.3.x-fixes\common\xerces-xsd-validation\target\cxf-xerces-xsd-validation-2.3.5-SNAPSHOT.jar
to <https://builds.apache.org/hudson/job/CXF-2.3.x-windows/ws/.repository\org\apache\cxf\cxf-xerces-xsd-validation\2.3.5-SNAPSHOT\cxf-xerces-xsd-validation-2.3.5-SNAPSHOT.jar>
[JENKINS] Archiving C:\hudson\hudson-slave\workspace\CXF-2.3.x-windows\2.3.x-fixes\common\xerces-xsd-validation\target\cxf-xerces-xsd-validation-2.3.5-SNAPSHOT.jar
to /home/hudson/hudson/jobs/CXF-2.3.x-windows/modules/org.apache.cxf$cxf-xerces-xsd-validation/builds/2011-05-26_19-14-02/archive/org.apache.cxf/cxf-xerces-xsd-validation/2.3.5-SNAPSHOT/cxf-xerces-xsd-validation-2.3.5-SNAPSHOT.jar
[INFO] ------------------------------------------------------------------------
[INFO] Building Apache CXF Common
[INFO]    task-segment: [clean, install]
[INFO] ------------------------------------------------------------------------
[INFO] [clean:clean {execution: default-clean}]
[INFO] [site:attach-descriptor {execution: default-attach-descriptor}]
[INFO] [install:install {execution: default-install}]
[INFO] Installing C:\hudson\hudson-slave\workspace\CXF-2.3.x-windows\2.3.x-fixes\common\pom.xml
to <https://builds.apache.org/hudson/job/CXF-2.3.x-windows/ws/.repository\org\apache\cxf\cxf-common\2.3.5-SNAPSHOT\cxf-common-2.3.5-SNAPSHOT.pom>
[JENKINS] Archiving C:\hudson\hudson-slave\workspace\CXF-2.3.x-windows\2.3.x-fixes\common\pom.xml
to /home/hudson/hudson/jobs/CXF-2.3.x-windows/modules/org.apache.cxf$cxf-common/builds/2011-05-26_19-14-02/archive/org.apache.cxf/cxf-common/2.3.5-SNAPSHOT/cxf-common-2.3.5-SNAPSHOT.pom
[INFO] ------------------------------------------------------------------------
[INFO] Building Apache CXF Runtime Core
[INFO]    task-segment: [clean, install]
[INFO] ------------------------------------------------------------------------
[INFO] [clean:clean {execution: default-clean}]
[INFO] Deleting C:\hudson\hudson-slave\workspace\CXF-2.3.x-windows\2.3.x-fixes\rt\core\target
[INFO] [checkstyle:checkstyle {execution: validate}]
[INFO] Starting audit...
Audit done.

[INFO] Preparing pmd:check
[JENKINS] Archiving C:\hudson\hudson-slave\workspace\CXF-2.3.x-windows\2.3.x-fixes\rt\core\pom.xml
to /home/hudson/hudson/jobs/CXF-2.3.x-windows/modules/org.apache.cxf$cxf-rt-core/builds/2011-05-26_19-14-02/archive/org.apache.cxf/cxf-rt-core/2.3.5-SNAPSHOT/cxf-rt-core-2.3.5-SNAPSHOT.pom
[INFO] [pmd:pmd {execution: pmd}]
[INFO] [pmd:check {execution: validate}]
[INFO] 
[INFO] [cxf-xml2fastinfoset:xml2fastinfoset {execution: xml2fastinfoset}]
[INFO] [remote-resources:process {execution: default}]
[INFO] [resources:resources {execution: default-resources}]
[INFO] Using 'UTF-8' encoding to copy filtered resources.
[INFO] Copying 15 resources
[INFO] Copying 8 resources
[INFO] skip non existing resourceDirectory C:\hudson\hudson-slave\workspace\CXF-2.3.x-windows\2.3.x-fixes\rt\core\src\main\resources-filtered
[INFO] Copying 1 resource
[INFO] Copying 3 resources
[INFO] [compiler:compile {execution: default-compile}]
[INFO] Compiling 189 source files to C:\hudson\hudson-slave\workspace\CXF-2.3.x-windows\2.3.x-fixes\rt\core\target\classes
[INFO] -------------------------------------------------------------
[ERROR] COMPILATION ERROR : 
[INFO] -------------------------------------------------------------
[ERROR] \hudson\hudson-slave\workspace\CXF-2.3.x-windows\2.3.x-fixes\rt\core\src\main\java\org\apache\cxf\wsdl11\WSDLServiceBuilder.java:[56,53]
package com.sun.org.apache.xml.internal.security.utils does not exist
[ERROR] \hudson\hudson-slave\workspace\CXF-2.3.x-windows\2.3.x-fixes\rt\core\src\main\java\org\apache\cxf\wsdl11\WSDLServiceBuilder.java:[149,25]
cannot find symbol
symbol  : variable XMLUtils
location: class org.apache.cxf.wsdl11.WSDLServiceBuilder
[INFO] 2 errors 
[INFO] -------------------------------------------------------------
[INFO] ------------------------------------------------------------------------
[ERROR] BUILD FAILURE
[INFO] ------------------------------------------------------------------------
[INFO] Compilation failure

\hudson\hudson-slave\workspace\CXF-2.3.x-windows\2.3.x-fixes\rt\core\src\main\java\org\apache\cxf\wsdl11\WSDLServiceBuilder.java:[56,53]
package com.sun.org.apache.xml.internal.security.utils does not exist
\hudson\hudson-slave\workspace\CXF-2.3.x-windows\2.3.x-fixes\rt\core\src\main\java\org\apache\cxf\wsdl11\WSDLServiceBuilder.java:[149,25]
cannot find symbol
symbol  : variable XMLUtils
location: class org.apache.cxf.wsdl11.WSDLServiceBuilder

[INFO] ------------------------------------------------------------------------
[INFO] Trace
org.apache.maven.BuildFailureException: Compilation failure
	at org.apache.maven.lifecycle.DefaultLifecycleExecutor.executeGoals(DefaultLifecycleExecutor.java:715)
	at org.apache.maven.lifecycle.DefaultLifecycleExecutor.executeGoalWithLifecycle(DefaultLifecycleExecutor.java:556)
	at org.apache.maven.lifecycle.DefaultLifecycleExecutor.executeGoal(DefaultLifecycleExecutor.java:535)
	at org.apache.maven.lifecycle.DefaultLifecycleExecutor.executeGoalAndHandleFailures(DefaultLifecycleExecutor.java:387)
	at org.apache.maven.lifecycle.DefaultLifecycleExecutor.executeTaskSegments(DefaultLifecycleExecutor.java:348)
	at org.apache.maven.lifecycle.DefaultLifecycleExecutor.execute(DefaultLifecycleExecutor.java:180)
	at org.apache.maven.lifecycle.LifecycleExecutorInterceptor.execute(LifecycleExecutorInterceptor.java:65)
	at org.apache.maven.DefaultMaven.doExecute(DefaultMaven.java:328)
	at org.apache.maven.DefaultMaven.execute(DefaultMaven.java:138)
	at org.apache.maven.cli.MavenCli.main(MavenCli.java:362)
	at sun.reflect.NativeMethodAccessorImpl.invoke0(Native Method)
	at sun.reflect.NativeMethodAccessorImpl.invoke(NativeMethodAccessorImpl.java:39)
	at sun.reflect.DelegatingMethodAccessorImpl.invoke(DelegatingMethodAccessorImpl.java:25)
	at java.lang.reflect.Method.invoke(Method.java:597)
	at org.codehaus.classworlds.Launcher.launchEnhanced(Launcher.java:315)
	at org.codehaus.classworlds.Launcher.launch(Launcher.java:255)
	at hudson.maven.agent.Main.launch(Main.java:185)
	at hudson.maven.MavenBuilder.call(MavenBuilder.java:164)
	at hudson.maven.MavenModuleSetBuild$Builder.call(MavenModuleSetBuild.java:987)
	at hudson.maven.MavenModuleSetBuild$Builder.call(MavenModuleSetBuild.java:918)
	at hudson.remoting.UserRequest.perform(UserRequest.java:118)
	at hudson.remoting.UserRequest.perform(UserRequest.java:48)
	at hudson.remoting.Request$2.run(Request.java:270)
	at java.util.concurrent.Executors$RunnableAdapter.call(Executors.java:441)
	at java.util.concurrent.FutureTask$Sync.innerRun(FutureTask.java:303)
	at java.util.concurrent.FutureTask.run(FutureTask.java:138)
	at java.util.concurrent.ThreadPoolExecutor$Worker.runTask(ThreadPoolExecutor.java:886)
	at java.util.concurrent.ThreadPoolExecutor$Worker.run(ThreadPoolExecutor.java:908)
	at java.lang.Thread.run(Thread.java:619)
Caused by: org.apache.maven.plugin.CompilationFailureException: Compilation failure
	at org.apache.maven.plugin.AbstractCompilerMojo.execute(AbstractCompilerMojo.java:656)
	at org.apache.maven.plugin.CompilerMojo.execute(CompilerMojo.java:128)
	at org.apache.maven.plugin.DefaultPluginManager.executeMojo(DefaultPluginManager.java:490)
	at hudson.maven.agent.PluginManagerInterceptor.executeMojo(PluginManagerInterceptor.java:182)
	at org.apache.maven.lifecycle.DefaultLifecycleExecutor.executeGoals(DefaultLifecycleExecutor.java:694)
	... 28 more
[INFO] ------------------------------------------------------------------------
[INFO] Total time: 1 minute 48 seconds
[INFO] Finished at: Thu May 26 20:15:49 BST 2011
[INFO] Final Memory: 157M/349M
[INFO] ------------------------------------------------------------------------
Sending e-mails to: notifications@cxf.apache.org dkulp_apache@dankulp.com
channel stopped


Mime
View raw message