cxf-notifications mailing list archives

Site index · List index
Message view « Date » · « Thread »
Top « Date » · « Thread »
From Apache Hudson Server <hud...@hudson.apache.org>
Subject Build failed in Jenkins: CXF-trunk-windows #84
Date Mon, 04 Apr 2011 22:17:19 GMT
See <https://hudson.apache.org/hudson/job/CXF-trunk-windows/84/changes>

Changes:

[dkulp] Fix checkstyle issue

[dkulp] [CXF-3437] Add blueprint support for object binding
Patch from Johan Edstrom applied.

[dkulp] [CXF-3437] Add blueprint support for object binding
Patch from Johan Edstrom applied.

[dkulp] Squashed commit of the following:

commit 4699706a51f6e75641be257089636aa0dbe7980d
Author: Daniel Kulp <dkulp@apache.org>
Date:   Mon Apr 4 14:16:07 2011 -0400

    Use a wsdl for the sample sts so ?wsdl provides a useful contract.
    Also will provice a place to put the WS-SecPol requirements

commit 3a44f27efb80bb0211115df7284b84860a1e3de2
Author: Zsolt Beothy-Elo <zbeothy-elo@talend.com>
Date:   Sat Apr 2 11:13:17 2011 +0200

    Include sts sample in build.

commit e522cd0f5a5d8c99aa8b903d24a38e7b13ad65ea
Author: Zsolt Beothy-Elo <zbeothy-elo@talend.com>
Date:   Sat Apr 2 09:34:07 2011 +0200

    Move sts sample sources to demo.sts...

commit b33ad2b58458a4154fdffad808b32aa089081896
Author: Zsolt Beothy-Elo <zbeothy-elo@talend.com>
Date:   Sat Apr 2 08:27:04 2011 +0200

    Add spring configuration and enhance pom for sts sample

commit 1ffc68a7cc3bd4d092e55cd7e4a8896c618510e5
Author: Zsolt Beothy-Elo <zbeothy-elo@talend.com>
Date:   Fri Apr 1 19:27:18 2011 +0200

    Move remaining sample specific classes from the cxf security module to the sts_issue_operation
sample module

commit 4a5df71944b8e2fc76a8bf45cb2cf19efe6dc8af
Author: Vladimir Romaniuk <vromaniuk@talend.com>
Date:   Fri Apr 1 12:53:56 2011 +0300

    added keystore and test modified according changes in keystore

commit f3265f4df54e1acd6ce5bd9f894015b8ee35b376
Author: Vladimir Romaniuk <vromaniuk@talend.com>
Date:   Fri Apr 1 12:22:55 2011 +0300

    Sample issue operation implementation

commit 5526ec67bfbd7946d6b8d0732c60c5864f36d1f8
Author: Daniel Kulp <dkulp@apache.org>
Date:   Fri Mar 25 14:29:30 2011 -0400

    First pass at STS from Anubhav Sharma

[coheigea] [CXF-3432] - Support WS-SecurityPolicy SamlToken expressions (Part IV)
 - Add support for creating self-signed assertions via configuration.

[dkulp] Add a deprecation flag to a method restored for 2.3.x compatibility

[coheigea] Fixed remaining two (non-TLS) failing WS-Trust interop demos.

[coheigea] [CXF-3432] - Added support for sending signed SAML Assertions via WS-SecurityPolicy
 - Added a symmetric and asymmetric binding tests to the systests.

------------------------------------------
[...truncated 3685 lines...]
Running org.apache.cxf.ws.rm.persistence.PersistenceUtilsTest
Tests run: 1, Failures: 0, Errors: 0, Skipped: 0, Time elapsed: 0.106 sec
Running org.apache.cxf.ws.rm.persistence.RMLargeMessageTest
Tests run: 3, Failures: 0, Errors: 0, Skipped: 0, Time elapsed: 0.005 sec
Running org.apache.cxf.ws.rm.persistence.RMMessageTest
Tests run: 3, Failures: 0, Errors: 0, Skipped: 0, Time elapsed: 0.002 sec
Running org.apache.cxf.ws.rm.persistence.jdbc.RMTxStoreConfigurationTest
Tests run: 1, Failures: 0, Errors: 0, Skipped: 0, Time elapsed: 0.101 sec
Running org.apache.cxf.ws.rm.persistence.jdbc.RMTxStoreTest
Tests run: 11, Failures: 0, Errors: 0, Skipped: 0, Time elapsed: 1.634 sec
Running org.apache.cxf.ws.rm.policy.PolicyUtilsTest
Tests run: 3, Failures: 0, Errors: 0, Skipped: 0, Time elapsed: 0.005 sec
Running org.apache.cxf.ws.rm.soap.RMSoapInterceptorTest
Tests run: 8, Failures: 0, Errors: 0, Skipped: 0, Time elapsed: 0.142 sec
Running org.apache.cxf.ws.rm.soap.RetransmissionQueueImplTest
Tests run: 11, Failures: 0, Errors: 0, Skipped: 0, Time elapsed: 0.076 sec
Running org.apache.cxf.ws.rm.soap.SoapFaultFactoryTest
Tests run: 6, Failures: 0, Errors: 0, Skipped: 0, Time elapsed: 0.194 sec

Results :

Tests run: 175, Failures: 0, Errors: 0, Skipped: 0

[JENKINS] Recording test results
Downloading: http://repository.apache.org/snapshots//org/apache/neethi/neethi/3.0.0-SNAPSHOT/neethi-3.0.0-SNAPSHOT.jar
[INFO] [jar:jar {execution: default-jar}]
[INFO] Building jar: C:\hudson\hudson-slave\workspace\CXF-trunk-windows\trunk w spaces\rt\ws\rm\target\cxf-rt-ws-rm-2.4.0-SNAPSHOT.jar
[INFO] [install:install {execution: default-install}]
[INFO] Installing C:\hudson\hudson-slave\workspace\CXF-trunk-windows\trunk w spaces\rt\ws\rm\target\cxf-rt-ws-rm-2.4.0-SNAPSHOT.jar
to <https://hudson.apache.org/hudson/job/CXF-trunk-windows/ws/.repository\org\apache\cxf\cxf-rt-ws-rm\2.4.0-SNAPSHOT\cxf-rt-ws-rm-2.4.0-SNAPSHOT.jar>
[JENKINS] Archiving disabled - not archiving C:\hudson\hudson-slave\workspace\CXF-trunk-windows\trunk
w spaces\rt\ws\rm\pom.xml
[JENKINS] Archiving disabled - not archiving C:\hudson\hudson-slave\workspace\CXF-trunk-windows\trunk
w spaces\rt\ws\rm\target\cxf-rt-ws-rm-2.4.0-SNAPSHOT.jar
[INFO] ------------------------------------------------------------------------
[INFO] Building Apache CXF Runtime WS Security
[INFO]    task-segment: [clean, install]
[INFO] ------------------------------------------------------------------------
[INFO] [clean:clean {execution: default-clean}]
[INFO] Deleting C:\hudson\hudson-slave\workspace\CXF-trunk-windows\trunk w spaces\rt\ws\security\target
[INFO] [dependency:copy {execution: create-endorsed-dir}]
[INFO] Configured Artifact: xerces:xercesImpl:?:jar
[INFO] Configured Artifact: xml-apis:xml-apis:1.3.04:jar
[INFO] Copying xercesImpl-2.9.1.jar to C:\hudson\hudson-slave\workspace\CXF-trunk-windows\trunk
w spaces\rt\ws\security\target\endorsed\xercesImpl-2.9.1.jar
[INFO] Copying xml-apis-1.3.04.jar to C:\hudson\hudson-slave\workspace\CXF-trunk-windows\trunk
w spaces\rt\ws\security\target\endorsed\xml-apis-1.3.04.jar
[INFO] [cxf-xml2fastinfoset:xml2fastinfoset {execution: xml2fastinfoset}]
[INFO] [cxf-xjc:xsdtojava {execution: generate-sources}]
[INFO] [remote-resources:process {execution: default}]
[INFO] snapshot org.apache.ws.security:wss4j:1.6-SNAPSHOT: checking for updates from apache.snapshots
Downloading: http://repository.apache.org/snapshots/org/apache/ws/security/wss4j/1.6-SNAPSHOT/wss4j-1.6-20110404.182927-68.pom
21K downloaded  (wss4j-1.6-20110404.182927-68.pom)
Downloading: http://repository.apache.org/snapshots/org/apache/neethi/neethi/3.0.0-SNAPSHOT/neethi-3.0.0-SNAPSHOT.jar
Downloading: http://repository.apache.org/snapshots/org/apache/ws/security/wss4j/1.6-SNAPSHOT/wss4j-1.6-20110404.182927-68.jar
346K downloaded  (wss4j-1.6-20110404.182927-68.jar)
[INFO] [resources:resources {execution: default-resources}]
[INFO] Using 'UTF-8' encoding to copy filtered resources.
[INFO] Copying 4 resources
[INFO] Copying 2 resources
[INFO] skip non existing resourceDirectory C:\hudson\hudson-slave\workspace\CXF-trunk-windows\trunk
w spaces\rt\ws\security\src\main\resources-filtered
[INFO] Copying 1 resource
[INFO] Copying 3 resources
Downloading: http://repository.apache.org/snapshots/org/apache/neethi/neethi/3.0.0-SNAPSHOT/neethi-3.0.0-SNAPSHOT.jar
[INFO] [compiler:compile {execution: default-compile}]
[INFO] Compiling 189 source files to C:\hudson\hudson-slave\workspace\CXF-trunk-windows\trunk
w spaces\rt\ws\security\target\classes
[INFO] -------------------------------------------------------------
[ERROR] COMPILATION ERROR : 
[INFO] -------------------------------------------------------------
[ERROR] \hudson\hudson-slave\workspace\CXF-trunk-windows\trunk w spaces\rt\ws\security\src\main\java\org\apache\cxf\ws\security\sts\provider\SecurityTokenService.java:[22,17]
package javax.jws does not exist
[ERROR] \hudson\hudson-slave\workspace\CXF-trunk-windows\trunk w spaces\rt\ws\security\src\main\java\org\apache\cxf\ws\security\sts\provider\SecurityTokenService.java:[23,17]
package javax.jws does not exist
[ERROR] \hudson\hudson-slave\workspace\CXF-trunk-windows\trunk w spaces\rt\ws\security\src\main\java\org\apache\cxf\ws\security\sts\provider\SecurityTokenService.java:[24,17]
package javax.jws does not exist
[ERROR] \hudson\hudson-slave\workspace\CXF-trunk-windows\trunk w spaces\rt\ws\security\src\main\java\org\apache\cxf\ws\security\sts\provider\SecurityTokenService.java:[25,17]
package javax.jws does not exist
[ERROR] \hudson\hudson-slave\workspace\CXF-trunk-windows\trunk w spaces\rt\ws\security\src\main\java\org\apache\cxf\ws\security\sts\provider\SecurityTokenService.java:[26,22]
package javax.jws.soap does not exist
[ERROR] \hudson\hudson-slave\workspace\CXF-trunk-windows\trunk w spaces\rt\ws\security\src\main\java\org\apache\cxf\ws\security\sts\provider\SecurityTokenService.java:[35,1]
cannot find symbol
symbol: class WebService
@WebService(targetNamespace = "http://docs.oasis-open.org/ws-sx/ws-trust/200512/wsdl",
[ERROR] \hudson\hudson-slave\workspace\CXF-trunk-windows\trunk w spaces\rt\ws\security\src\main\java\org\apache\cxf\ws\security\sts\provider\SecurityTokenService.java:[42,1]
cannot find symbol
symbol: class SOAPBinding
@SOAPBinding(parameterStyle = SOAPBinding.ParameterStyle.BARE)
[ERROR] \hudson\hudson-slave\workspace\CXF-trunk-windows\trunk w spaces\rt\ws\security\src\main\java\org\apache\cxf\ws\security\sts\provider\SecurityTokenService.java:[52,9]
cannot find symbol
symbol  : class WebParam
location: interface org.apache.cxf.ws.security.sts.provider.SecurityTokenService
[ERROR] \hudson\hudson-slave\workspace\CXF-trunk-windows\trunk w spaces\rt\ws\security\src\main\java\org\apache\cxf\ws\security\sts\provider\SecurityTokenService.java:[45,5]
cannot find symbol
symbol  : class WebResult
location: interface org.apache.cxf.ws.security.sts.provider.SecurityTokenService
[ERROR] \hudson\hudson-slave\workspace\CXF-trunk-windows\trunk w spaces\rt\ws\security\src\main\java\org\apache\cxf\ws\security\sts\provider\SecurityTokenService.java:[50,5]
cannot find symbol
symbol  : class WebMethod
location: interface org.apache.cxf.ws.security.sts.provider.SecurityTokenService
[ERROR] \hudson\hudson-slave\workspace\CXF-trunk-windows\trunk w spaces\rt\ws\security\src\main\java\org\apache\cxf\ws\security\sts\provider\SecurityTokenService.java:[65,9]
cannot find symbol
symbol  : class WebParam
location: interface org.apache.cxf.ws.security.sts.provider.SecurityTokenService
[ERROR] \hudson\hudson-slave\workspace\CXF-trunk-windows\trunk w spaces\rt\ws\security\src\main\java\org\apache\cxf\ws\security\sts\provider\SecurityTokenService.java:[58,5]
cannot find symbol
symbol  : class WebResult
location: interface org.apache.cxf.ws.security.sts.provider.SecurityTokenService
[ERROR] \hudson\hudson-slave\workspace\CXF-trunk-windows\trunk w spaces\rt\ws\security\src\main\java\org\apache\cxf\ws\security\sts\provider\SecurityTokenService.java:[63,5]
cannot find symbol
symbol  : class WebMethod
location: interface org.apache.cxf.ws.security.sts.provider.SecurityTokenService
[ERROR] \hudson\hudson-slave\workspace\CXF-trunk-windows\trunk w spaces\rt\ws\security\src\main\java\org\apache\cxf\ws\security\sts\provider\SecurityTokenService.java:[79,9]
cannot find symbol
symbol  : class WebParam
location: interface org.apache.cxf.ws.security.sts.provider.SecurityTokenService
[ERROR] \hudson\hudson-slave\workspace\CXF-trunk-windows\trunk w spaces\rt\ws\security\src\main\java\org\apache\cxf\ws\security\sts\provider\SecurityTokenService.java:[71,5]
cannot find symbol
symbol  : class WebResult
location: interface org.apache.cxf.ws.security.sts.provider.SecurityTokenService
[ERROR] \hudson\hudson-slave\workspace\CXF-trunk-windows\trunk w spaces\rt\ws\security\src\main\java\org\apache\cxf\ws\security\sts\provider\SecurityTokenService.java:[77,5]
cannot find symbol
symbol  : class WebMethod
location: interface org.apache.cxf.ws.security.sts.provider.SecurityTokenService
[ERROR] \hudson\hudson-slave\workspace\CXF-trunk-windows\trunk w spaces\rt\ws\security\src\main\java\org\apache\cxf\ws\security\sts\provider\SecurityTokenService.java:[91,9]
cannot find symbol
symbol  : class WebParam
location: interface org.apache.cxf.ws.security.sts.provider.SecurityTokenService
[ERROR] \hudson\hudson-slave\workspace\CXF-trunk-windows\trunk w spaces\rt\ws\security\src\main\java\org\apache\cxf\ws\security\sts\provider\SecurityTokenService.java:[84,5]
cannot find symbol
symbol  : class WebResult
location: interface org.apache.cxf.ws.security.sts.provider.SecurityTokenService
[ERROR] \hudson\hudson-slave\workspace\CXF-trunk-windows\trunk w spaces\rt\ws\security\src\main\java\org\apache\cxf\ws\security\sts\provider\SecurityTokenService.java:[89,5]
cannot find symbol
symbol  : class WebMethod
location: interface org.apache.cxf.ws.security.sts.provider.SecurityTokenService
[ERROR] \hudson\hudson-slave\workspace\CXF-trunk-windows\trunk w spaces\rt\ws\security\src\main\java\org\apache\cxf\ws\security\sts\provider\SecurityTokenService.java:[101,9]
cannot find symbol
symbol  : class WebParam
location: interface org.apache.cxf.ws.security.sts.provider.SecurityTokenService
[ERROR] \hudson\hudson-slave\workspace\CXF-trunk-windows\trunk w spaces\rt\ws\security\src\main\java\org\apache\cxf\ws\security\sts\provider\SecurityTokenService.java:[96,5]
cannot find symbol
symbol  : class WebResult
location: interface org.apache.cxf.ws.security.sts.provider.SecurityTokenService
[ERROR] \hudson\hudson-slave\workspace\CXF-trunk-windows\trunk w spaces\rt\ws\security\src\main\java\org\apache\cxf\ws\security\sts\provider\SecurityTokenService.java:[99,5]
cannot find symbol
symbol  : class WebMethod
location: interface org.apache.cxf.ws.security.sts.provider.SecurityTokenService
[ERROR] \hudson\hudson-slave\workspace\CXF-trunk-windows\trunk w spaces\rt\ws\security\src\main\java\org\apache\cxf\ws\security\sts\provider\SecurityTokenService.java:[114,9]
cannot find symbol
symbol  : class WebParam
location: interface org.apache.cxf.ws.security.sts.provider.SecurityTokenService
[ERROR] \hudson\hudson-slave\workspace\CXF-trunk-windows\trunk w spaces\rt\ws\security\src\main\java\org\apache\cxf\ws\security\sts\provider\SecurityTokenService.java:[107,5]
cannot find symbol
symbol  : class WebResult
location: interface org.apache.cxf.ws.security.sts.provider.SecurityTokenService
[ERROR] \hudson\hudson-slave\workspace\CXF-trunk-windows\trunk w spaces\rt\ws\security\src\main\java\org\apache\cxf\ws\security\sts\provider\SecurityTokenService.java:[112,5]
cannot find symbol
symbol  : class WebMethod
location: interface org.apache.cxf.ws.security.sts.provider.SecurityTokenService
[INFO] 25 errors 
[INFO] -------------------------------------------------------------
[JENKINS] Archiving disabled - not archiving C:\hudson\hudson-slave\workspace\CXF-trunk-windows\trunk
w spaces\rt\ws\security\pom.xml
[INFO] ------------------------------------------------------------------------
[ERROR] BUILD FAILURE
[INFO] ------------------------------------------------------------------------
[INFO] Compilation failure

\hudson\hudson-slave\workspace\CXF-trunk-windows\trunk w spaces\rt\ws\security\src\main\java\org\apache\cxf\ws\security\sts\provider\SecurityTokenService.java:[22,17]
package javax.jws does not exist
\hudson\hudson-slave\workspace\CXF-trunk-windows\trunk w spaces\rt\ws\security\src\main\java\org\apache\cxf\ws\security\sts\provider\SecurityTokenService.java:[23,17]
package javax.jws does not exist
\hudson\hudson-slave\workspace\CXF-trunk-windows\trunk w spaces\rt\ws\security\src\main\java\org\apache\cxf\ws\security\sts\provider\SecurityTokenService.java:[24,17]
package javax.jws does not exist
\hudson\hudson-slave\workspace\CXF-trunk-windows\trunk w spaces\rt\ws\security\src\main\java\org\apache\cxf\ws\security\sts\provider\SecurityTokenService.java:[25,17]
package javax.jws does not exist
\hudson\hudson-slave\workspace\CXF-trunk-windows\trunk w spaces\rt\ws\security\src\main\java\org\apache\cxf\ws\security\sts\provider\SecurityTokenService.java:[26,22]
package javax.jws.soap does not exist
\hudson\hudson-slave\workspace\CXF-trunk-windows\trunk w spaces\rt\ws\security\src\main\java\org\apache\cxf\ws\security\sts\provider\SecurityTokenService.java:[35,1]
cannot find symbol
symbol: class WebService
@WebService(targetNamespace = "http://docs.oasis-open.org/ws-sx/ws-trust/200512/wsdl",
\hudson\hudson-slave\workspace\CXF-trunk-windows\trunk w spaces\rt\ws\security\src\main\java\org\apache\cxf\ws\security\sts\provider\SecurityTokenService.java:[42,1]
cannot find symbol
symbol: class SOAPBinding
@SOAPBinding(parameterStyle = SOAPBinding.ParameterStyle.BARE)
\hudson\hudson-slave\workspace\CXF-trunk-windows\trunk w spaces\rt\ws\security\src\main\java\org\apache\cxf\ws\security\sts\provider\SecurityTokenService.java:[52,9]
cannot find symbol
symbol  : class WebParam
location: interface org.apache.cxf.ws.security.sts.provider.SecurityTokenService
\hudson\hudson-slave\workspace\CXF-trunk-windows\trunk w spaces\rt\ws\security\src\main\java\org\apache\cxf\ws\security\sts\provider\SecurityTokenService.java:[45,5]
cannot find symbol
symbol  : class WebResult
location: interface org.apache.cxf.ws.security.sts.provider.SecurityTokenService
\hudson\hudson-slave\workspace\CXF-trunk-windows\trunk w spaces\rt\ws\security\src\main\java\org\apache\cxf\ws\security\sts\provider\SecurityTokenService.java:[50,5]
cannot find symbol
symbol  : class WebMethod
location: interface org.apache.cxf.ws.security.sts.provider.SecurityTokenService
\hudson\hudson-slave\workspace\CXF-trunk-windows\trunk w spaces\rt\ws\security\src\main\java\org\apache\cxf\ws\security\sts\provider\SecurityTokenService.java:[65,9]
cannot find symbol
symbol  : class WebParam
location: interface org.apache.cxf.ws.security.sts.provider.SecurityTokenService
\hudson\hudson-slave\workspace\CXF-trunk-windows\trunk w spaces\rt\ws\security\src\main\java\org\apache\cxf\ws\security\sts\provider\SecurityTokenService.java:[58,5]
cannot find symbol
symbol  : class WebResult
location: interface org.apache.cxf.ws.security.sts.provider.SecurityTokenService
\hudson\hudson-slave\workspace\CXF-trunk-windows\trunk w spaces\rt\ws\security\src\main\java\org\apache\cxf\ws\security\sts\provider\SecurityTokenService.java:[63,5]
cannot find symbol
symbol  : class WebMethod
location: interface org.apache.cxf.ws.security.sts.provider.SecurityTokenService
\hudson\hudson-slave\workspace\CXF-trunk-windows\trunk w spaces\rt\ws\security\src\main\java\org\apache\cxf\ws\security\sts\provider\SecurityTokenService.java:[79,9]
cannot find symbol
symbol  : class WebParam
location: interface org.apache.cxf.ws.security.sts.provider.SecurityTokenService
\hudson\hudson-slave\workspace\CXF-trunk-windows\trunk w spaces\rt\ws\security\src\main\java\org\apache\cxf\ws\security\sts\provider\SecurityTokenService.java:[71,5]
cannot find symbol
symbol  : class WebResult
location: interface org.apache.cxf.ws.security.sts.provider.SecurityTokenService
\hudson\hudson-slave\workspace\CXF-trunk-windows\trunk w spaces\rt\ws\security\src\main\java\org\apache\cxf\ws\security\sts\provider\SecurityTokenService.java:[77,5]
cannot find symbol
symbol  : class WebMethod
location: interface org.apache.cxf.ws.security.sts.provider.SecurityTokenService
\hudson\hudson-slave\workspace\CXF-trunk-windows\trunk w spaces\rt\ws\security\src\main\java\org\apache\cxf\ws\security\sts\provider\SecurityTokenService.java:[91,9]
cannot find symbol
symbol  : class WebParam
location: interface org.apache.cxf.ws.security.sts.provider.SecurityTokenService
\hudson\hudson-slave\workspace\CXF-trunk-windows\trunk w spaces\rt\ws\security\src\main\java\org\apache\cxf\ws\security\sts\provider\SecurityTokenService.java:[84,5]
cannot find symbol
symbol  : class WebResult
location: interface org.apache.cxf.ws.security.sts.provider.SecurityTokenService
\hudson\hudson-slave\workspace\CXF-trunk-windows\trunk w spaces\rt\ws\security\src\main\java\org\apache\cxf\ws\security\sts\provider\SecurityTokenService.java:[89,5]
cannot find symbol
symbol  : class WebMethod
location: interface org.apache.cxf.ws.security.sts.provider.SecurityTokenService
\hudson\hudson-slave\workspace\CXF-trunk-windows\trunk w spaces\rt\ws\security\src\main\java\org\apache\cxf\ws\security\sts\provider\SecurityTokenService.java:[101,9]
cannot find symbol
symbol  : class WebParam
location: interface org.apache.cxf.ws.security.sts.provider.SecurityTokenService
\hudson\hudson-slave\workspace\CXF-trunk-windows\trunk w spaces\rt\ws\security\src\main\java\org\apache\cxf\ws\security\sts\provider\SecurityTokenService.java:[96,5]
cannot find symbol
symbol  : class WebResult
location: interface org.apache.cxf.ws.security.sts.provider.SecurityTokenService
\hudson\hudson-slave\workspace\CXF-trunk-windows\trunk w spaces\rt\ws\security\src\main\java\org\apache\cxf\ws\security\sts\provider\SecurityTokenService.java:[99,5]
cannot find symbol
symbol  : class WebMethod
location: interface org.apache.cxf.ws.security.sts.provider.SecurityTokenService
\hudson\hudson-slave\workspace\CXF-trunk-windows\trunk w spaces\rt\ws\security\src\main\java\org\apache\cxf\ws\security\sts\provider\SecurityTokenService.java:[114,9]
cannot find symbol
symbol  : class WebParam
location: interface org.apache.cxf.ws.security.sts.provider.SecurityTokenService
\hudson\hudson-slave\workspace\CXF-trunk-windows\trunk w spaces\rt\ws\security\src\main\java\org\apache\cxf\ws\security\sts\provider\SecurityTokenService.java:[107,5]
cannot find symbol
symbol  : class WebResult
location: interface org.apache.cxf.ws.security.sts.provider.SecurityTokenService
\hudson\hudson-slave\workspace\CXF-trunk-windows\trunk w spaces\rt\ws\security\src\main\java\org\apache\cxf\ws\security\sts\provider\SecurityTokenService.java:[112,5]
cannot find symbol
symbol  : class WebMethod
location: interface org.apache.cxf.ws.security.sts.provider.SecurityTokenService

[INFO] ------------------------------------------------------------------------
[INFO] Trace
org.apache.maven.BuildFailureException: Compilation failure
	at org.apache.maven.lifecycle.DefaultLifecycleExecutor.executeGoals(DefaultLifecycleExecutor.java:715)
	at org.apache.maven.lifecycle.DefaultLifecycleExecutor.executeGoalWithLifecycle(DefaultLifecycleExecutor.java:556)
	at org.apache.maven.lifecycle.DefaultLifecycleExecutor.executeGoal(DefaultLifecycleExecutor.java:535)
	at org.apache.maven.lifecycle.DefaultLifecycleExecutor.executeGoalAndHandleFailures(DefaultLifecycleExecutor.java:387)
	at org.apache.maven.lifecycle.DefaultLifecycleExecutor.executeTaskSegments(DefaultLifecycleExecutor.java:348)
	at org.apache.maven.lifecycle.DefaultLifecycleExecutor.execute(DefaultLifecycleExecutor.java:180)
	at org.apache.maven.lifecycle.LifecycleExecutorInterceptor.execute(LifecycleExecutorInterceptor.java:65)
	at org.apache.maven.DefaultMaven.doExecute(DefaultMaven.java:328)
	at org.apache.maven.DefaultMaven.execute(DefaultMaven.java:138)
	at org.apache.maven.cli.MavenCli.main(MavenCli.java:362)
	at sun.reflect.NativeMethodAccessorImpl.invoke0(Native Method)
	at sun.reflect.NativeMethodAccessorImpl.invoke(NativeMethodAccessorImpl.java:39)
	at sun.reflect.DelegatingMethodAccessorImpl.invoke(DelegatingMethodAccessorImpl.java:25)
	at java.lang.reflect.Method.invoke(Method.java:592)
	at org.codehaus.classworlds.Launcher.launchEnhanced(Launcher.java:315)
	at org.codehaus.classworlds.Launcher.launch(Launcher.java:255)
	at hudson.maven.agent.Main.launch(Main.java:173)
	at hudson.maven.MavenBuilder.call(MavenBuilder.java:164)
	at hudson.maven.MavenModuleSetBuild$Builder.call(MavenModuleSetBuild.java:924)
	at hudson.maven.MavenModuleSetBuild$Builder.call(MavenModuleSetBuild.java:855)
	at hudson.remoting.UserRequest.perform(UserRequest.java:114)
	at hudson.remoting.UserRequest.perform(UserRequest.java:48)
	at hudson.remoting.Request$2.run(Request.java:270)
	at java.util.concurrent.Executors$RunnableAdapter.call(Executors.java:417)
	at java.util.concurrent.FutureTask$Sync.innerRun(FutureTask.java:269)
	at java.util.concurrent.FutureTask.run(FutureTask.java:123)
	at java.util.concurrent.ThreadPoolExecutor$Worker.runTask(ThreadPoolExecutor.java:651)
	at java.util.concurrent.ThreadPoolExecutor$Worker.run(ThreadPoolExecutor.java:676)
	at java.lang.Thread.run(Thread.java:595)
Caused by: org.apache.maven.plugin.CompilationFailureException: Compilation failure
	at org.apache.maven.plugin.AbstractCompilerMojo.execute(AbstractCompilerMojo.java:656)
	at org.apache.maven.plugin.CompilerMojo.execute(CompilerMojo.java:128)
	at org.apache.maven.plugin.DefaultPluginManager.executeMojo(DefaultPluginManager.java:490)
	at hudson.maven.agent.PluginManagerInterceptor.executeMojo(PluginManagerInterceptor.java:182)
	at org.apache.maven.lifecycle.DefaultLifecycleExecutor.executeGoals(DefaultLifecycleExecutor.java:694)
	... 28 more
[INFO] ------------------------------------------------------------------------
[INFO] Total time: 13 minutes 20 seconds
[INFO] Finished at: Mon Apr 04 23:17:12 BST 2011
[INFO] Final Memory: 131M/276M
[INFO] ------------------------------------------------------------------------
Sending e-mails to: notifications@cxf.apache.org dkulp_apache@dankulp.com coheigea@apache.org
channel stopped


Mime
View raw message