cxf-notifications mailing list archives

Site index · List index
Message view « Date » · « Thread »
Top « Date » · « Thread »
From Apache Hudson Server <hud...@hudson.apache.org>
Subject Build failed in Jenkins: CXF-Trunk-JDK15 #1845
Date Mon, 14 Mar 2011 16:44:27 GMT
See <https://hudson.apache.org/hudson/job/CXF-Trunk-JDK15/1845/changes>

Changes:

[dkulp] [CXF-3396] Make sure the standalone MBeanServer lookups are done
properly to prevent multiple MBeanServers from being created when they
shouldn't be.

Patch from Aki Yoshida applied.

------------------------------------------
[...truncated 1997 lines...]
Tests run: 1, Failures: 0, Errors: 0, Skipped: 0, Time elapsed: 0.062 sec
Running org.apache.cxf.aegis.type.streams.XMLStreamReaderMappingTest
Tests run: 1, Failures: 0, Errors: 0, Skipped: 0, Time elapsed: 0.005 sec
Running org.apache.cxf.aegis.xml.stax.ReaderTest
Tests run: 1, Failures: 0, Errors: 0, Skipped: 0, Time elapsed: 0.005 sec
Running org.apache.cxf.aegis.xml.stax.WriterTest
Tests run: 1, Failures: 0, Errors: 0, Skipped: 0, Time elapsed: 0.032 sec
Running org.apache.cxf.aegis.xmlconfig.NillableTest
Tests run: 1, Failures: 0, Errors: 0, Skipped: 0, Time elapsed: 0.029 sec
Running org.apache.cxf.doclitbare.DocLitBareTest
Tests run: 1, Failures: 0, Errors: 0, Skipped: 0, Time elapsed: 0.037 sec

Results :

Tests run: 168, Failures: 0, Errors: 0, Skipped: 3

[JENKINS] Recording test results
Downloading: http://repository.apache.org/snapshots/org/apache/neethi/neethi/3.0.0-SNAPSHOT/neethi-3.0.0-SNAPSHOT.jar
[INFO] [jar:jar {execution: default-jar}]
[INFO] Building jar: <https://hudson.apache.org/hudson/job/CXF-Trunk-JDK15/ws/trunk/rt/databinding/aegis/target/cxf-rt-databinding-aegis-2.4.0-SNAPSHOT.jar>
[INFO] [install:install {execution: default-install}]
[INFO] Installing <https://hudson.apache.org/hudson/job/CXF-Trunk-JDK15/ws/trunk/rt/databinding/aegis/target/cxf-rt-databinding-aegis-2.4.0-SNAPSHOT.jar>
to <https://hudson.apache.org/hudson/job/CXF-Trunk-JDK15/ws/.repository/org/apache/cxf/cxf-rt-databinding-aegis/2.4.0-SNAPSHOT/cxf-rt-databinding-aegis-2.4.0-SNAPSHOT.jar>
[JENKINS] Archiving <https://hudson.apache.org/hudson/job/CXF-Trunk-JDK15/ws/trunk/rt/databinding/aegis/pom.xml>
to /home/hudson/hudson/jobs/CXF-Trunk-JDK15/modules/org.apache.cxf$cxf-rt-databinding-aegis/builds/2011-03-14_16-38-47/archive/org.apache.cxf/cxf-rt-databinding-aegis/2.4.0-SNAPSHOT/pom.xml
[JENKINS] Archiving <https://hudson.apache.org/hudson/job/CXF-Trunk-JDK15/ws/trunk/rt/databinding/aegis/target/cxf-rt-databinding-aegis-2.4.0-SNAPSHOT.jar>
to /home/hudson/hudson/jobs/CXF-Trunk-JDK15/modules/org.apache.cxf$cxf-rt-databinding-aegis/builds/2011-03-14_16-38-47/archive/org.apache.cxf/cxf-rt-databinding-aegis/2.4.0-SNAPSHOT/cxf-rt-databinding-aegis-2.4.0-SNAPSHOT.jar
[INFO] ------------------------------------------------------------------------
[INFO] Building Apache CXF Runtime JavaScript Client Generator
[INFO]    task-segment: [clean, install]
[INFO] ------------------------------------------------------------------------
[INFO] [clean:clean {execution: default-clean}]
[INFO] Deleting <https://hudson.apache.org/hudson/job/CXF-Trunk-JDK15/ws/trunk/rt/javascript/target>
[INFO] [cxf-xml2fastinfoset:xml2fastinfoset {execution: xml2fastinfoset}]
[INFO] [build-helper:add-source {execution: add-source}]
[INFO] Source directory: <https://hudson.apache.org/hudson/job/CXF-Trunk-JDK15/ws/trunk/rt/javascript/src/main/generated>
added.
[INFO] [remote-resources:process {execution: default}]
Downloading: http://repository.apache.org/snapshots/org/apache/neethi/neethi/3.0.0-SNAPSHOT/neethi-3.0.0-SNAPSHOT.jar
[INFO] [resources:resources {execution: default-resources}]
[INFO] Using 'UTF-8' encoding to copy filtered resources.
[INFO] Copying 4 resources
[INFO] Copying 3 resources
[INFO] skip non existing resourceDirectory <https://hudson.apache.org/hudson/job/CXF-Trunk-JDK15/ws/trunk/rt/javascript/src/main/resources-filtered>
[INFO] Copying 1 resource
[INFO] Copying 3 resources
Downloading: http://repository.apache.org/snapshots/org/apache/neethi/neethi/3.0.0-SNAPSHOT/neethi-3.0.0-SNAPSHOT.jar
[INFO] [compiler:compile {execution: default-compile}]
[INFO] Compiling 14 source files to <https://hudson.apache.org/hudson/job/CXF-Trunk-JDK15/ws/trunk/rt/javascript/target/classes>
Downloading: http://repository.apache.org/snapshots/org/apache/neethi/neethi/3.0.0-SNAPSHOT/neethi-3.0.0-SNAPSHOT.jar
[INFO] [cxf-codegen:wsdl2java {execution: generate-test-sources}]
[INFO] Running wsdl2java in fork mode...
[INFO] Building jar: /tmp/cxf-tmp-315155/cxf-codegen3129517080850829484.jar
[INFO] [resources:testResources {execution: default-testResources}]
[INFO] Using 'UTF-8' encoding to copy filtered resources.
[INFO] Copying 1 resource
[INFO] Copying 29 resources
[INFO] skip non existing resourceDirectory <https://hudson.apache.org/hudson/job/CXF-Trunk-JDK15/ws/trunk/rt/javascript/target/generated/src/test/resources>
[INFO] Copying 3 resources
Downloading: http://repository.apache.org/snapshots/org/apache/neethi/neethi/3.0.0-SNAPSHOT/neethi-3.0.0-SNAPSHOT.jar
[INFO] [compiler:testCompile {execution: default-testCompile}]
[INFO] Compiling 79 source files to <https://hudson.apache.org/hudson/job/CXF-Trunk-JDK15/ws/trunk/rt/javascript/target/test-classes>
Downloading: http://repository.apache.org/snapshots/org/apache/neethi/neethi/3.0.0-SNAPSHOT/neethi-3.0.0-SNAPSHOT.jar
[INFO] [surefire:test {execution: default-test}]
[INFO] Surefire report directory: <https://hudson.apache.org/hudson/job/CXF-Trunk-JDK15/ws/trunk/rt/javascript/target/surefire-reports>

-------------------------------------------------------
 T E S T S
-------------------------------------------------------
Running org.apache.cxf.javascript.AegisTest
Tests run: 3, Failures: 0, Errors: 0, Skipped: 0, Time elapsed: 2.996 sec
Running org.apache.cxf.javascript.AnyTest
Tests run: 4, Failures: 0, Errors: 0, Skipped: 0, Time elapsed: 1.489 sec
Running org.apache.cxf.javascript.BasicNameManagerTest
Tests run: 1, Failures: 0, Errors: 0, Skipped: 0, Time elapsed: 0.001 sec
Running org.apache.cxf.javascript.DocLitBareClientTest
Tests run: 6, Failures: 0, Errors: 0, Skipped: 0, Time elapsed: 1.46 sec
Running org.apache.cxf.javascript.DocLitWrappedClientTest
Tests run: 8, Failures: 0, Errors: 0, Skipped: 0, Time elapsed: 2.542 sec
Running org.apache.cxf.javascript.GenericAegisTest
Tests run: 1, Failures: 0, Errors: 0, Skipped: 0, Time elapsed: 0.024 sec
Running org.apache.cxf.javascript.GreeterClientTest
Tests run: 2, Failures: 0, Errors: 0, Skipped: 0, Time elapsed: 0.35 sec
Running org.apache.cxf.javascript.JsHttpRequestTest
Mar 14, 2011 8:44:09 AM org.apache.cxf.javascript.JsXMLHttpRequest doSend
SEVERE: send state != OPENED.
Tests run: 1, Failures: 0, Errors: 0, Skipped: 0, Time elapsed: 0.474 sec
Running org.apache.cxf.javascript.MtoMTest
Tests run: 2, Failures: 0, Errors: 0, Skipped: 0, Time elapsed: 0.371 sec
Running org.apache.cxf.javascript.QueryHandlerTest
Tests run: 4, Failures: 0, Errors: 0, Skipped: 1, Time elapsed: 0.77 sec
Running org.apache.cxf.javascript.RPCClientTest
Tests run: 2, Failures: 0, Errors: 0, Skipped: 1, Time elapsed: 0.174 sec
Running org.apache.cxf.javascript.types.AttributeTest
Tests run: 2, Failures: 0, Errors: 0, Skipped: 1, Time elapsed: 0.135 sec
Running org.apache.cxf.javascript.types.SerializationTest
Tests run: 3, Failures: 0, Errors: 0, Skipped: 0, Time elapsed: 0.512 sec

Results :

Tests run: 39, Failures: 0, Errors: 0, Skipped: 3

[JENKINS] Recording test results
Downloading: http://repository.apache.org/snapshots/org/apache/neethi/neethi/3.0.0-SNAPSHOT/neethi-3.0.0-SNAPSHOT.jar
[INFO] [jar:jar {execution: default-jar}]
[INFO] Building jar: <https://hudson.apache.org/hudson/job/CXF-Trunk-JDK15/ws/trunk/rt/javascript/target/cxf-rt-javascript-2.4.0-SNAPSHOT.jar>
[INFO] [install:install {execution: default-install}]
[INFO] Installing <https://hudson.apache.org/hudson/job/CXF-Trunk-JDK15/ws/trunk/rt/javascript/target/cxf-rt-javascript-2.4.0-SNAPSHOT.jar>
to <https://hudson.apache.org/hudson/job/CXF-Trunk-JDK15/ws/.repository/org/apache/cxf/cxf-rt-javascript/2.4.0-SNAPSHOT/cxf-rt-javascript-2.4.0-SNAPSHOT.jar>
[JENKINS] Archiving <https://hudson.apache.org/hudson/job/CXF-Trunk-JDK15/ws/trunk/rt/javascript/pom.xml>
to /home/hudson/hudson/jobs/CXF-Trunk-JDK15/modules/org.apache.cxf$cxf-rt-javascript/builds/2011-03-14_16-38-47/archive/org.apache.cxf/cxf-rt-javascript/2.4.0-SNAPSHOT/pom.xml
[JENKINS] Archiving <https://hudson.apache.org/hudson/job/CXF-Trunk-JDK15/ws/trunk/rt/javascript/target/cxf-rt-javascript-2.4.0-SNAPSHOT.jar>
to /home/hudson/hudson/jobs/CXF-Trunk-JDK15/modules/org.apache.cxf$cxf-rt-javascript/builds/2011-03-14_16-38-47/archive/org.apache.cxf/cxf-rt-javascript/2.4.0-SNAPSHOT/cxf-rt-javascript-2.4.0-SNAPSHOT.jar
[INFO] ------------------------------------------------------------------------
[INFO] Building Apache CXF Command Line Tools WSDL to JavaScript Front End
[INFO]    task-segment: [clean, install]
[INFO] ------------------------------------------------------------------------
[INFO] [clean:clean {execution: default-clean}]
[INFO] Deleting <https://hudson.apache.org/hudson/job/CXF-Trunk-JDK15/ws/trunk/tools/wsdlto/frontend/javascript/target>
[INFO] [cxf-xml2fastinfoset:xml2fastinfoset {execution: xml2fastinfoset}]
[INFO] [remote-resources:process {execution: default}]
Downloading: http://repository.apache.org/snapshots/org/apache/neethi/neethi/3.0.0-SNAPSHOT/neethi-3.0.0-SNAPSHOT.jar
[INFO] [resources:resources {execution: default-resources}]
[INFO] Using 'UTF-8' encoding to copy filtered resources.
[INFO] Copying 1 resource
[INFO] Copying 1 resource
[INFO] skip non existing resourceDirectory <https://hudson.apache.org/hudson/job/CXF-Trunk-JDK15/ws/trunk/tools/wsdlto/frontend/javascript/src/main/resources-filtered>
[INFO] skip non existing resourceDirectory <https://hudson.apache.org/hudson/job/CXF-Trunk-JDK15/ws/trunk/tools/wsdlto/frontend/javascript/target/generated/src/main/resources>
[INFO] Copying 3 resources
Downloading: http://repository.apache.org/snapshots/org/apache/neethi/neethi/3.0.0-SNAPSHOT/neethi-3.0.0-SNAPSHOT.jar
[INFO] [compiler:compile {execution: default-compile}]
[INFO] Compiling 4 source files to <https://hudson.apache.org/hudson/job/CXF-Trunk-JDK15/ws/trunk/tools/wsdlto/frontend/javascript/target/classes>
[INFO] [resources:testResources {execution: default-testResources}]
[INFO] Using 'UTF-8' encoding to copy filtered resources.
[INFO] Copying 0 resource
[INFO] Copying 1 resource
[INFO] skip non existing resourceDirectory <https://hudson.apache.org/hudson/job/CXF-Trunk-JDK15/ws/trunk/tools/wsdlto/frontend/javascript/target/generated/src/test/resources>
[INFO] Copying 3 resources
Downloading: http://repository.apache.org/snapshots/org/apache/neethi/neethi/3.0.0-SNAPSHOT/neethi-3.0.0-SNAPSHOT.jar
[INFO] [compiler:testCompile {execution: default-testCompile}]
[INFO] Compiling 1 source file to <https://hudson.apache.org/hudson/job/CXF-Trunk-JDK15/ws/trunk/tools/wsdlto/frontend/javascript/target/test-classes>
Downloading: http://repository.apache.org/snapshots/org/apache/neethi/neethi/3.0.0-SNAPSHOT/neethi-3.0.0-SNAPSHOT.jar
[INFO] [surefire:test {execution: default-test}]
[INFO] Surefire report directory: <https://hudson.apache.org/hudson/job/CXF-Trunk-JDK15/ws/trunk/tools/wsdlto/frontend/javascript/target/surefire-reports>

-------------------------------------------------------
 T E S T S
-------------------------------------------------------
Running org.apache.cxf.tools.wsdlto.javascript.WSDLToJavaScriptTest
Tests run: 1, Failures: 0, Errors: 0, Skipped: 0, Time elapsed: 1.345 sec

Results :

Tests run: 1, Failures: 0, Errors: 0, Skipped: 0

[JENKINS] Recording test results
Downloading: http://repository.apache.org/snapshots/org/apache/neethi/neethi/3.0.0-SNAPSHOT/neethi-3.0.0-SNAPSHOT.jar
[INFO] [jar:jar {execution: default-jar}]
[INFO] Building jar: <https://hudson.apache.org/hudson/job/CXF-Trunk-JDK15/ws/trunk/tools/wsdlto/frontend/javascript/target/cxf-tools-wsdlto-frontend-javascript-2.4.0-SNAPSHOT.jar>
[INFO] [install:install {execution: default-install}]
[INFO] Installing <https://hudson.apache.org/hudson/job/CXF-Trunk-JDK15/ws/trunk/tools/wsdlto/frontend/javascript/target/cxf-tools-wsdlto-frontend-javascript-2.4.0-SNAPSHOT.jar>
to <https://hudson.apache.org/hudson/job/CXF-Trunk-JDK15/ws/.repository/org/apache/cxf/cxf-tools-wsdlto-frontend-javascript/2.4.0-SNAPSHOT/cxf-tools-wsdlto-frontend-javascript-2.4.0-SNAPSHOT.jar>
[JENKINS] Archiving <https://hudson.apache.org/hudson/job/CXF-Trunk-JDK15/ws/trunk/tools/wsdlto/frontend/javascript/pom.xml>
to /home/hudson/hudson/jobs/CXF-Trunk-JDK15/modules/org.apache.cxf$cxf-tools-wsdlto-frontend-javascript/builds/2011-03-14_16-38-47/archive/org.apache.cxf/cxf-tools-wsdlto-frontend-javascript/2.4.0-SNAPSHOT/pom.xml
[JENKINS] Archiving <https://hudson.apache.org/hudson/job/CXF-Trunk-JDK15/ws/trunk/tools/wsdlto/frontend/javascript/target/cxf-tools-wsdlto-frontend-javascript-2.4.0-SNAPSHOT.jar>
to /home/hudson/hudson/jobs/CXF-Trunk-JDK15/modules/org.apache.cxf$cxf-tools-wsdlto-frontend-javascript/builds/2011-03-14_16-38-47/archive/org.apache.cxf/cxf-tools-wsdlto-frontend-javascript/2.4.0-SNAPSHOT/cxf-tools-wsdlto-frontend-javascript-2.4.0-SNAPSHOT.jar
[INFO] ------------------------------------------------------------------------
[INFO] Building Apache CXF Runtime Management
[INFO]    task-segment: [clean, install]
[INFO] ------------------------------------------------------------------------
[INFO] [clean:clean {execution: default-clean}]
[INFO] Deleting <https://hudson.apache.org/hudson/job/CXF-Trunk-JDK15/ws/trunk/rt/management/target>
[INFO] [cxf-xml2fastinfoset:xml2fastinfoset {execution: xml2fastinfoset}]
[INFO] [cxf-xjc:xsdtojava {execution: generate-sources}]
[INFO] [remote-resources:process {execution: default}]
Downloading: http://repository.apache.org/snapshots/org/apache/neethi/neethi/3.0.0-SNAPSHOT/neethi-3.0.0-SNAPSHOT.jar
[INFO] [resources:resources {execution: default-resources}]
[INFO] Using 'UTF-8' encoding to copy filtered resources.
[INFO] Copying 4 resources
[INFO] Copying 3 resources
[INFO] skip non existing resourceDirectory <https://hudson.apache.org/hudson/job/CXF-Trunk-JDK15/ws/trunk/rt/management/src/main/resources-filtered>
[INFO] Copying 1 resource
[INFO] Copying 3 resources
Downloading: http://repository.apache.org/snapshots/org/apache/neethi/neethi/3.0.0-SNAPSHOT/neethi-3.0.0-SNAPSHOT.jar
[INFO] [compiler:compile {execution: default-compile}]
[INFO] Compiling 28 source files to <https://hudson.apache.org/hudson/job/CXF-Trunk-JDK15/ws/trunk/rt/management/target/classes>
[INFO] -------------------------------------------------------------
[ERROR] COMPILATION ERROR : 
[INFO] -------------------------------------------------------------
[ERROR] <https://hudson.apache.org/hudson/job/CXF-Trunk-JDK15/ws/trunk/rt/management/src/main/java/org/apache/cxf/management/jmx/InstrumentationManagerImpl.java>:[135,89]
cannot find symbol
symbol  : variable DELEGATE_NAME
location: class javax.management.MBeanServerDelegate
[INFO] 1 error
[INFO] -------------------------------------------------------------
[JENKINS] Archiving <https://hudson.apache.org/hudson/job/CXF-Trunk-JDK15/ws/trunk/rt/management/pom.xml>
to /home/hudson/hudson/jobs/CXF-Trunk-JDK15/modules/org.apache.cxf$cxf-rt-management/builds/2011-03-14_16-38-47/archive/org.apache.cxf/cxf-rt-management/2.4.0-SNAPSHOT/pom.xml
[INFO] ------------------------------------------------------------------------
[ERROR] BUILD FAILURE
[INFO] ------------------------------------------------------------------------
[INFO] Compilation failure
<https://hudson.apache.org/hudson/job/CXF-Trunk-JDK15/ws/trunk/rt/management/src/main/java/org/apache/cxf/management/jmx/InstrumentationManagerImpl.java>:[135,89]
cannot find symbol
symbol  : variable DELEGATE_NAME
location: class javax.management.MBeanServerDelegate

[INFO] ------------------------------------------------------------------------
[INFO] Trace
org.apache.maven.BuildFailureException: Compilation failure
<https://hudson.apache.org/hudson/job/CXF-Trunk-JDK15/ws/trunk/rt/management/src/main/java/org/apache/cxf/management/jmx/InstrumentationManagerImpl.java>:[135,89]
cannot find symbol
symbol  : variable DELEGATE_NAME
location: class javax.management.MBeanServerDelegate

	at org.apache.maven.lifecycle.DefaultLifecycleExecutor.executeGoals(DefaultLifecycleExecutor.java:715)
	at org.apache.maven.lifecycle.DefaultLifecycleExecutor.executeGoalWithLifecycle(DefaultLifecycleExecutor.java:556)
	at org.apache.maven.lifecycle.DefaultLifecycleExecutor.executeGoal(DefaultLifecycleExecutor.java:535)
	at org.apache.maven.lifecycle.DefaultLifecycleExecutor.executeGoalAndHandleFailures(DefaultLifecycleExecutor.java:387)
	at org.apache.maven.lifecycle.DefaultLifecycleExecutor.executeTaskSegments(DefaultLifecycleExecutor.java:348)
	at org.apache.maven.lifecycle.DefaultLifecycleExecutor.execute(DefaultLifecycleExecutor.java:180)
	at org.apache.maven.lifecycle.LifecycleExecutorInterceptor.execute(LifecycleExecutorInterceptor.java:65)
	at org.apache.maven.DefaultMaven.doExecute(DefaultMaven.java:328)
	at org.apache.maven.DefaultMaven.execute(DefaultMaven.java:138)
	at org.apache.maven.cli.MavenCli.main(MavenCli.java:362)
	at sun.reflect.NativeMethodAccessorImpl.invoke0(Native Method)
	at sun.reflect.NativeMethodAccessorImpl.invoke(NativeMethodAccessorImpl.java:39)
	at sun.reflect.DelegatingMethodAccessorImpl.invoke(DelegatingMethodAccessorImpl.java:25)
	at java.lang.reflect.Method.invoke(Method.java:592)
	at org.codehaus.classworlds.Launcher.launchEnhanced(Launcher.java:315)
	at org.codehaus.classworlds.Launcher.launch(Launcher.java:255)
	at hudson.maven.agent.Main.launch(Main.java:173)
	at hudson.maven.MavenBuilder.call(MavenBuilder.java:164)
	at hudson.maven.MavenModuleSetBuild$Builder.call(MavenModuleSetBuild.java:872)
	at hudson.maven.MavenModuleSetBuild$Builder.call(MavenModuleSetBuild.java:803)
	at hudson.remoting.UserRequest.perform(UserRequest.java:114)
	at hudson.remoting.UserRequest.perform(UserRequest.java:48)
	at hudson.remoting.Request$2.run(Request.java:270)
	at java.util.concurrent.Executors$RunnableAdapter.call(Executors.java:417)
	at java.util.concurrent.FutureTask$Sync.innerRun(FutureTask.java:269)
	at java.util.concurrent.FutureTask.run(FutureTask.java:123)
	at java.util.concurrent.ThreadPoolExecutor$Worker.runTask(ThreadPoolExecutor.java:651)
	at java.util.concurrent.ThreadPoolExecutor$Worker.run(ThreadPoolExecutor.java:676)
	at java.lang.Thread.run(Thread.java:595)
Caused by: org.apache.maven.plugin.CompilationFailureException: Compilation failure
<https://hudson.apache.org/hudson/job/CXF-Trunk-JDK15/ws/trunk/rt/management/src/main/java/org/apache/cxf/management/jmx/InstrumentationManagerImpl.java>:[135,89]
cannot find symbol
symbol  : variable DELEGATE_NAME
location: class javax.management.MBeanServerDelegate

	at org.apache.maven.plugin.AbstractCompilerMojo.execute(AbstractCompilerMojo.java:656)
	at org.apache.maven.plugin.CompilerMojo.execute(CompilerMojo.java:128)
	at org.apache.maven.plugin.DefaultPluginManager.executeMojo(DefaultPluginManager.java:490)
	at hudson.maven.agent.PluginManagerInterceptor.executeMojo(PluginManagerInterceptor.java:182)
	at org.apache.maven.lifecycle.DefaultLifecycleExecutor.executeGoals(DefaultLifecycleExecutor.java:694)
	... 28 more
[INFO] ------------------------------------------------------------------------
[INFO] Total time: 5 minutes 6 seconds
[INFO] Finished at: Mon Mar 14 08:44:22 GMT-08:00 2011
[INFO] Final Memory: 89M/142M
[INFO] ------------------------------------------------------------------------
Sending e-mails to: notifications@cxf.apache.org dkulp_apache@dankulp.com
channel stopped
[locks-and-latches] Releasing all the locks
[locks-and-latches] All the locks released


Mime
View raw message