cxf-notifications mailing list archives

Site index · List index
Message view « Date » · « Thread »
Top « Date » · « Thread »
From Apache Hudson Server <hud...@hudson.apache.org>
Subject Build failed in Jenkins: CXF-Trunk-JDK15 #1924
Date Thu, 31 Mar 2011 16:04:45 GMT
See <https://hudson.apache.org/hudson/job/CXF-Trunk-JDK15/1924/changes>

Changes:

[sergeyb] Minor update to README

------------------------------------------
[...truncated 243 lines...]
[JENKINS] Archiving <https://hudson.apache.org/hudson/job/CXF-Trunk-JDK15/ws/trunk/common/common/target/cxf-common-utilities-2.4.0-SNAPSHOT.jar>
to /home/hudson/hudson/jobs/CXF-Trunk-JDK15/modules/org.apache.cxf$cxf-common-utilities/builds/2011-03-31_16-02-35/archive/org.apache.cxf/cxf-common-utilities/2.4.0-SNAPSHOT/cxf-common-utilities-2.4.0-SNAPSHOT.jar
[INFO] ------------------------------------------------------------------------
[INFO] Building Apache CXF API
[INFO]    task-segment: [clean, install]
[INFO] ------------------------------------------------------------------------
[INFO] [clean:clean {execution: default-clean}]
[INFO] Deleting <https://hudson.apache.org/hudson/job/CXF-Trunk-JDK15/ws/trunk/api/target>
[INFO] [cxf-xml2fastinfoset:xml2fastinfoset {execution: xml2fastinfoset}]
[INFO] [cxf-xjc:xsdtojava {execution: generate-sources}]
[INFO] [remote-resources:process {execution: default}]
[INFO] snapshot org.apache.neethi:neethi:3.0.0-SNAPSHOT: checking for updates from apache.snapshots
Downloading: http://repository.apache.org/snapshots/org/apache/neethi/neethi/3.0.0-SNAPSHOT/neethi-3.0.0-SNAPSHOT.pom
Downloading: http://repository.apache.org/snapshots/org/apache/neethi/neethi/3.0.0-SNAPSHOT/neethi-3.0.0-SNAPSHOT.jar
[INFO] [resources:resources {execution: default-resources}]
[INFO] Using 'UTF-8' encoding to copy filtered resources.
[INFO] Copying 8 resources
[INFO] Copying 23 resources
[INFO] skip non existing resourceDirectory <https://hudson.apache.org/hudson/job/CXF-Trunk-JDK15/ws/trunk/api/src/main/resources-filtered>
[INFO] skip non existing resourceDirectory <https://hudson.apache.org/hudson/job/CXF-Trunk-JDK15/ws/trunk/api/target/generated/src/main/resources>
[INFO] Copying 3 resources
Downloading: http://repository.apache.org/snapshots/org/apache/neethi/neethi/3.0.0-SNAPSHOT/neethi-3.0.0-SNAPSHOT.jar
[INFO] [compiler:compile {execution: default-compile}]
[INFO] Compiling 279 source files to <https://hudson.apache.org/hudson/job/CXF-Trunk-JDK15/ws/trunk/api/target/classes>
[INFO] [cxf-xjc:xsdtojava-tests {execution: generate-test-sources}]
[INFO] [resources:testResources {execution: default-testResources}]
[INFO] Using 'UTF-8' encoding to copy filtered resources.
[INFO] Copying 1 resource
[INFO] Copying 5 resources
[INFO] skip non existing resourceDirectory <https://hudson.apache.org/hudson/job/CXF-Trunk-JDK15/ws/trunk/api/target/generated/src/test/resources>
[INFO] Copying 3 resources
[INFO] [compiler:testCompile {execution: default-testCompile}]
[INFO] Compiling 28 source files to <https://hudson.apache.org/hudson/job/CXF-Trunk-JDK15/ws/trunk/api/target/test-classes>
[INFO] [surefire:test {execution: default-test}]
[INFO] Surefire report directory: <https://hudson.apache.org/hudson/job/CXF-Trunk-JDK15/ws/trunk/api/target/surefire-reports>

-------------------------------------------------------
 T E S T S
-------------------------------------------------------
Running org.apache.cxf.BusFactoryTest
Tests run: 1, Failures: 0, Errors: 0, Skipped: 0, Time elapsed: 0.285 sec
Running org.apache.cxf.NSManagerTest
Tests run: 1, Failures: 0, Errors: 0, Skipped: 0, Time elapsed: 0.004 sec
Running org.apache.cxf.continuations.ContinuationInfoTest
Tests run: 1, Failures: 0, Errors: 0, Skipped: 0, Time elapsed: 0.006 sec
Running org.apache.cxf.continuations.SuspendedInvocationExceptionTest
Tests run: 2, Failures: 0, Errors: 0, Skipped: 0, Time elapsed: 0.004 sec
Running org.apache.cxf.databinding.AbstractDataBindingTest
Tests run: 2, Failures: 0, Errors: 0, Skipped: 0, Time elapsed: 0.004 sec
Running org.apache.cxf.phase.PhaseInterceptorChainTest
Tests run: 21, Failures: 0, Errors: 0, Skipped: 0, Time elapsed: 0.206 sec
Running org.apache.cxf.service.model.BindingFaultInfoTest
Tests run: 1, Failures: 0, Errors: 0, Skipped: 0, Time elapsed: 0.003 sec
Running org.apache.cxf.service.model.BindingMessageInfoTest
Tests run: 1, Failures: 0, Errors: 0, Skipped: 0, Time elapsed: 0.002 sec
Running org.apache.cxf.service.model.BindingOperationInfoTest
Tests run: 6, Failures: 0, Errors: 0, Skipped: 0, Time elapsed: 0.008 sec
Running org.apache.cxf.service.model.FaultInfoTest
Tests run: 1, Failures: 0, Errors: 0, Skipped: 0, Time elapsed: 0.002 sec
Running org.apache.cxf.service.model.InterfaceInfoTest
Tests run: 2, Failures: 0, Errors: 0, Skipped: 0, Time elapsed: 0.025 sec
Running org.apache.cxf.service.model.MessageInfoTest
Tests run: 2, Failures: 0, Errors: 0, Skipped: 0, Time elapsed: 0.002 sec
Running org.apache.cxf.service.model.MessagePartInfoTest
Tests run: 3, Failures: 0, Errors: 0, Skipped: 0, Time elapsed: 0.002 sec
Running org.apache.cxf.service.model.OperationInfoTest
Tests run: 5, Failures: 0, Errors: 0, Skipped: 0, Time elapsed: 0.003 sec
Running org.apache.cxf.ws.policy.AssertionInfoMapTest
Tests run: 4, Failures: 0, Errors: 0, Skipped: 0, Time elapsed: 0.016 sec
Running org.apache.cxf.ws.policy.builder.jaxb.JaxbAssertionBuilderTest
Tests run: 3, Failures: 0, Errors: 0, Skipped: 0, Time elapsed: 0.27 sec
Running org.apache.cxf.ws.policy.builder.jaxb.JaxbAssertionTest
Tests run: 3, Failures: 0, Errors: 0, Skipped: 0, Time elapsed: 0.038 sec
Running org.apache.cxf.wsdl.JAXBExtensionHelperTest
Tests run: 3, Failures: 0, Errors: 0, Skipped: 0, Time elapsed: 0.292 sec

Results :

Tests run: 62, Failures: 0, Errors: 0, Skipped: 0

[JENKINS] Recording test results
[INFO] [jar:jar {execution: default-jar}]
[INFO] Building jar: <https://hudson.apache.org/hudson/job/CXF-Trunk-JDK15/ws/trunk/api/target/cxf-api-2.4.0-SNAPSHOT.jar>
[INFO] [install:install {execution: default-install}]
[INFO] Installing <https://hudson.apache.org/hudson/job/CXF-Trunk-JDK15/ws/trunk/api/target/cxf-api-2.4.0-SNAPSHOT.jar>
to <https://hudson.apache.org/hudson/job/CXF-Trunk-JDK15/ws/.repository/org/apache/cxf/cxf-api/2.4.0-SNAPSHOT/cxf-api-2.4.0-SNAPSHOT.jar>
[JENKINS] Archiving <https://hudson.apache.org/hudson/job/CXF-Trunk-JDK15/ws/trunk/api/pom.xml>
to /home/hudson/hudson/jobs/CXF-Trunk-JDK15/modules/org.apache.cxf$cxf-api/builds/2011-03-31_16-02-35/archive/org.apache.cxf/cxf-api/2.4.0-SNAPSHOT/pom.xml
[JENKINS] Archiving <https://hudson.apache.org/hudson/job/CXF-Trunk-JDK15/ws/trunk/api/target/cxf-api-2.4.0-SNAPSHOT.jar>
to /home/hudson/hudson/jobs/CXF-Trunk-JDK15/modules/org.apache.cxf$cxf-api/builds/2011-03-31_16-02-35/archive/org.apache.cxf/cxf-api/2.4.0-SNAPSHOT/cxf-api-2.4.0-SNAPSHOT.jar
[INFO] ------------------------------------------------------------------------
[INFO] Building Apache CXF Woodstox/MSV Schema Validation
[INFO]    task-segment: [clean, install]
[INFO] ------------------------------------------------------------------------
[INFO] [clean:clean {execution: default-clean}]
[INFO] Deleting <https://hudson.apache.org/hudson/job/CXF-Trunk-JDK15/ws/trunk/common/wstx-msv-validation/target>
[INFO] [cxf-xml2fastinfoset:xml2fastinfoset {execution: xml2fastinfoset}]
[INFO] [remote-resources:process {execution: default}]
Downloading: http://repository.apache.org/snapshots/org/apache/neethi/neethi/3.0.0-SNAPSHOT/neethi-3.0.0-SNAPSHOT.jar
[INFO] [resources:resources {execution: default-resources}]
[INFO] Using 'UTF-8' encoding to copy filtered resources.
[INFO] Copying 0 resource
[INFO] Copying 4 resources
[INFO] skip non existing resourceDirectory <https://hudson.apache.org/hudson/job/CXF-Trunk-JDK15/ws/trunk/common/wstx-msv-validation/src/main/resources-filtered>
[INFO] Copying 1 resource
[INFO] Copying 3 resources
Downloading: http://repository.apache.org/snapshots/org/apache/neethi/neethi/3.0.0-SNAPSHOT/neethi-3.0.0-SNAPSHOT.jar
[INFO] [compiler:compile {execution: default-compile}]
[INFO] Compiling 5 source files to <https://hudson.apache.org/hudson/job/CXF-Trunk-JDK15/ws/trunk/common/wstx-msv-validation/target/classes>
[INFO] [resources:testResources {execution: default-testResources}]
[INFO] Using 'UTF-8' encoding to copy filtered resources.
[INFO] Copying 0 resource
[INFO] skip non existing resourceDirectory <https://hudson.apache.org/hudson/job/CXF-Trunk-JDK15/ws/trunk/common/wstx-msv-validation/src/test/resources>
[INFO] skip non existing resourceDirectory <https://hudson.apache.org/hudson/job/CXF-Trunk-JDK15/ws/trunk/common/wstx-msv-validation/target/generated/src/test/resources>
[INFO] Copying 3 resources
Downloading: http://repository.apache.org/snapshots/org/apache/neethi/neethi/3.0.0-SNAPSHOT/neethi-3.0.0-SNAPSHOT.jar
[INFO] [compiler:testCompile {execution: default-testCompile}]
[INFO] Nothing to compile - all classes are up to date
Downloading: http://repository.apache.org/snapshots/org/apache/neethi/neethi/3.0.0-SNAPSHOT/neethi-3.0.0-SNAPSHOT.jar
[INFO] [surefire:test {execution: default-test}]
[INFO] Surefire report directory: <https://hudson.apache.org/hudson/job/CXF-Trunk-JDK15/ws/trunk/common/wstx-msv-validation/target/surefire-reports>

-------------------------------------------------------
 T E S T S
-------------------------------------------------------
There are no tests to run.

Results :

Tests run: 0, Failures: 0, Errors: 0, Skipped: 0

[JENKINS] Recording test resultsDownloading: http://repository.apache.org/snapshots/org/apache/neethi/neethi/3.0.0-SNAPSHOT/neethi-3.0.0-SNAPSHOT.jar

[JENKINS] Archiving <https://hudson.apache.org/hudson/job/CXF-Trunk-JDK15/ws/trunk/common/wstx-msv-validation/pom.xml>
to /home/hudson/hudson/jobs/CXF-Trunk-JDK15/modules/org.apache.cxf$cxf-wstx-msv-validation/builds/2011-03-31_16-02-35/archive/org.apache.cxf/cxf-wstx-msv-validation/2.4.0-SNAPSHOT/pom.xml
[INFO] ------------------------------------------------------------------------
[ERROR] BUILD ERROR
[INFO] ------------------------------------------------------------------------
[INFO] Failed to resolve artifact.

Error transferring file: Connection timed out
  org.apache.neethi:neethi:jar:3.0.0-SNAPSHOT

from the specified remote repositories:
  central (http://repo1.maven.org/maven2),
  Nexus (http://repository.apache.org/snapshots)

Path to dependency: 
	1) org.apache.cxf:cxf-wstx-msv-validation:jar:2.4.0-SNAPSHOT
	2) org.apache.cxf:cxf-api:jar:2.4.0-SNAPSHOT
	3) org.apache.neethi:neethi:jar:3.0.0-SNAPSHOT



[INFO] ------------------------------------------------------------------------
[INFO] Trace
org.apache.maven.lifecycle.LifecycleExecutionException: Error transferring file: Connection
timed out
  org.apache.neethi:neethi:jar:3.0.0-SNAPSHOT

from the specified remote repositories:
  central (http://repo1.maven.org/maven2),
  Nexus (http://repository.apache.org/snapshots)

Path to dependency: 
	1) org.apache.cxf:cxf-wstx-msv-validation:jar:2.4.0-SNAPSHOT
	2) org.apache.cxf:cxf-api:jar:2.4.0-SNAPSHOT
	3) org.apache.neethi:neethi:jar:3.0.0-SNAPSHOT


	at org.apache.maven.lifecycle.DefaultLifecycleExecutor.executeGoals(DefaultLifecycleExecutor.java:711)
	at org.apache.maven.lifecycle.DefaultLifecycleExecutor.executeGoalWithLifecycle(DefaultLifecycleExecutor.java:556)
	at org.apache.maven.lifecycle.DefaultLifecycleExecutor.executeGoal(DefaultLifecycleExecutor.java:535)
	at org.apache.maven.lifecycle.DefaultLifecycleExecutor.executeGoalAndHandleFailures(DefaultLifecycleExecutor.java:387)
	at org.apache.maven.lifecycle.DefaultLifecycleExecutor.executeTaskSegments(DefaultLifecycleExecutor.java:348)
	at org.apache.maven.lifecycle.DefaultLifecycleExecutor.execute(DefaultLifecycleExecutor.java:180)
	at org.apache.maven.lifecycle.LifecycleExecutorInterceptor.execute(LifecycleExecutorInterceptor.java:65)
	at org.apache.maven.DefaultMaven.doExecute(DefaultMaven.java:328)
	at org.apache.maven.DefaultMaven.execute(DefaultMaven.java:138)
	at org.apache.maven.cli.MavenCli.main(MavenCli.java:362)
	at sun.reflect.NativeMethodAccessorImpl.invoke0(Native Method)
	at sun.reflect.NativeMethodAccessorImpl.invoke(NativeMethodAccessorImpl.java:39)
	at sun.reflect.DelegatingMethodAccessorImpl.invoke(DelegatingMethodAccessorImpl.java:25)
	at java.lang.reflect.Method.invoke(Method.java:592)
	at org.codehaus.classworlds.Launcher.launchEnhanced(Launcher.java:315)
	at org.codehaus.classworlds.Launcher.launch(Launcher.java:255)
	at hudson.maven.agent.Main.launch(Main.java:173)
	at hudson.maven.MavenBuilder.call(MavenBuilder.java:164)
	at hudson.maven.MavenModuleSetBuild$Builder.call(MavenModuleSetBuild.java:924)
	at hudson.maven.MavenModuleSetBuild$Builder.call(MavenModuleSetBuild.java:855)
	at hudson.remoting.UserRequest.perform(UserRequest.java:114)
	at hudson.remoting.UserRequest.perform(UserRequest.java:48)
	at hudson.remoting.Request$2.run(Request.java:270)
	at java.util.concurrent.Executors$RunnableAdapter.call(Executors.java:417)
	at java.util.concurrent.FutureTask$Sync.innerRun(FutureTask.java:269)
	at java.util.concurrent.FutureTask.run(FutureTask.java:123)
	at java.util.concurrent.ThreadPoolExecutor$Worker.runTask(ThreadPoolExecutor.java:651)
	at java.util.concurrent.ThreadPoolExecutor$Worker.run(ThreadPoolExecutor.java:676)
	at java.lang.Thread.run(Thread.java:595)
Caused by: org.apache.maven.artifact.resolver.ArtifactResolutionException: Error transferring
file: Connection timed out
  org.apache.neethi:neethi:jar:3.0.0-SNAPSHOT

from the specified remote repositories:
  central (http://repo1.maven.org/maven2),
  Nexus (http://repository.apache.org/snapshots)

Path to dependency: 
	1) org.apache.cxf:cxf-wstx-msv-validation:jar:2.4.0-SNAPSHOT
	2) org.apache.cxf:cxf-api:jar:2.4.0-SNAPSHOT
	3) org.apache.neethi:neethi:jar:3.0.0-SNAPSHOT


	at org.apache.maven.artifact.resolver.DefaultArtifactResolver.resolve(DefaultArtifactResolver.java:233)
	at org.apache.maven.artifact.resolver.DefaultArtifactResolver.resolve(DefaultArtifactResolver.java:90)
	at org.apache.maven.artifact.resolver.DefaultArtifactResolver$ResolveArtifactTask.resolveArtifact(DefaultArtifactResolver.java:456)
	at org.apache.maven.artifact.resolver.DefaultArtifactResolver$ResolveArtifactTask.run(DefaultArtifactResolver.java:433)
	at hidden.edu.emory.mathcs.backport.java.util.concurrent.ThreadPoolExecutor.runWorker(ThreadPoolExecutor.java:1061)
	at hidden.edu.emory.mathcs.backport.java.util.concurrent.ThreadPoolExecutor$Worker.run(ThreadPoolExecutor.java:575)
	... 1 more
Caused by: org.apache.maven.wagon.TransferFailedException: Error transferring file: Connection
timed out
	at org.apache.maven.wagon.providers.http.LightweightHttpWagon.fillInputData(LightweightHttpWagon.java:143)
	at org.apache.maven.wagon.StreamWagon.getInputStream(StreamWagon.java:116)
	at org.apache.maven.wagon.StreamWagon.getIfNewer(StreamWagon.java:88)
	at org.apache.maven.artifact.manager.DefaultWagonManager.getRemoteFile(DefaultWagonManager.java:530)
	at org.apache.maven.artifact.manager.DefaultWagonManager.getArtifact(DefaultWagonManager.java:427)
	at org.apache.maven.artifact.resolver.DefaultArtifactResolver.resolve(DefaultArtifactResolver.java:212)
	... 6 more
Caused by: java.net.ConnectException: Connection timed out
	at java.net.PlainSocketImpl.socketConnect(Native Method)
	at java.net.PlainSocketImpl.doConnect(PlainSocketImpl.java:333)
	at java.net.PlainSocketImpl.connectToAddress(PlainSocketImpl.java:195)
	at java.net.PlainSocketImpl.connect(PlainSocketImpl.java:182)
	at java.net.Socket.connect(Socket.java:524)
	at java.net.Socket.connect(Socket.java:474)
	at sun.net.NetworkClient.doConnect(NetworkClient.java:157)
	at sun.net.www.http.HttpClient.openServer(HttpClient.java:388)
	at sun.net.www.http.HttpClient.openServer(HttpClient.java:523)
	at sun.net.www.http.HttpClient.<init>(HttpClient.java:231)
	at sun.net.www.http.HttpClient.New(HttpClient.java:304)
	at sun.net.www.http.HttpClient.New(HttpClient.java:321)
	at sun.net.www.protocol.http.HttpURLConnection.getNewHttpClient(HttpURLConnection.java:839)
	at sun.net.www.protocol.http.HttpURLConnection.plainConnect(HttpURLConnection.java:791)
	at sun.net.www.protocol.http.HttpURLConnection.connect(HttpURLConnection.java:716)
	at sun.net.www.protocol.http.HttpURLConnection.getInputStream(HttpURLConnection.java:960)
	at java.net.HttpURLConnection.getResponseCode(HttpURLConnection.java:367)
	at org.apache.maven.wagon.providers.http.LightweightHttpWagon.fillInputData(LightweightHttpWagon.java:115)
	... 11 more
[INFO] ------------------------------------------------------------------------
[INFO] Total time: 1 minute 39 seconds
[INFO] Finished at: Thu Mar 31 16:04:44 UTC 2011
[INFO] Final Memory: 45M/87M
[INFO] ------------------------------------------------------------------------
channel stopped
[locks-and-latches] Releasing all the locks
[locks-and-latches] All the locks released


Mime
View raw message