cxf-notifications mailing list archives

Site index · List index
Message view « Date » · « Thread »
Top « Date » · « Thread »
From Apache Hudson Server <hud...@hudson.apache.org>
Subject Build failed in Jenkins: CXF-Trunk-JDK15 #1816
Date Wed, 09 Mar 2011 12:59:37 GMT
See <https://hudson.apache.org/hudson/job/CXF-Trunk-JDK15/1816/changes>

Changes:

[coheigea] [CXF-3366] - Removed SAAJ stuff from crypto policy checkers

------------------------------------------
[...truncated 1455 lines...]
[INFO] [compiler:compile {execution: default-compile}]
[INFO] Compiling 69 source files to <https://hudson.apache.org/hudson/job/CXF-Trunk-JDK15/ws/trunk/rt/transports/http/target/classes>
[INFO] [resources:testResources {execution: default-testResources}]
[INFO] Using 'UTF-8' encoding to copy filtered resources.
[INFO] Copying 8 resources
[INFO] skip non existing resourceDirectory <https://hudson.apache.org/hudson/job/CXF-Trunk-JDK15/ws/trunk/rt/transports/http/src/test/resources>
[INFO] skip non existing resourceDirectory <https://hudson.apache.org/hudson/job/CXF-Trunk-JDK15/ws/trunk/rt/transports/http/target/generated/src/test/resources>
[INFO] Copying 3 resources
Downloading: http://repository.apache.org/snapshots/org/apache/neethi/neethi/3.0.0-SNAPSHOT/neethi-3.0.0-SNAPSHOT.jar
[INFO] [compiler:testCompile {execution: default-testCompile}]
[INFO] Compiling 13 source files to <https://hudson.apache.org/hudson/job/CXF-Trunk-JDK15/ws/trunk/rt/transports/http/target/test-classes>
Downloading: http://repository.apache.org/snapshots/org/apache/neethi/neethi/3.0.0-SNAPSHOT/neethi-3.0.0-SNAPSHOT.jar
[INFO] [surefire:test {execution: default-test}]
[INFO] Surefire report directory: <https://hudson.apache.org/hudson/job/CXF-Trunk-JDK15/ws/trunk/rt/transports/http/target/surefire-reports>

-------------------------------------------------------
 T E S T S
-------------------------------------------------------
Running org.apache.cxf.transport.http.HTTPConduitTest
Tests run: 4, Failures: 0, Errors: 0, Skipped: 0, Time elapsed: 0.226 sec
Running org.apache.cxf.transport.http.HTTPConduitURLConnectionTest
Tests run: 4, Failures: 0, Errors: 0, Skipped: 0, Time elapsed: 0.338 sec
Running org.apache.cxf.transport.http.HTTPConduitURLEasyMockTest
Tests run: 7, Failures: 0, Errors: 0, Skipped: 0, Time elapsed: 0.472 sec
Running org.apache.cxf.transport.http.HeadersTest
Tests run: 1, Failures: 0, Errors: 0, Skipped: 0, Time elapsed: 0.019 sec
Running org.apache.cxf.transport.http.PatternBuilderTest
Tests run: 1, Failures: 0, Errors: 0, Skipped: 0, Time elapsed: 0.002 sec
Running org.apache.cxf.transport.http.auth.DigestAuthSupplierTest
Tests run: 2, Failures: 0, Errors: 0, Skipped: 0, Time elapsed: 0.161 sec
Running org.apache.cxf.transport.http.auth.HttpAuthHeaderTest
Tests run: 1, Failures: 0, Errors: 0, Skipped: 0, Time elapsed: 0.001 sec
Running org.apache.cxf.transport.http.policy.HTTPClientAssertionBuilderTest
Tests run: 2, Failures: 0, Errors: 0, Skipped: 0, Time elapsed: 0.008 sec
Running org.apache.cxf.transport.http.policy.HTTPServerAssertionBuilderTest
Tests run: 2, Failures: 0, Errors: 0, Skipped: 0, Time elapsed: 0.003 sec
Running org.apache.cxf.transport.http.policy.PolicyUtilsTest
Tests run: 12, Failures: 0, Errors: 0, Skipped: 0, Time elapsed: 0.018 sec
Running org.apache.cxf.transport.https.CertConstraintsTest
Tests run: 1, Failures: 0, Errors: 0, Skipped: 0, Time elapsed: 0.603 sec
Running org.apache.cxf.transport.servlet.AbstractCXFServletTest
Tests run: 7, Failures: 0, Errors: 0, Skipped: 0, Time elapsed: 0.022 sec
Running org.apache.cxf.transport.servlet.ServletControllerTest
Tests run: 10, Failures: 0, Errors: 0, Skipped: 0, Time elapsed: 0.097 sec

Results :

Tests run: 54, Failures: 0, Errors: 0, Skipped: 0

[JENKINS] Recording test results
Downloading: http://repository.apache.org/snapshots/org/apache/neethi/neethi/3.0.0-SNAPSHOT/neethi-3.0.0-SNAPSHOT.jar
[INFO] [jar:jar {execution: default-jar}]
[INFO] Building jar: <https://hudson.apache.org/hudson/job/CXF-Trunk-JDK15/ws/trunk/rt/transports/http/target/cxf-rt-transports-http-2.4.0-SNAPSHOT.jar>
[INFO] [install:install {execution: default-install}]
[INFO] Installing <https://hudson.apache.org/hudson/job/CXF-Trunk-JDK15/ws/trunk/rt/transports/http/target/cxf-rt-transports-http-2.4.0-SNAPSHOT.jar>
to <https://hudson.apache.org/hudson/job/CXF-Trunk-JDK15/ws/.repository/org/apache/cxf/cxf-rt-transports-http/2.4.0-SNAPSHOT/cxf-rt-transports-http-2.4.0-SNAPSHOT.jar>
[JENKINS] Archiving <https://hudson.apache.org/hudson/job/CXF-Trunk-JDK15/ws/trunk/rt/transports/http/pom.xml>
to /home/hudson/hudson/jobs/CXF-Trunk-JDK15/modules/org.apache.cxf$cxf-rt-transports-http/builds/2011-03-09_12-55-41/archive/org.apache.cxf/cxf-rt-transports-http/2.4.0-SNAPSHOT/pom.xml
[JENKINS] Archiving <https://hudson.apache.org/hudson/job/CXF-Trunk-JDK15/ws/trunk/rt/transports/http/target/cxf-rt-transports-http-2.4.0-SNAPSHOT.jar>
to /home/hudson/hudson/jobs/CXF-Trunk-JDK15/modules/org.apache.cxf$cxf-rt-transports-http/builds/2011-03-09_12-55-41/archive/org.apache.cxf/cxf-rt-transports-http/2.4.0-SNAPSHOT/cxf-rt-transports-http-2.4.0-SNAPSHOT.jar
[INFO] ------------------------------------------------------------------------
[INFO] Building Apache CXF Runtime HTTP Jetty Transport
[INFO]    task-segment: [clean, install]
[INFO] ------------------------------------------------------------------------
[INFO] [clean:clean {execution: default-clean}]
[INFO] Deleting <https://hudson.apache.org/hudson/job/CXF-Trunk-JDK15/ws/trunk/rt/transports/http-jetty/target>
[INFO] [cxf-xml2fastinfoset:xml2fastinfoset {execution: xml2fastinfoset}]
[INFO] [cxf-xjc:xsdtojava {execution: generate-sources}]
[ERROR] src-resolve: Cannot resolve the name 'sec:TLSServerParametersType' to a(n) 'type definition'
component.
  line 74 of <https://hudson.apache.org/hudson/job/CXF-Trunk-JDK15/ws/trunk/rt/transports/http-jetty/src/main/resources/schemas/configuration/http-jetty.xsd>

Failed to parse a schema.
[INFO] [remote-resources:process {execution: default}]
Downloading: http://repository.apache.org/snapshots/org/apache/neethi/neethi/3.0.0-SNAPSHOT/neethi-3.0.0-SNAPSHOT.jar
[INFO] [resources:resources {execution: default-resources}]
[INFO] Using 'UTF-8' encoding to copy filtered resources.
[INFO] Copying 2 resources
[INFO] Copying 5 resources
[INFO] skip non existing resourceDirectory <https://hudson.apache.org/hudson/job/CXF-Trunk-JDK15/ws/trunk/rt/transports/http-jetty/src/main/resources-filtered>
[INFO] Copying 1 resource
[INFO] Copying 3 resources
Downloading: http://repository.apache.org/snapshots/org/apache/neethi/neethi/3.0.0-SNAPSHOT/neethi-3.0.0-SNAPSHOT.jar
[INFO] [compiler:compile {execution: default-compile}]
[INFO] Compiling 17 source files to <https://hudson.apache.org/hudson/job/CXF-Trunk-JDK15/ws/trunk/rt/transports/http-jetty/target/classes>
[INFO] -------------------------------------------------------------
[ERROR] COMPILATION ERROR : 
[INFO] -------------------------------------------------------------
[ERROR] <https://hudson.apache.org/hudson/job/CXF-Trunk-JDK15/ws/trunk/rt/transports/http-jetty/src/main/java/org/apache/cxf/transport/http_jetty/spring/JettySpringTypesFactory.java>:[42,58]
package org.apache.cxf.transports.http_jetty.configuration does not exist
[ERROR] <https://hudson.apache.org/hudson/job/CXF-Trunk-JDK15/ws/trunk/rt/transports/http-jetty/src/main/java/org/apache/cxf/transport/http_jetty/spring/JettySpringTypesFactory.java>:[43,58]
package org.apache.cxf.transports.http_jetty.configuration does not exist
[ERROR] <https://hudson.apache.org/hudson/job/CXF-Trunk-JDK15/ws/trunk/rt/transports/http-jetty/src/main/java/org/apache/cxf/transport/http_jetty/spring/JettySpringTypesFactory.java>:[44,58]
package org.apache.cxf.transports.http_jetty.configuration does not exist
[ERROR] <https://hudson.apache.org/hudson/job/CXF-Trunk-JDK15/ws/trunk/rt/transports/http-jetty/src/main/java/org/apache/cxf/transport/http_jetty/spring/JettySpringTypesFactory.java>:[52,14]
cannot find symbol
symbol  : class ThreadingParametersIdentifiedType
location: class org.apache.cxf.transport.http_jetty.spring.JettySpringTypesFactory
[ERROR] <https://hudson.apache.org/hudson/job/CXF-Trunk-JDK15/ws/trunk/rt/transports/http-jetty/src/main/java/org/apache/cxf/transport/http_jetty/spring/JettySpringTypesFactory.java>:[61,61]
cannot find symbol
symbol  : class ThreadingParametersType
location: class org.apache.cxf.transport.http_jetty.spring.JettySpringTypesFactory
[ERROR] <https://hudson.apache.org/hudson/job/CXF-Trunk-JDK15/ws/trunk/rt/transports/http-jetty/src/main/java/org/apache/cxf/transport/http_jetty/spring/JettySpringTypesFactory.java>:[69,14]
cannot find symbol
symbol  : class TLSServerParametersIdentifiedType
location: class org.apache.cxf.transport.http_jetty.spring.JettySpringTypesFactory
[ERROR] <https://hudson.apache.org/hudson/job/CXF-Trunk-JDK15/ws/trunk/rt/transports/http-jetty/src/main/java/org/apache/cxf/transport/http_jetty/spring/JettyHTTPServerEngineBeanDefinitionParser.java>:[42,58]
package org.apache.cxf.transports.http_jetty.configuration does not exist
[ERROR] <https://hudson.apache.org/hudson/job/CXF-Trunk-JDK15/ws/trunk/rt/transports/http-jetty/src/main/java/org/apache/cxf/transport/http_jetty/spring/JettyHTTPServerEngineBeanDefinitionParser.java>:[43,58]
package org.apache.cxf.transports.http_jetty.configuration does not exist
[ERROR] <https://hudson.apache.org/hudson/job/CXF-Trunk-JDK15/ws/trunk/rt/transports/http-jetty/src/main/java/org/apache/cxf/transport/http_jetty/spring/JettyHTTPServerEngineBeanDefinitionParser.java>:[44,58]
package org.apache.cxf.transports.http_jetty.configuration does not exist
[ERROR] <https://hudson.apache.org/hudson/job/CXF-Trunk-JDK15/ws/trunk/rt/transports/http-jetty/src/main/java/org/apache/cxf/transport/http_jetty/spring/JettyHTTPServerEngineBeanDefinitionParser.java>:[129,36]
cannot find symbol
symbol  : class ThreadingParametersType
location: class org.apache.cxf.transport.http_jetty.spring.JettyHTTPServerEngineBeanDefinitionParser
[ERROR] <https://hudson.apache.org/hudson/job/CXF-Trunk-JDK15/ws/trunk/rt/transports/http-jetty/src/main/java/org/apache/cxf/transport/http_jetty/spring/JettySpringTypesFactory.java>:[54,13]
cannot find symbol
symbol  : class ThreadingParametersIdentifiedType
location: class org.apache.cxf.transport.http_jetty.spring.JettySpringTypesFactory
[ERROR] <https://hudson.apache.org/hudson/job/CXF-Trunk-JDK15/ws/trunk/rt/transports/http-jetty/src/main/java/org/apache/cxf/transport/http_jetty/spring/JettySpringTypesFactory.java>:[71,13]
cannot find symbol
symbol  : class TLSServerParametersIdentifiedType
location: class org.apache.cxf.transport.http_jetty.spring.JettySpringTypesFactory
[ERROR] <https://hudson.apache.org/hudson/job/CXF-Trunk-JDK15/ws/trunk/rt/transports/http-jetty/src/main/java/org/apache/cxf/transport/http_jetty/spring/JettySpringTypesFactory.java>:[86,14]
cannot find symbol
symbol  : class ThreadingParametersIdentifiedType
location: class org.apache.cxf.transport.http_jetty.spring.JettySpringTypesFactory
[ERROR] <https://hudson.apache.org/hudson/job/CXF-Trunk-JDK15/ws/trunk/rt/transports/http-jetty/src/main/java/org/apache/cxf/transport/http_jetty/spring/JettySpringTypesFactory.java>:[91,34]
cannot find symbol
symbol  : class ThreadingParametersIdentifiedType
location: class org.apache.cxf.transport.http_jetty.spring.JettySpringTypesFactory
[ERROR] <https://hudson.apache.org/hudson/job/CXF-Trunk-JDK15/ws/trunk/rt/transports/http-jetty/src/main/java/org/apache/cxf/transport/http_jetty/spring/JettySpringTypesFactory.java>:[101,14]
cannot find symbol
symbol  : class TLSServerParametersIdentifiedType
location: class org.apache.cxf.transport.http_jetty.spring.JettySpringTypesFactory
[ERROR] <https://hudson.apache.org/hudson/job/CXF-Trunk-JDK15/ws/trunk/rt/transports/http-jetty/src/main/java/org/apache/cxf/transport/http_jetty/spring/JettySpringTypesFactory.java>:[106,34]
cannot find symbol
symbol  : class TLSServerParametersIdentifiedType
location: class org.apache.cxf.transport.http_jetty.spring.JettySpringTypesFactory
[ERROR] <https://hudson.apache.org/hudson/job/CXF-Trunk-JDK15/ws/trunk/rt/transports/http-jetty/src/main/java/org/apache/cxf/transport/http_jetty/spring/JettyHTTPServerEngineBeanDefinitionParser.java>:[224,8]
cannot find symbol
symbol  : class TLSServerParametersIdentifiedType
location: class org.apache.cxf.transport.http_jetty.spring.JettyHTTPServerEngineBeanDefinitionParser
[ERROR] <https://hudson.apache.org/hudson/job/CXF-Trunk-JDK15/ws/trunk/rt/transports/http-jetty/src/main/java/org/apache/cxf/transport/http_jetty/spring/JettyHTTPServerEngineBeanDefinitionParser.java>:[225,40]
cannot find symbol
symbol  : class TLSServerParametersIdentifiedType
location: class org.apache.cxf.transport.http_jetty.spring.JettyHTTPServerEngineBeanDefinitionParser
[ERROR] <https://hudson.apache.org/hudson/job/CXF-Trunk-JDK15/ws/trunk/rt/transports/http-jetty/src/main/java/org/apache/cxf/transport/http_jetty/spring/JettyHTTPServerEngineBeanDefinitionParser.java>:[232,8]
cannot find symbol
symbol  : class ThreadingParametersType
location: class org.apache.cxf.transport.http_jetty.spring.JettyHTTPServerEngineBeanDefinitionParser
[ERROR] <https://hudson.apache.org/hudson/job/CXF-Trunk-JDK15/ws/trunk/rt/transports/http-jetty/src/main/java/org/apache/cxf/transport/http_jetty/spring/JettyHTTPServerEngineBeanDefinitionParser.java>:[233,72]
cannot find symbol
symbol  : class ThreadingParametersType
location: class org.apache.cxf.transport.http_jetty.spring.JettyHTTPServerEngineBeanDefinitionParser
[ERROR] <https://hudson.apache.org/hudson/job/CXF-Trunk-JDK15/ws/trunk/rt/transports/http-jetty/src/main/java/org/apache/cxf/transport/http_jetty/spring/JettyHTTPServerEngineBeanDefinitionParser.java>:[239,8]
cannot find symbol
symbol  : class ThreadingParametersIdentifiedType
location: class org.apache.cxf.transport.http_jetty.spring.JettyHTTPServerEngineBeanDefinitionParser
[ERROR] <https://hudson.apache.org/hudson/job/CXF-Trunk-JDK15/ws/trunk/rt/transports/http-jetty/src/main/java/org/apache/cxf/transport/http_jetty/spring/JettyHTTPServerEngineBeanDefinitionParser.java>:[240,40]
cannot find symbol
symbol  : class ThreadingParametersIdentifiedType
location: class org.apache.cxf.transport.http_jetty.spring.JettyHTTPServerEngineBeanDefinitionParser
[INFO] 22 errors 
[INFO] -------------------------------------------------------------
[JENKINS] Archiving <https://hudson.apache.org/hudson/job/CXF-Trunk-JDK15/ws/trunk/rt/transports/http-jetty/pom.xml>
to /home/hudson/hudson/jobs/CXF-Trunk-JDK15/modules/org.apache.cxf$cxf-rt-transports-http-jetty/builds/2011-03-09_12-55-41/archive/org.apache.cxf/cxf-rt-transports-http-jetty/2.4.0-SNAPSHOT/pom.xml
[INFO] ------------------------------------------------------------------------
[ERROR] BUILD FAILURE
[INFO] ------------------------------------------------------------------------
[INFO] Compilation failure

<https://hudson.apache.org/hudson/job/CXF-Trunk-JDK15/ws/trunk/rt/transports/http-jetty/src/main/java/org/apache/cxf/transport/http_jetty/spring/JettySpringTypesFactory.java>:[42,58]
package org.apache.cxf.transports.http_jetty.configuration does not exist
<https://hudson.apache.org/hudson/job/CXF-Trunk-JDK15/ws/trunk/rt/transports/http-jetty/src/main/java/org/apache/cxf/transport/http_jetty/spring/JettySpringTypesFactory.java>:[43,58]
package org.apache.cxf.transports.http_jetty.configuration does not exist
<https://hudson.apache.org/hudson/job/CXF-Trunk-JDK15/ws/trunk/rt/transports/http-jetty/src/main/java/org/apache/cxf/transport/http_jetty/spring/JettySpringTypesFactory.java>:[44,58]
package org.apache.cxf.transports.http_jetty.configuration does not exist
<https://hudson.apache.org/hudson/job/CXF-Trunk-JDK15/ws/trunk/rt/transports/http-jetty/src/main/java/org/apache/cxf/transport/http_jetty/spring/JettySpringTypesFactory.java>:[52,14]
cannot find symbol
symbol  : class ThreadingParametersIdentifiedType
location: class org.apache.cxf.transport.http_jetty.spring.JettySpringTypesFactory
<https://hudson.apache.org/hudson/job/CXF-Trunk-JDK15/ws/trunk/rt/transports/http-jetty/src/main/java/org/apache/cxf/transport/http_jetty/spring/JettySpringTypesFactory.java>:[61,61]
cannot find symbol
symbol  : class ThreadingParametersType
location: class org.apache.cxf.transport.http_jetty.spring.JettySpringTypesFactory
<https://hudson.apache.org/hudson/job/CXF-Trunk-JDK15/ws/trunk/rt/transports/http-jetty/src/main/java/org/apache/cxf/transport/http_jetty/spring/JettySpringTypesFactory.java>:[69,14]
cannot find symbol
symbol  : class TLSServerParametersIdentifiedType
location: class org.apache.cxf.transport.http_jetty.spring.JettySpringTypesFactory
<https://hudson.apache.org/hudson/job/CXF-Trunk-JDK15/ws/trunk/rt/transports/http-jetty/src/main/java/org/apache/cxf/transport/http_jetty/spring/JettyHTTPServerEngineBeanDefinitionParser.java>:[42,58]
package org.apache.cxf.transports.http_jetty.configuration does not exist
<https://hudson.apache.org/hudson/job/CXF-Trunk-JDK15/ws/trunk/rt/transports/http-jetty/src/main/java/org/apache/cxf/transport/http_jetty/spring/JettyHTTPServerEngineBeanDefinitionParser.java>:[43,58]
package org.apache.cxf.transports.http_jetty.configuration does not exist
<https://hudson.apache.org/hudson/job/CXF-Trunk-JDK15/ws/trunk/rt/transports/http-jetty/src/main/java/org/apache/cxf/transport/http_jetty/spring/JettyHTTPServerEngineBeanDefinitionParser.java>:[44,58]
package org.apache.cxf.transports.http_jetty.configuration does not exist
<https://hudson.apache.org/hudson/job/CXF-Trunk-JDK15/ws/trunk/rt/transports/http-jetty/src/main/java/org/apache/cxf/transport/http_jetty/spring/JettyHTTPServerEngineBeanDefinitionParser.java>:[129,36]
cannot find symbol
symbol  : class ThreadingParametersType
location: class org.apache.cxf.transport.http_jetty.spring.JettyHTTPServerEngineBeanDefinitionParser
<https://hudson.apache.org/hudson/job/CXF-Trunk-JDK15/ws/trunk/rt/transports/http-jetty/src/main/java/org/apache/cxf/transport/http_jetty/spring/JettySpringTypesFactory.java>:[54,13]
cannot find symbol
symbol  : class ThreadingParametersIdentifiedType
location: class org.apache.cxf.transport.http_jetty.spring.JettySpringTypesFactory
<https://hudson.apache.org/hudson/job/CXF-Trunk-JDK15/ws/trunk/rt/transports/http-jetty/src/main/java/org/apache/cxf/transport/http_jetty/spring/JettySpringTypesFactory.java>:[71,13]
cannot find symbol
symbol  : class TLSServerParametersIdentifiedType
location: class org.apache.cxf.transport.http_jetty.spring.JettySpringTypesFactory
<https://hudson.apache.org/hudson/job/CXF-Trunk-JDK15/ws/trunk/rt/transports/http-jetty/src/main/java/org/apache/cxf/transport/http_jetty/spring/JettySpringTypesFactory.java>:[86,14]
cannot find symbol
symbol  : class ThreadingParametersIdentifiedType
location: class org.apache.cxf.transport.http_jetty.spring.JettySpringTypesFactory
<https://hudson.apache.org/hudson/job/CXF-Trunk-JDK15/ws/trunk/rt/transports/http-jetty/src/main/java/org/apache/cxf/transport/http_jetty/spring/JettySpringTypesFactory.java>:[91,34]
cannot find symbol
symbol  : class ThreadingParametersIdentifiedType
location: class org.apache.cxf.transport.http_jetty.spring.JettySpringTypesFactory
<https://hudson.apache.org/hudson/job/CXF-Trunk-JDK15/ws/trunk/rt/transports/http-jetty/src/main/java/org/apache/cxf/transport/http_jetty/spring/JettySpringTypesFactory.java>:[101,14]
cannot find symbol
symbol  : class TLSServerParametersIdentifiedType
location: class org.apache.cxf.transport.http_jetty.spring.JettySpringTypesFactory
<https://hudson.apache.org/hudson/job/CXF-Trunk-JDK15/ws/trunk/rt/transports/http-jetty/src/main/java/org/apache/cxf/transport/http_jetty/spring/JettySpringTypesFactory.java>:[106,34]
cannot find symbol
symbol  : class TLSServerParametersIdentifiedType
location: class org.apache.cxf.transport.http_jetty.spring.JettySpringTypesFactory
<https://hudson.apache.org/hudson/job/CXF-Trunk-JDK15/ws/trunk/rt/transports/http-jetty/src/main/java/org/apache/cxf/transport/http_jetty/spring/JettyHTTPServerEngineBeanDefinitionParser.java>:[224,8]
cannot find symbol
symbol  : class TLSServerParametersIdentifiedType
location: class org.apache.cxf.transport.http_jetty.spring.JettyHTTPServerEngineBeanDefinitionParser
<https://hudson.apache.org/hudson/job/CXF-Trunk-JDK15/ws/trunk/rt/transports/http-jetty/src/main/java/org/apache/cxf/transport/http_jetty/spring/JettyHTTPServerEngineBeanDefinitionParser.java>:[225,40]
cannot find symbol
symbol  : class TLSServerParametersIdentifiedType
location: class org.apache.cxf.transport.http_jetty.spring.JettyHTTPServerEngineBeanDefinitionParser
<https://hudson.apache.org/hudson/job/CXF-Trunk-JDK15/ws/trunk/rt/transports/http-jetty/src/main/java/org/apache/cxf/transport/http_jetty/spring/JettyHTTPServerEngineBeanDefinitionParser.java>:[232,8]
cannot find symbol
symbol  : class ThreadingParametersType
location: class org.apache.cxf.transport.http_jetty.spring.JettyHTTPServerEngineBeanDefinitionParser
<https://hudson.apache.org/hudson/job/CXF-Trunk-JDK15/ws/trunk/rt/transports/http-jetty/src/main/java/org/apache/cxf/transport/http_jetty/spring/JettyHTTPServerEngineBeanDefinitionParser.java>:[233,72]
cannot find symbol
symbol  : class ThreadingParametersType
location: class org.apache.cxf.transport.http_jetty.spring.JettyHTTPServerEngineBeanDefinitionParser
<https://hudson.apache.org/hudson/job/CXF-Trunk-JDK15/ws/trunk/rt/transports/http-jetty/src/main/java/org/apache/cxf/transport/http_jetty/spring/JettyHTTPServerEngineBeanDefinitionParser.java>:[239,8]
cannot find symbol
symbol  : class ThreadingParametersIdentifiedType
location: class org.apache.cxf.transport.http_jetty.spring.JettyHTTPServerEngineBeanDefinitionParser
<https://hudson.apache.org/hudson/job/CXF-Trunk-JDK15/ws/trunk/rt/transports/http-jetty/src/main/java/org/apache/cxf/transport/http_jetty/spring/JettyHTTPServerEngineBeanDefinitionParser.java>:[240,40]
cannot find symbol
symbol  : class ThreadingParametersIdentifiedType
location: class org.apache.cxf.transport.http_jetty.spring.JettyHTTPServerEngineBeanDefinitionParser

[INFO] ------------------------------------------------------------------------
[INFO] Trace
org.apache.maven.BuildFailureException: Compilation failure
	at org.apache.maven.lifecycle.DefaultLifecycleExecutor.executeGoals(DefaultLifecycleExecutor.java:715)
	at org.apache.maven.lifecycle.DefaultLifecycleExecutor.executeGoalWithLifecycle(DefaultLifecycleExecutor.java:556)
	at org.apache.maven.lifecycle.DefaultLifecycleExecutor.executeGoal(DefaultLifecycleExecutor.java:535)
	at org.apache.maven.lifecycle.DefaultLifecycleExecutor.executeGoalAndHandleFailures(DefaultLifecycleExecutor.java:387)
	at org.apache.maven.lifecycle.DefaultLifecycleExecutor.executeTaskSegments(DefaultLifecycleExecutor.java:348)
	at org.apache.maven.lifecycle.DefaultLifecycleExecutor.execute(DefaultLifecycleExecutor.java:180)
	at org.apache.maven.lifecycle.LifecycleExecutorInterceptor.execute(LifecycleExecutorInterceptor.java:65)
	at org.apache.maven.DefaultMaven.doExecute(DefaultMaven.java:328)
	at org.apache.maven.DefaultMaven.execute(DefaultMaven.java:138)
	at org.apache.maven.cli.MavenCli.main(MavenCli.java:362)
	at sun.reflect.NativeMethodAccessorImpl.invoke0(Native Method)
	at sun.reflect.NativeMethodAccessorImpl.invoke(NativeMethodAccessorImpl.java:39)
	at sun.reflect.DelegatingMethodAccessorImpl.invoke(DelegatingMethodAccessorImpl.java:25)
	at java.lang.reflect.Method.invoke(Method.java:592)
	at org.codehaus.classworlds.Launcher.launchEnhanced(Launcher.java:315)
	at org.codehaus.classworlds.Launcher.launch(Launcher.java:255)
	at hudson.maven.agent.Main.launch(Main.java:173)
	at hudson.maven.MavenBuilder.call(MavenBuilder.java:164)
	at hudson.maven.MavenModuleSetBuild$Builder.call(MavenModuleSetBuild.java:872)
	at hudson.maven.MavenModuleSetBuild$Builder.call(MavenModuleSetBuild.java:803)
	at hudson.remoting.UserRequest.perform(UserRequest.java:114)
	at hudson.remoting.UserRequest.perform(UserRequest.java:48)
	at hudson.remoting.Request$2.run(Request.java:270)
	at java.util.concurrent.Executors$RunnableAdapter.call(Executors.java:417)
	at java.util.concurrent.FutureTask$Sync.innerRun(FutureTask.java:269)
	at java.util.concurrent.FutureTask.run(FutureTask.java:123)
	at java.util.concurrent.ThreadPoolExecutor$Worker.runTask(ThreadPoolExecutor.java:651)
	at java.util.concurrent.ThreadPoolExecutor$Worker.run(ThreadPoolExecutor.java:676)
	at java.lang.Thread.run(Thread.java:595)
Caused by: org.apache.maven.plugin.CompilationFailureException: Compilation failure
	at org.apache.maven.plugin.AbstractCompilerMojo.execute(AbstractCompilerMojo.java:656)
	at org.apache.maven.plugin.CompilerMojo.execute(CompilerMojo.java:128)
	at org.apache.maven.plugin.DefaultPluginManager.executeMojo(DefaultPluginManager.java:490)
	at hudson.maven.agent.PluginManagerInterceptor.executeMojo(PluginManagerInterceptor.java:182)
	at org.apache.maven.lifecycle.DefaultLifecycleExecutor.executeGoals(DefaultLifecycleExecutor.java:694)
	... 28 more
[INFO] ------------------------------------------------------------------------
[INFO] Total time: 3 minutes 25 seconds
[INFO] Finished at: Wed Mar 09 04:59:34 GMT-08:00 2011
[INFO] Final Memory: 86M/136M
[INFO] ------------------------------------------------------------------------
Sending e-mails to: notifications@cxf.apache.org
channel stopped
[locks-and-latches] Releasing all the locks
[locks-and-latches] All the locks released


Mime
View raw message