cxf-notifications mailing list archives

Site index · List index
Message view « Date » · « Thread »
Top « Date » · « Thread »
From Apache Hudson Server <hud...@hudson.apache.org>
Subject Build failed in Jenkins: CXF-trunk-windows #76
Date Sun, 27 Mar 2011 22:08:51 GMT
See <https://hudson.apache.org/hudson/job/CXF-trunk-windows/76/changes>

Changes:

[cschneider] CXF-3419 Created new HttpTransportFactory that replaces http client only, http
jetty, http osgi and http servlet transport. Some broken jaxrs tests remain and the destinationRegistry
is not yet correctly pulled in osgi

------------------------------------------
[...truncated 1532 lines...]

[JENKINS] Recording test results
Downloading: http://repository.apache.org/snapshots//org/apache/neethi/neethi/3.0.0-SNAPSHOT/neethi-3.0.0-SNAPSHOT.jar
[INFO] [jar:jar {execution: default-jar}]
[INFO] Building jar: C:\hudson\hudson-slave\workspace\CXF-trunk-windows\trunk w spaces\rt\transports\http\target\cxf-rt-transports-http-2.4.0-SNAPSHOT.jar
[INFO] [install:install {execution: default-install}]
[INFO] Installing C:\hudson\hudson-slave\workspace\CXF-trunk-windows\trunk w spaces\rt\transports\http\target\cxf-rt-transports-http-2.4.0-SNAPSHOT.jar
to <https://hudson.apache.org/hudson/job/CXF-trunk-windows/ws/.repository\org\apache\cxf\cxf-rt-transports-http\2.4.0-SNAPSHOT\cxf-rt-transports-http-2.4.0-SNAPSHOT.jar>
[JENKINS] Archiving disabled - not archiving C:\hudson\hudson-slave\workspace\CXF-trunk-windows\trunk
w spaces\rt\transports\http\pom.xml
[JENKINS] Archiving disabled - not archiving C:\hudson\hudson-slave\workspace\CXF-trunk-windows\trunk
w spaces\rt\transports\http\target\cxf-rt-transports-http-2.4.0-SNAPSHOT.jar
[INFO] ------------------------------------------------------------------------
[INFO] Building Apache CXF Runtime HTTP Jetty Transport
[INFO]    task-segment: [clean, install]
[INFO] ------------------------------------------------------------------------
[INFO] [clean:clean {execution: default-clean}]
[INFO] Deleting C:\hudson\hudson-slave\workspace\CXF-trunk-windows\trunk w spaces\rt\transports\http-jetty\target
[INFO] [cxf-xml2fastinfoset:xml2fastinfoset {execution: xml2fastinfoset}]
[INFO] [cxf-xjc:xsdtojava {execution: generate-sources}]
[INFO] [remote-resources:process {execution: default}]
Downloading: http://repository.apache.org/snapshots//org/apache/neethi/neethi/3.0.0-SNAPSHOT/neethi-3.0.0-SNAPSHOT.jar
[INFO] [resources:resources {execution: default-resources}]
[INFO] Using 'UTF-8' encoding to copy filtered resources.
[INFO] Copying 2 resources
[INFO] Copying 5 resources
[INFO] skip non existing resourceDirectory C:\hudson\hudson-slave\workspace\CXF-trunk-windows\trunk
w spaces\rt\transports\http-jetty\src\main\resources-filtered
[INFO] Copying 1 resource
[INFO] Copying 3 resources
Downloading: http://repository.apache.org/snapshots//org/apache/neethi/neethi/3.0.0-SNAPSHOT/neethi-3.0.0-SNAPSHOT.jar
[INFO] [compiler:compile {execution: default-compile}]
[INFO] Compiling 25 source files to C:\hudson\hudson-slave\workspace\CXF-trunk-windows\trunk
w spaces\rt\transports\http-jetty\target\classes
[INFO] [resources:testResources {execution: default-testResources}]
[INFO] Using 'UTF-8' encoding to copy filtered resources.
[INFO] Copying 9 resources
[INFO] skip non existing resourceDirectory C:\hudson\hudson-slave\workspace\CXF-trunk-windows\trunk
w spaces\rt\transports\http-jetty\src\test\resources
[INFO] skip non existing resourceDirectory C:\hudson\hudson-slave\workspace\CXF-trunk-windows\trunk
w spaces\rt\transports\http-jetty\target\generated\src\test\resources
[INFO] Copying 3 resources
Downloading: http://repository.apache.org/snapshots//org/apache/neethi/neethi/3.0.0-SNAPSHOT/neethi-3.0.0-SNAPSHOT.jar
[INFO] [compiler:testCompile {execution: default-testCompile}]
[INFO] Compiling 7 source files to C:\hudson\hudson-slave\workspace\CXF-trunk-windows\trunk
w spaces\rt\transports\http-jetty\target\test-classes
Downloading: http://repository.apache.org/snapshots//org/apache/neethi/neethi/3.0.0-SNAPSHOT/neethi-3.0.0-SNAPSHOT.jar
[INFO] [surefire:test {execution: default-test}]
[INFO] Surefire report directory: C:\hudson\hudson-slave\workspace\CXF-trunk-windows\trunk
w spaces\rt\transports\http-jetty\target\surefire-reports

-------------------------------------------------------
 T E S T S
-------------------------------------------------------
Running org.apache.cxf.transport.http_jetty.JettyContextInspectorTest
Tests run: 1, Failures: 0, Errors: 0, Skipped: 0, Time elapsed: 0.472 sec
Running org.apache.cxf.transport.http_jetty.JettyHTTPDestinationTest
Tests run: 21, Failures: 0, Errors: 0, Skipped: 0, Time elapsed: 0.95 sec
Running org.apache.cxf.transport.http_jetty.JettyHTTPServerEngineFactoryTest
Tests run: 3, Failures: 0, Errors: 0, Skipped: 0, Time elapsed: 2.062 sec
Running org.apache.cxf.transport.http_jetty.JettyHTTPServerEngineTest
Tests run: 8, Failures: 0, Errors: 0, Skipped: 0, Time elapsed: 1.443 sec
Running org.apache.cxf.transport.http_jetty.spring.ApplicationContextTest
Tests run: 3, Failures: 0, Errors: 0, Skipped: 0, Time elapsed: 0.951 sec
Running org.apache.cxf.transport.http_jetty.spring.BeanDefinitionParsersTest
Tests run: 1, Failures: 0, Errors: 0, Skipped: 1, Time elapsed: 0.001 sec

Results :

Tests run: 37, Failures: 0, Errors: 0, Skipped: 1

[JENKINS] Recording test results
Downloading: http://repository.apache.org/snapshots//org/apache/neethi/neethi/3.0.0-SNAPSHOT/neethi-3.0.0-SNAPSHOT.jar
[INFO] [jar:jar {execution: default-jar}]
[INFO] Building jar: C:\hudson\hudson-slave\workspace\CXF-trunk-windows\trunk w spaces\rt\transports\http-jetty\target\cxf-rt-transports-http-jetty-2.4.0-SNAPSHOT.jar
[INFO] [install:install {execution: default-install}]
[INFO] Installing C:\hudson\hudson-slave\workspace\CXF-trunk-windows\trunk w spaces\rt\transports\http-jetty\target\cxf-rt-transports-http-jetty-2.4.0-SNAPSHOT.jar
to <https://hudson.apache.org/hudson/job/CXF-trunk-windows/ws/.repository\org\apache\cxf\cxf-rt-transports-http-jetty\2.4.0-SNAPSHOT\cxf-rt-transports-http-jetty-2.4.0-SNAPSHOT.jar>
[JENKINS] Archiving disabled - not archiving C:\hudson\hudson-slave\workspace\CXF-trunk-windows\trunk
w spaces\rt\transports\http-jetty\pom.xml
[JENKINS] Archiving disabled - not archiving C:\hudson\hudson-slave\workspace\CXF-trunk-windows\trunk
w spaces\rt\transports\http-jetty\target\cxf-rt-transports-http-jetty-2.4.0-SNAPSHOT.jar
[INFO] ------------------------------------------------------------------------
[INFO] Building Apache CXF Runtime WS Addressing
[INFO]    task-segment: [clean, install]
[INFO] ------------------------------------------------------------------------
[INFO] [clean:clean {execution: default-clean}]
[INFO] Deleting C:\hudson\hudson-slave\workspace\CXF-trunk-windows\trunk w spaces\rt\ws\addr\target
[INFO] [cxf-xml2fastinfoset:xml2fastinfoset {execution: xml2fastinfoset}]
[INFO] [remote-resources:process {execution: default}]
Downloading: http://repository.apache.org/snapshots//org/apache/neethi/neethi/3.0.0-SNAPSHOT/neethi-3.0.0-SNAPSHOT.jar
[INFO] [resources:resources {execution: default-resources}]
[INFO] Using 'UTF-8' encoding to copy filtered resources.
[INFO] Copying 3 resources
[INFO] Copying 6 resources
[INFO] skip non existing resourceDirectory C:\hudson\hudson-slave\workspace\CXF-trunk-windows\trunk
w spaces\rt\ws\addr\src\main\resources-filtered
[INFO] Copying 1 resource
[INFO] Copying 3 resources
Downloading: http://repository.apache.org/snapshots//org/apache/neethi/neethi/3.0.0-SNAPSHOT/neethi-3.0.0-SNAPSHOT.jar
[INFO] [compiler:compile {execution: default-compile}]
[INFO] Compiling 20 source files to C:\hudson\hudson-slave\workspace\CXF-trunk-windows\trunk
w spaces\rt\ws\addr\target\classes
[INFO] [resources:testResources {execution: default-testResources}]
[INFO] Using 'UTF-8' encoding to copy filtered resources.
[INFO] Copying 1 resource
[INFO] skip non existing resourceDirectory C:\hudson\hudson-slave\workspace\CXF-trunk-windows\trunk
w spaces\rt\ws\addr\src\test\resources
[INFO] skip non existing resourceDirectory C:\hudson\hudson-slave\workspace\CXF-trunk-windows\trunk
w spaces\rt\ws\addr\target\generated\src\test\resources
[INFO] Copying 3 resources
Downloading: http://repository.apache.org/snapshots//org/apache/neethi/neethi/3.0.0-SNAPSHOT/neethi-3.0.0-SNAPSHOT.jar
[INFO] [compiler:testCompile {execution: default-testCompile}]
[INFO] Compiling 7 source files to C:\hudson\hudson-slave\workspace\CXF-trunk-windows\trunk
w spaces\rt\ws\addr\target\test-classes
Downloading: http://repository.apache.org/snapshots//org/apache/neethi/neethi/3.0.0-SNAPSHOT/neethi-3.0.0-SNAPSHOT.jar
[INFO] [surefire:test {execution: default-test}]
[INFO] Surefire report directory: C:\hudson\hudson-slave\workspace\CXF-trunk-windows\trunk
w spaces\rt\ws\addr\target\surefire-reports

-------------------------------------------------------
 T E S T S
-------------------------------------------------------
Running org.apache.cxf.ws.addressing.AddressingBuilderImplTest
Tests run: 2, Failures: 0, Errors: 0, Skipped: 0, Time elapsed: 0.209 sec
Running org.apache.cxf.ws.addressing.AddressingBuilderTest
Tests run: 1, Failures: 0, Errors: 0, Skipped: 0, Time elapsed: 0.002 sec
Running org.apache.cxf.ws.addressing.AddressingConstantsImplTest
Tests run: 31, Failures: 0, Errors: 0, Skipped: 0, Time elapsed: 0.039 sec
Running org.apache.cxf.ws.addressing.MAPAggregatorTest
Tests run: 29, Failures: 0, Errors: 0, Skipped: 0, Time elapsed: 0.95 sec
Running org.apache.cxf.ws.addressing.VersionTransformerTest
Tests run: 1, Failures: 0, Errors: 0, Skipped: 0, Time elapsed: 1.295 sec
Running org.apache.cxf.ws.addressing.soap.MAPCodecTest
Tests run: 18, Failures: 0, Errors: 0, Skipped: 0, Time elapsed: 0.163 sec
Running org.apache.cxf.ws.addressing.soap.OneWayDecoupledFaultHandlerTest
Tests run: 1, Failures: 0, Errors: 0, Skipped: 0, Time elapsed: 0.002 sec

Results :

Tests run: 83, Failures: 0, Errors: 0, Skipped: 0

[JENKINS] Recording test results
Downloading: http://repository.apache.org/snapshots//org/apache/neethi/neethi/3.0.0-SNAPSHOT/neethi-3.0.0-SNAPSHOT.jar
[INFO] [jar:jar {execution: default-jar}]
[INFO] Building jar: C:\hudson\hudson-slave\workspace\CXF-trunk-windows\trunk w spaces\rt\ws\addr\target\cxf-rt-ws-addr-2.4.0-SNAPSHOT.jar
[INFO] [install:install {execution: default-install}]
[INFO] Installing C:\hudson\hudson-slave\workspace\CXF-trunk-windows\trunk w spaces\rt\ws\addr\target\cxf-rt-ws-addr-2.4.0-SNAPSHOT.jar
to <https://hudson.apache.org/hudson/job/CXF-trunk-windows/ws/.repository\org\apache\cxf\cxf-rt-ws-addr\2.4.0-SNAPSHOT\cxf-rt-ws-addr-2.4.0-SNAPSHOT.jar>
[JENKINS] Archiving disabled - not archiving C:\hudson\hudson-slave\workspace\CXF-trunk-windows\trunk
w spaces\rt\ws\addr\pom.xml
[JENKINS] Archiving disabled - not archiving C:\hudson\hudson-slave\workspace\CXF-trunk-windows\trunk
w spaces\rt\ws\addr\target\cxf-rt-ws-addr-2.4.0-SNAPSHOT.jar
[INFO] ------------------------------------------------------------------------
[INFO] Building Apache CXF Runtime JAX-WS Frontend
[INFO]    task-segment: [clean, install]
[INFO] ------------------------------------------------------------------------
[INFO] [clean:clean {execution: default-clean}]
[INFO] Deleting C:\hudson\hudson-slave\workspace\CXF-trunk-windows\trunk w spaces\rt\frontend\jaxws\target
[INFO] [cxf-xml2fastinfoset:xml2fastinfoset {execution: xml2fastinfoset}]
[INFO] [build-helper:add-source {execution: add-source}]
[INFO] Source directory: C:\hudson\hudson-slave\workspace\CXF-trunk-windows\trunk w spaces\rt\frontend\jaxws\src\main\generated
added.
[INFO] [build-helper:add-source {execution: add-jaxws22-source}]
[INFO] Source directory: C:\hudson\hudson-slave\workspace\CXF-trunk-windows\trunk w spaces\rt\frontend\jaxws\src\main\jaxws22
added.
[INFO] [remote-resources:process {execution: default}]
Downloading: http://repository.apache.org/snapshots//org/apache/neethi/neethi/3.0.0-SNAPSHOT/neethi-3.0.0-SNAPSHOT.jar
[INFO] [build-helper:add-resource {execution: add-spi}]
[INFO] [resources:resources {execution: default-resources}]
[INFO] Using 'UTF-8' encoding to copy filtered resources.
[INFO] Copying 11 resources
[INFO] Copying 5 resources
[INFO] skip non existing resourceDirectory C:\hudson\hudson-slave\workspace\CXF-trunk-windows\trunk
w spaces\rt\frontend\jaxws\src\main\resources-filtered
[INFO] Copying 1 resource
[INFO] Copying 3 resources
[INFO] Copying 1 resource
Downloading: http://repository.apache.org/snapshots//org/apache/neethi/neethi/3.0.0-SNAPSHOT/neethi-3.0.0-SNAPSHOT.jar
[INFO] [compiler:compile {execution: default-compile}]
[INFO] Compiling 146 source files to C:\hudson\hudson-slave\workspace\CXF-trunk-windows\trunk
w spaces\rt\frontend\jaxws\target\classes
[INFO] -------------------------------------------------------------
[ERROR] COMPILATION ERROR : 
[INFO] -------------------------------------------------------------
[ERROR] \hudson\hudson-slave\workspace\CXF-trunk-windows\trunk w spaces\rt\frontend\jaxws\src\main\jaxws22\org\apache\cxf\transport\http_jaxws_spi\JAXWSHttpSpiTransportFactory.java:[29,37]
cannot find symbol
symbol  : class AbstractHTTPTransportFactory
location: package org.apache.cxf.transport.http
[ERROR] \hudson\hudson-slave\workspace\CXF-trunk-windows\trunk w spaces\rt\frontend\jaxws\src\main\jaxws22\org\apache\cxf\transport\http_jaxws_spi\JAXWSHttpSpiTransportFactory.java:[31,50]
cannot find symbol
symbol: class AbstractHTTPTransportFactory
public class JAXWSHttpSpiTransportFactory extends AbstractHTTPTransportFactory implements
DestinationFactory {
[ERROR] \hudson\hudson-slave\workspace\CXF-trunk-windows\trunk w spaces\rt\frontend\jaxws\src\main\jaxws22\org\apache\cxf\transport\http_jaxws_spi\JAXWSHttpSpiTransportFactory.java:[31,7]
org.apache.cxf.transport.http_jaxws_spi.JAXWSHttpSpiTransportFactory is not abstract and does
not override abstract method getTransportIds() in org.apache.cxf.transport.DestinationFactory
[ERROR] \hudson\hudson-slave\workspace\CXF-trunk-windows\trunk w spaces\rt\frontend\jaxws\src\main\jaxws22\org\apache\cxf\transport\http_jaxws_spi\JAXWSHttpSpiTransportFactory.java:[39,8]
cannot find symbol
symbol  : variable bus
location: class org.apache.cxf.transport.http_jaxws_spi.JAXWSHttpSpiTransportFactory
[ERROR] \hudson\hudson-slave\workspace\CXF-trunk-windows\trunk w spaces\rt\frontend\jaxws\src\main\jaxws22\org\apache\cxf\transport\http_jaxws_spi\JAXWSHttpSpiTransportFactory.java:[44,54]
cannot find symbol
symbol  : method getBus()
location: class org.apache.cxf.transport.http_jaxws_spi.JAXWSHttpSpiTransportFactory
[ERROR] \hudson\hudson-slave\workspace\CXF-trunk-windows\trunk w spaces\rt\frontend\jaxws\src\main\jaxws22\org\apache\cxf\transport\http_jaxws_spi\JAXWSHttpSpiTransportFactory.java:[44,64]
cannot find symbol
symbol  : variable registry
location: class org.apache.cxf.transport.http_jaxws_spi.JAXWSHttpSpiTransportFactory
[ERROR] \hudson\hudson-slave\workspace\CXF-trunk-windows\trunk w spaces\rt\frontend\jaxws\src\main\jaxws22\org\apache\cxf\jaxws22\EndpointImpl.java:[111,25]
setDestinationFactory(org.apache.cxf.transport.DestinationFactory) in org.apache.cxf.endpoint.AbstractEndpointFactory
cannot be applied to (org.apache.cxf.transport.http_jaxws_spi.JAXWSHttpSpiTransportFactory)
[INFO] 7 errors 
[INFO] -------------------------------------------------------------
[JENKINS] Archiving disabled - not archiving C:\hudson\hudson-slave\workspace\CXF-trunk-windows\trunk
w spaces\rt\frontend\jaxws\pom.xml
[INFO] ------------------------------------------------------------------------
[ERROR] BUILD FAILURE
[INFO] ------------------------------------------------------------------------
[INFO] Compilation failure

\hudson\hudson-slave\workspace\CXF-trunk-windows\trunk w spaces\rt\frontend\jaxws\src\main\jaxws22\org\apache\cxf\transport\http_jaxws_spi\JAXWSHttpSpiTransportFactory.java:[29,37]
cannot find symbol
symbol  : class AbstractHTTPTransportFactory
location: package org.apache.cxf.transport.http
\hudson\hudson-slave\workspace\CXF-trunk-windows\trunk w spaces\rt\frontend\jaxws\src\main\jaxws22\org\apache\cxf\transport\http_jaxws_spi\JAXWSHttpSpiTransportFactory.java:[31,50]
cannot find symbol
symbol: class AbstractHTTPTransportFactory
public class JAXWSHttpSpiTransportFactory extends AbstractHTTPTransportFactory implements
DestinationFactory {
\hudson\hudson-slave\workspace\CXF-trunk-windows\trunk w spaces\rt\frontend\jaxws\src\main\jaxws22\org\apache\cxf\transport\http_jaxws_spi\JAXWSHttpSpiTransportFactory.java:[31,7]
org.apache.cxf.transport.http_jaxws_spi.JAXWSHttpSpiTransportFactory is not abstract and does
not override abstract method getTransportIds() in org.apache.cxf.transport.DestinationFactory
\hudson\hudson-slave\workspace\CXF-trunk-windows\trunk w spaces\rt\frontend\jaxws\src\main\jaxws22\org\apache\cxf\transport\http_jaxws_spi\JAXWSHttpSpiTransportFactory.java:[39,8]
cannot find symbol
symbol  : variable bus
location: class org.apache.cxf.transport.http_jaxws_spi.JAXWSHttpSpiTransportFactory
\hudson\hudson-slave\workspace\CXF-trunk-windows\trunk w spaces\rt\frontend\jaxws\src\main\jaxws22\org\apache\cxf\transport\http_jaxws_spi\JAXWSHttpSpiTransportFactory.java:[44,54]
cannot find symbol
symbol  : method getBus()
location: class org.apache.cxf.transport.http_jaxws_spi.JAXWSHttpSpiTransportFactory
\hudson\hudson-slave\workspace\CXF-trunk-windows\trunk w spaces\rt\frontend\jaxws\src\main\jaxws22\org\apache\cxf\transport\http_jaxws_spi\JAXWSHttpSpiTransportFactory.java:[44,64]
cannot find symbol
symbol  : variable registry
location: class org.apache.cxf.transport.http_jaxws_spi.JAXWSHttpSpiTransportFactory
\hudson\hudson-slave\workspace\CXF-trunk-windows\trunk w spaces\rt\frontend\jaxws\src\main\jaxws22\org\apache\cxf\jaxws22\EndpointImpl.java:[111,25]
setDestinationFactory(org.apache.cxf.transport.DestinationFactory) in org.apache.cxf.endpoint.AbstractEndpointFactory
cannot be applied to (org.apache.cxf.transport.http_jaxws_spi.JAXWSHttpSpiTransportFactory)

[INFO] ------------------------------------------------------------------------
[INFO] Trace
org.apache.maven.BuildFailureException: Compilation failure
	at org.apache.maven.lifecycle.DefaultLifecycleExecutor.executeGoals(DefaultLifecycleExecutor.java:715)
	at org.apache.maven.lifecycle.DefaultLifecycleExecutor.executeGoalWithLifecycle(DefaultLifecycleExecutor.java:556)
	at org.apache.maven.lifecycle.DefaultLifecycleExecutor.executeGoal(DefaultLifecycleExecutor.java:535)
	at org.apache.maven.lifecycle.DefaultLifecycleExecutor.executeGoalAndHandleFailures(DefaultLifecycleExecutor.java:387)
	at org.apache.maven.lifecycle.DefaultLifecycleExecutor.executeTaskSegments(DefaultLifecycleExecutor.java:348)
	at org.apache.maven.lifecycle.DefaultLifecycleExecutor.execute(DefaultLifecycleExecutor.java:180)
	at org.apache.maven.lifecycle.LifecycleExecutorInterceptor.execute(LifecycleExecutorInterceptor.java:65)
	at org.apache.maven.DefaultMaven.doExecute(DefaultMaven.java:328)
	at org.apache.maven.DefaultMaven.execute(DefaultMaven.java:138)
	at org.apache.maven.cli.MavenCli.main(MavenCli.java:362)
	at sun.reflect.NativeMethodAccessorImpl.invoke0(Native Method)
	at sun.reflect.NativeMethodAccessorImpl.invoke(NativeMethodAccessorImpl.java:39)
	at sun.reflect.DelegatingMethodAccessorImpl.invoke(DelegatingMethodAccessorImpl.java:25)
	at java.lang.reflect.Method.invoke(Method.java:592)
	at org.codehaus.classworlds.Launcher.launchEnhanced(Launcher.java:315)
	at org.codehaus.classworlds.Launcher.launch(Launcher.java:255)
	at hudson.maven.agent.Main.launch(Main.java:173)
	at hudson.maven.MavenBuilder.call(MavenBuilder.java:164)
	at hudson.maven.MavenModuleSetBuild$Builder.call(MavenModuleSetBuild.java:924)
	at hudson.maven.MavenModuleSetBuild$Builder.call(MavenModuleSetBuild.java:855)
	at hudson.remoting.UserRequest.perform(UserRequest.java:114)
	at hudson.remoting.UserRequest.perform(UserRequest.java:48)
	at hudson.remoting.Request$2.run(Request.java:270)
	at java.util.concurrent.Executors$RunnableAdapter.call(Executors.java:417)
	at java.util.concurrent.FutureTask$Sync.innerRun(FutureTask.java:269)
	at java.util.concurrent.FutureTask.run(FutureTask.java:123)
	at java.util.concurrent.ThreadPoolExecutor$Worker.runTask(ThreadPoolExecutor.java:651)
	at java.util.concurrent.ThreadPoolExecutor$Worker.run(ThreadPoolExecutor.java:676)
	at java.lang.Thread.run(Thread.java:595)
Caused by: org.apache.maven.plugin.CompilationFailureException: Compilation failure
	at org.apache.maven.plugin.AbstractCompilerMojo.execute(AbstractCompilerMojo.java:656)
	at org.apache.maven.plugin.CompilerMojo.execute(CompilerMojo.java:128)
	at org.apache.maven.plugin.DefaultPluginManager.executeMojo(DefaultPluginManager.java:490)
	at hudson.maven.agent.PluginManagerInterceptor.executeMojo(PluginManagerInterceptor.java:182)
	at org.apache.maven.lifecycle.DefaultLifecycleExecutor.executeGoals(DefaultLifecycleExecutor.java:694)
	... 28 more
[INFO] ------------------------------------------------------------------------
[INFO] Total time: 4 minutes 32 seconds
[INFO] Finished at: Sun Mar 27 23:08:48 BST 2011
[INFO] Final Memory: 137M/330M
[INFO] ------------------------------------------------------------------------
Sending e-mails to: notifications@cxf.apache.org
channel stopped


Mime
View raw message