cxf-notifications mailing list archives

Site index · List index
Message view « Date » · « Thread »
Top « Date » · « Thread »
From Apache Hudson Server <hud...@hudson.apache.org>
Subject Build failed in Jenkins: CXF-2.3.x-windows #28
Date Sat, 05 Mar 2011 04:29:28 GMT
See <https://hudson.apache.org/hudson/job/CXF-2.3.x-windows/28/changes>

Changes:

[dkulp] Merged revisions 1078231 via svnmerge from 
https://svn.apache.org/repos/asf/cxf/trunk

........
  r1078231 | dkulp | 2011-03-04 22:37:45 -0500 (Fri, 04 Mar 2011) | 1 line
  
  [CXF-3378] Upgrade to Jetty 7.3.0
........

------------------------------------------
[...truncated 1063 lines...]
 T E S T S
-------------------------------------------------------
There are no tests to run.

Results :

Tests run: 0, Failures: 0, Errors: 0, Skipped: 0

[JENKINS] Recording test results
[INFO] [jar:jar {execution: default-jar}]
[INFO] Building jar: C:\hudson\hudson-slave\workspace\CXF-2.3.x-windows\2.3.x-fixes\maven-plugins\codegen-plugin\target\cxf-codegen-plugin-2.3.4-SNAPSHOT.jar
[INFO] [plugin:addPluginArtifactMetadata {execution: default-addPluginArtifactMetadata}]
[INFO] [install:install {execution: default-install}]
[INFO] Installing C:\hudson\hudson-slave\workspace\CXF-2.3.x-windows\2.3.x-fixes\maven-plugins\codegen-plugin\target\cxf-codegen-plugin-2.3.4-SNAPSHOT.jar
to <https://hudson.apache.org/hudson/job/CXF-2.3.x-windows/ws/.repository\org\apache\cxf\cxf-codegen-plugin\2.3.4-SNAPSHOT\cxf-codegen-plugin-2.3.4-SNAPSHOT.jar>
[JENKINS] Archiving C:\hudson\hudson-slave\workspace\CXF-2.3.x-windows\2.3.x-fixes\maven-plugins\codegen-plugin\target\cxf-codegen-plugin-2.3.4-SNAPSHOT.jar
to /home/hudson/hudson/jobs/CXF-2.3.x-windows/modules/org.apache.cxf$cxf-codegen-plugin/builds/2011-03-05_04-20-06/archive/org.apache.cxf/cxf-codegen-plugin/2.3.4-SNAPSHOT/cxf-codegen-plugin-2.3.4-SNAPSHOT.jar
[INFO] ------------------------------------------------------------------------
[INFO] Building Apache CXF Test Utilities
[INFO]    task-segment: [clean, install]
[INFO] ------------------------------------------------------------------------
[INFO] [clean:clean {execution: default-clean}]
[INFO] Deleting C:\hudson\hudson-slave\workspace\CXF-2.3.x-windows\2.3.x-fixes\testutils\target
[INFO] [checkstyle:checkstyle {execution: validate}]
[INFO] Starting audit...
Audit done.

[INFO] Preparing pmd:check
[JENKINS] Archiving C:\hudson\hudson-slave\workspace\CXF-2.3.x-windows\2.3.x-fixes\testutils\pom.xml
to /home/hudson/hudson/jobs/CXF-2.3.x-windows/modules/org.apache.cxf$cxf-testutils/builds/2011-03-05_04-20-06/archive/org.apache.cxf/cxf-testutils/2.3.4-SNAPSHOT/pom.xml
[INFO] [pmd:pmd {execution: pmd}]
[INFO] [pmd:check {execution: validate}]
[INFO] 
[WARNING] DEPRECATED [sourceRoot]: Use the build-helper-maven-plugin to bind source directories
[INFO] [antrun:run {execution: validate}]
project.artifactId
[INFO] Executing tasks
    [mkdir] Created dir: C:\hudson\hudson-slave\workspace\CXF-2.3.x-windows\2.3.x-fixes\testutils\target\generated\src\main\resources\wsdl\type_test
     [xslt] Processing C:\hudson\hudson-slave\workspace\CXF-2.3.x-windows\2.3.x-fixes\testutils\src\main\resources\wsdl\type_test\type_test.xsd
to C:\hudson\hudson-slave\workspace\CXF-2.3.x-windows\2.3.x-fixes\testutils\target\generated\src\main\resources\wsdl\type_test\type_test_1.xsd
     [xslt] Loading stylesheet C:\hudson\hudson-slave\workspace\CXF-2.3.x-windows\2.3.x-fixes\testutils\src\main\resources\wsdl\type_test\type_test_ID_xsd.xsl
     [xslt] Processing C:\hudson\hudson-slave\workspace\CXF-2.3.x-windows\2.3.x-fixes\testutils\src\main\resources\wsdl\type_test\type_test.xsd
to C:\hudson\hudson-slave\workspace\CXF-2.3.x-windows\2.3.x-fixes\testutils\target\generated\src\main\resources\wsdl\type_test\type_test_2.xsd
     [xslt] Loading stylesheet C:\hudson\hudson-slave\workspace\CXF-2.3.x-windows\2.3.x-fixes\testutils\src\main\resources\wsdl\type_test\type_test_ID_xsd.xsl
     [xslt] Processing C:\hudson\hudson-slave\workspace\CXF-2.3.x-windows\2.3.x-fixes\testutils\src\main\resources\wsdl\type_test\type_test.xsd
to C:\hudson\hudson-slave\workspace\CXF-2.3.x-windows\2.3.x-fixes\testutils\target\generated\src\main\resources\wsdl\type_test\type_test_3.xsd
     [xslt] Loading stylesheet C:\hudson\hudson-slave\workspace\CXF-2.3.x-windows\2.3.x-fixes\testutils\src\main\resources\wsdl\type_test\type_test_ID_xsd.xsl
     [xslt] Processing C:\hudson\hudson-slave\workspace\CXF-2.3.x-windows\2.3.x-fixes\testutils\src\main\resources\wsdl\type_test\type_test.xsd
to C:\hudson\hudson-slave\workspace\CXF-2.3.x-windows\2.3.x-fixes\testutils\target\generated\src\main\resources\wsdl\type_test\type_test_doclit.wsdl
     [xslt] Loading stylesheet C:\hudson\hudson-slave\workspace\CXF-2.3.x-windows\2.3.x-fixes\testutils\src\main\resources\wsdl\type_test\type_test_wsdl.xsl
     [xslt] Processing C:\hudson\hudson-slave\workspace\CXF-2.3.x-windows\2.3.x-fixes\testutils\src\main\resources\wsdl\type_test\type_test.xsd
to C:\hudson\hudson-slave\workspace\CXF-2.3.x-windows\2.3.x-fixes\testutils\target\generated\src\main\resources\wsdl\type_test\type_test_rpclit.wsdl
     [xslt] Loading stylesheet C:\hudson\hudson-slave\workspace\CXF-2.3.x-windows\2.3.x-fixes\testutils\src\main\resources\wsdl\type_test\type_test_wsdl.xsl
     [xslt] Processing C:\hudson\hudson-slave\workspace\CXF-2.3.x-windows\2.3.x-fixes\testutils\src\main\resources\wsdl\type_test\type_test.xsd
to C:\hudson\hudson-slave\workspace\CXF-2.3.x-windows\2.3.x-fixes\testutils\target\generated\src\main\resources\wsdl\type_test\type_test_xml_inc.wsdl
     [xslt] Loading stylesheet C:\hudson\hudson-slave\workspace\CXF-2.3.x-windows\2.3.x-fixes\testutils\src\main\resources\wsdl\type_test\type_test_wsdl.xsl
     [xslt] Processing C:\hudson\hudson-slave\workspace\CXF-2.3.x-windows\2.3.x-fixes\testutils\src\main\resources\wsdl\type_test\type_test.xsd
to C:\hudson\hudson-slave\workspace\CXF-2.3.x-windows\2.3.x-fixes\testutils\target\generated\src\main\resources\wsdl\type_test\type_test_xml.wsdl
     [xslt] Loading stylesheet C:\hudson\hudson-slave\workspace\CXF-2.3.x-windows\2.3.x-fixes\testutils\src\main\resources\wsdl\type_test\type_test_xml_wsdl.xsl
     [xslt] Processing C:\hudson\hudson-slave\workspace\CXF-2.3.x-windows\2.3.x-fixes\testutils\src\main\resources\wsdl\type_test\type_test.xsd
to C:\hudson\hudson-slave\workspace\CXF-2.3.x-windows\2.3.x-fixes\testutils\target\generated\src\main\resources\wsdl\type_test\type_test_doclit_soap.wsdl
     [xslt] Loading stylesheet C:\hudson\hudson-slave\workspace\CXF-2.3.x-windows\2.3.x-fixes\testutils\src\main\resources\wsdl\type_test\type_test_soap_wsdl.xsl
     [xslt] Processing C:\hudson\hudson-slave\workspace\CXF-2.3.x-windows\2.3.x-fixes\testutils\src\main\resources\wsdl\type_test\type_test.xsd
to C:\hudson\hudson-slave\workspace\CXF-2.3.x-windows\2.3.x-fixes\testutils\target\generated\src\main\resources\wsdl\type_test\type_test_rpclit_soap.wsdl
     [xslt] Loading stylesheet C:\hudson\hudson-slave\workspace\CXF-2.3.x-windows\2.3.x-fixes\testutils\src\main\resources\wsdl\type_test\type_test_soap_wsdl.xsl
    [mkdir] Created dir: C:\hudson\hudson-slave\workspace\CXF-2.3.x-windows\2.3.x-fixes\testutils\target\generated\src\main\java\org\apache\cxf\systest\type_test
     [xslt] Processing C:\hudson\hudson-slave\workspace\CXF-2.3.x-windows\2.3.x-fixes\testutils\src\main\resources\wsdl\type_test\type_test.xsd
to C:\hudson\hudson-slave\workspace\CXF-2.3.x-windows\2.3.x-fixes\testutils\target\generated\src\main\java\org\apache\cxf\systest\type_test\TypeTestImpl.java
     [xslt] Loading stylesheet C:\hudson\hudson-slave\workspace\CXF-2.3.x-windows\2.3.x-fixes\testutils\src\main\resources\wsdl\type_test\type_test_impl_java.xsl
     [xslt] Processing C:\hudson\hudson-slave\workspace\CXF-2.3.x-windows\2.3.x-fixes\testutils\src\main\resources\wsdl\type_test\type_test.xsd
to C:\hudson\hudson-slave\workspace\CXF-2.3.x-windows\2.3.x-fixes\testutils\target\generated\src\main\java\org\apache\cxf\systest\type_test\TypeTestTester.java
     [xslt] Loading stylesheet C:\hudson\hudson-slave\workspace\CXF-2.3.x-windows\2.3.x-fixes\testutils\src\main\resources\wsdl\type_test\type_test_tester_java.xsl
[INFO] Executed tasks
[INFO] Registering compile source root C:\hudson\hudson-slave\workspace\CXF-2.3.x-windows\2.3.x-fixes\testutils\target\generated\src\main\java
[INFO] [cxf-xml2fastinfoset:xml2fastinfoset {execution: xml2fastinfoset}]
[INFO] [cxf-codegen:wsdl2java {execution: generate-sources}]
Mar 5, 2011 4:27:56 AM org.springframework.context.support.AbstractApplicationContext prepareRefresh
INFO: Refreshing org.apache.cxf.bus.spring.BusApplicationContext@773560eb: startup date [Sat
Mar 05 04:27:56 GMT 2011]; root of context hierarchy
Mar 5, 2011 4:27:56 AM org.springframework.beans.factory.xml.XmlBeanDefinitionReader loadBeanDefinitions
INFO: Loading XML bean definitions from class path resource [META-INF/cxf/cxf.xml]
Mar 5, 2011 4:27:56 AM org.springframework.beans.factory.support.DefaultListableBeanFactory
preInstantiateSingletons
INFO: Pre-instantiating singletons in org.springframework.beans.factory.support.DefaultListableBeanFactory@c79b37:
defining beans [cxf,org.apache.cxf.bus.spring.BusApplicationListener,org.apache.cxf.bus.spring.BusWiringBeanFactoryPostProcessor,org.apache.cxf.bus.spring.Jsr250BeanPostProcessor,org.apache.cxf.bus.spring.BusExtensionPostProcessor,org.apache.cxf.resource.ResourceManager,org.apache.cxf.configuration.Configurer,org.apache.cxf.binding.BindingFactoryManager,org.apache.cxf.transport.DestinationFactoryManager,org.apache.cxf.transport.ConduitInitiatorManager,org.apache.cxf.wsdl.WSDLManager,org.apache.cxf.phase.PhaseManager,org.apache.cxf.workqueue.WorkQueueManager,org.apache.cxf.buslifecycle.BusLifeCycleManager,org.apache.cxf.endpoint.ServerRegistry,org.apache.cxf.endpoint.ServerLifeCycleManager,org.apache.cxf.endpoint.ClientLifeCycleManager,org.apache.cxf.transports.http.QueryHandlerRegistry,org.apache.cxf.endpoint.EndpointResolverRegistry,org.apache.cxf.headers.HeaderManager,org.apache.cxf.catalog.OASISCatalogManager,org.apache.cxf.service.factory.FactoryBeanListenerManager,org.apache.cxf.endpoint.ServiceContractResolverRegistry];
root of factory hierarchy
Mar 5, 2011 4:28:26 AM org.springframework.context.support.AbstractApplicationContext doClose
INFO: Closing org.apache.cxf.bus.spring.BusApplicationContext@773560eb: startup date [Sat
Mar 05 04:27:56 GMT 2011]; root of context hierarchy
Mar 5, 2011 4:28:26 AM org.springframework.beans.factory.support.DefaultSingletonBeanRegistry
destroySingletons
INFO: Destroying singletons in org.springframework.beans.factory.support.DefaultListableBeanFactory@c79b37:
defining beans [cxf,org.apache.cxf.bus.spring.BusApplicationListener,org.apache.cxf.bus.spring.BusWiringBeanFactoryPostProcessor,org.apache.cxf.bus.spring.Jsr250BeanPostProcessor,org.apache.cxf.bus.spring.BusExtensionPostProcessor,org.apache.cxf.resource.ResourceManager,org.apache.cxf.configuration.Configurer,org.apache.cxf.binding.BindingFactoryManager,org.apache.cxf.transport.DestinationFactoryManager,org.apache.cxf.transport.ConduitInitiatorManager,org.apache.cxf.wsdl.WSDLManager,org.apache.cxf.phase.PhaseManager,org.apache.cxf.workqueue.WorkQueueManager,org.apache.cxf.buslifecycle.BusLifeCycleManager,org.apache.cxf.endpoint.ServerRegistry,org.apache.cxf.endpoint.ServerLifeCycleManager,org.apache.cxf.endpoint.ClientLifeCycleManager,org.apache.cxf.transports.http.QueryHandlerRegistry,org.apache.cxf.endpoint.EndpointResolverRegistry,org.apache.cxf.headers.HeaderManager,org.apache.cxf.catalog.OASISCatalogManager,org.apache.cxf.service.factory.FactoryBeanListenerManager,org.apache.cxf.endpoint.ServiceContractResolverRegistry];
root of factory hierarchy
[INFO] [cxf-xjc:xsdtojava {execution: generate-sources}]
[INFO] [remote-resources:process {execution: default}]
[INFO] [resources:resources {execution: default-resources}]
[INFO] Using 'UTF-8' encoding to copy filtered resources.
[INFO] Copying 1 resource
[INFO] Copying 89 resources
[INFO] skip non existing resourceDirectory C:\hudson\hudson-slave\workspace\CXF-2.3.x-windows\2.3.x-fixes\testutils\src\main\resources-filtered
[INFO] Copying 9 resources
[INFO] Copying 3 resources
[INFO] [compiler:compile {execution: default-compile}]
[INFO] Compiling 1433 source files to C:\hudson\hudson-slave\workspace\CXF-2.3.x-windows\2.3.x-fixes\testutils\target\classes
[INFO] [resources:testResources {execution: default-testResources}]
[INFO] Using 'UTF-8' encoding to copy filtered resources.
[INFO] Copying 0 resource
[INFO] skip non existing resourceDirectory C:\hudson\hudson-slave\workspace\CXF-2.3.x-windows\2.3.x-fixes\testutils\src\test\resources
[INFO] skip non existing resourceDirectory C:\hudson\hudson-slave\workspace\CXF-2.3.x-windows\2.3.x-fixes\testutils\target\generated\src\test\resources
[INFO] Copying 3 resources
[INFO] [compiler:testCompile {execution: default-testCompile}]
[INFO] Compiling 1 source file to C:\hudson\hudson-slave\workspace\CXF-2.3.x-windows\2.3.x-fixes\testutils\target\test-classes
[INFO] [surefire:test {execution: default-test}]
[INFO] Surefire report directory: C:\hudson\hudson-slave\workspace\CXF-2.3.x-windows\2.3.x-fixes\testutils\target\surefire-reports

-------------------------------------------------------
 T E S T S
-------------------------------------------------------
Running org.apache.cxf.testutils.header_test.rpc.TestRPCHeaderTest
Tests run: 2, Failures: 0, Errors: 0, Skipped: 0, Time elapsed: 0.137 sec

Results :

Tests run: 2, Failures: 0, Errors: 0, Skipped: 0

[JENKINS] Recording test results
[INFO] [jar:jar {execution: default-jar}]
[INFO] Building jar: C:\hudson\hudson-slave\workspace\CXF-2.3.x-windows\2.3.x-fixes\testutils\target\cxf-testutils-2.3.4-SNAPSHOT.jar
[INFO] [install:install {execution: default-install}]
[INFO] Installing C:\hudson\hudson-slave\workspace\CXF-2.3.x-windows\2.3.x-fixes\testutils\target\cxf-testutils-2.3.4-SNAPSHOT.jar
to <https://hudson.apache.org/hudson/job/CXF-2.3.x-windows/ws/.repository\org\apache\cxf\cxf-testutils\2.3.4-SNAPSHOT\cxf-testutils-2.3.4-SNAPSHOT.jar>
[JENKINS] Archiving C:\hudson\hudson-slave\workspace\CXF-2.3.x-windows\2.3.x-fixes\testutils\target\cxf-testutils-2.3.4-SNAPSHOT.jar
to /home/hudson/hudson/jobs/CXF-2.3.x-windows/modules/org.apache.cxf$cxf-testutils/builds/2011-03-05_04-20-06/archive/org.apache.cxf/cxf-testutils/2.3.4-SNAPSHOT/cxf-testutils-2.3.4-SNAPSHOT.jar
[INFO] ------------------------------------------------------------------------
[INFO] Building Apache CXF Runtime JAXB DataBinding
[INFO]    task-segment: [clean, install]
[INFO] ------------------------------------------------------------------------
[INFO] [clean:clean {execution: default-clean}]
[INFO] Deleting C:\hudson\hudson-slave\workspace\CXF-2.3.x-windows\2.3.x-fixes\rt\databinding\jaxb\target
[INFO] [checkstyle:checkstyle {execution: validate}]
[INFO] Starting audit...
Audit done.

[INFO] Preparing pmd:check
[JENKINS] Archiving C:\hudson\hudson-slave\workspace\CXF-2.3.x-windows\2.3.x-fixes\rt\databinding\jaxb\pom.xml
to /home/hudson/hudson/jobs/CXF-2.3.x-windows/modules/org.apache.cxf$cxf-rt-databinding-jaxb/builds/2011-03-05_04-20-06/archive/org.apache.cxf/cxf-rt-databinding-jaxb/2.3.4-SNAPSHOT/pom.xml
[INFO] [pmd:pmd {execution: pmd}]
[INFO] [pmd:check {execution: validate}]
[INFO] 
[INFO] [cxf-xml2fastinfoset:xml2fastinfoset {execution: xml2fastinfoset}]
[INFO] [remote-resources:process {execution: default}]
[INFO] [resources:resources {execution: default-resources}]
[INFO] Using 'UTF-8' encoding to copy filtered resources.
[INFO] Copying 3 resources
[INFO] Copying 2 resources
[INFO] skip non existing resourceDirectory C:\hudson\hudson-slave\workspace\CXF-2.3.x-windows\2.3.x-fixes\rt\databinding\jaxb\src\main\resources-filtered
[INFO] skip non existing resourceDirectory C:\hudson\hudson-slave\workspace\CXF-2.3.x-windows\2.3.x-fixes\rt\databinding\jaxb\target\generated\src\main\resources
[INFO] Copying 3 resources
[INFO] [compiler:compile {execution: default-compile}]
[INFO] Compiling 14 source files to C:\hudson\hudson-slave\workspace\CXF-2.3.x-windows\2.3.x-fixes\rt\databinding\jaxb\target\classes
[INFO] [cxf-xjc:xsdtojava-tests {execution: generate-sources}]
[INFO] [resources:testResources {execution: default-testResources}]
[INFO] Using 'UTF-8' encoding to copy filtered resources.
[INFO] Copying 13 resources
[INFO] Copying 3 resources
[INFO] skip non existing resourceDirectory C:\hudson\hudson-slave\workspace\CXF-2.3.x-windows\2.3.x-fixes\rt\databinding\jaxb\target\generated\src\test\resources
[INFO] Copying 3 resources
[INFO] [compiler:testCompile {execution: default-testCompile}]
[INFO] Compiling 20 source files to C:\hudson\hudson-slave\workspace\CXF-2.3.x-windows\2.3.x-fixes\rt\databinding\jaxb\target\test-classes
[INFO] [surefire:test {execution: default-test}]
[INFO] Surefire report directory: C:\hudson\hudson-slave\workspace\CXF-2.3.x-windows\2.3.x-fixes\rt\databinding\jaxb\target\surefire-reports

-------------------------------------------------------
 T E S T S
-------------------------------------------------------
Running org.apache.cxf.jaxb.BareInInterceptorTest
Tests run: 4, Failures: 0, Errors: 0, Skipped: 0, Time elapsed: 1.663 sec
Running org.apache.cxf.jaxb.BareOutInterceptorTest
Tests run: 2, Failures: 0, Errors: 0, Skipped: 0, Time elapsed: 0.126 sec
Running org.apache.cxf.jaxb.DocLiteralInInterceptorTest
Tests run: 3, Failures: 0, Errors: 0, Skipped: 0, Time elapsed: 0.094 sec
Running org.apache.cxf.jaxb.JAXBDataBindingTest
Tests run: 7, Failures: 0, Errors: 0, Skipped: 0, Time elapsed: 0.388 sec
Running org.apache.cxf.jaxb.JAXBEncoderDecoderTest
Tests run: 11, Failures: 0, Errors: 0, Skipped: 0, Time elapsed: 0.482 sec
Running org.apache.cxf.jaxb.JAXBWrapperHelperTest
Tests run: 1, Failures: 0, Errors: 0, Skipped: 0, Time elapsed: 0.026 sec
Running org.apache.cxf.jaxb.WrappedInInterceptorTest
Tests run: 2, Failures: 0, Errors: 0, Skipped: 0, Time elapsed: 0.068 sec
Running org.apache.cxf.jaxb.io.XMLStreamDataReaderTest
Tests run: 4, Failures: 0, Errors: 0, Skipped: 0, Time elapsed: 0.037 sec
Running org.apache.cxf.jaxb.io.XMLStreamDataWriterTest
Tests run: 5, Failures: 0, Errors: 0, Skipped: 0, Time elapsed: 0.02 sec

Results :

Tests run: 39, Failures: 0, Errors: 0, Skipped: 0

[JENKINS] Recording test results
[INFO] [jar:jar {execution: default-jar}]
[INFO] Building jar: C:\hudson\hudson-slave\workspace\CXF-2.3.x-windows\2.3.x-fixes\rt\databinding\jaxb\target\cxf-rt-databinding-jaxb-2.3.4-SNAPSHOT.jar
[INFO] ------------------------------------------------------------------------
[ERROR] BUILD ERROR
[INFO] ------------------------------------------------------------------------
[INFO] Error assembling JAR

Embedded error: Problem creating jar: There is not enough space on the disk (and the archive
is probably corrupt but I could not delete it)
[INFO] ------------------------------------------------------------------------
[INFO] Trace
org.apache.maven.lifecycle.LifecycleExecutionException: Error assembling JAR
	at org.apache.maven.lifecycle.DefaultLifecycleExecutor.executeGoals(DefaultLifecycleExecutor.java:719)
	at org.apache.maven.lifecycle.DefaultLifecycleExecutor.executeGoalWithLifecycle(DefaultLifecycleExecutor.java:556)
	at org.apache.maven.lifecycle.DefaultLifecycleExecutor.executeGoal(DefaultLifecycleExecutor.java:535)
	at org.apache.maven.lifecycle.DefaultLifecycleExecutor.executeGoalAndHandleFailures(DefaultLifecycleExecutor.java:387)
	at org.apache.maven.lifecycle.DefaultLifecycleExecutor.executeTaskSegments(DefaultLifecycleExecutor.java:348)
	at org.apache.maven.lifecycle.DefaultLifecycleExecutor.execute(DefaultLifecycleExecutor.java:180)
	at org.apache.maven.lifecycle.LifecycleExecutorInterceptor.execute(LifecycleExecutorInterceptor.java:65)
	at org.apache.maven.DefaultMaven.doExecute(DefaultMaven.java:328)
	at org.apache.maven.DefaultMaven.execute(DefaultMaven.java:138)
	at org.apache.maven.cli.MavenCli.main(MavenCli.java:362)
	at sun.reflect.NativeMethodAccessorImpl.invoke0(Native Method)
	at sun.reflect.NativeMethodAccessorImpl.invoke(NativeMethodAccessorImpl.java:39)
	at sun.reflect.DelegatingMethodAccessorImpl.invoke(DelegatingMethodAccessorImpl.java:25)
	at java.lang.reflect.Method.invoke(Method.java:597)
	at org.codehaus.classworlds.Launcher.launchEnhanced(Launcher.java:315)
	at org.codehaus.classworlds.Launcher.launch(Launcher.java:255)
	at hudson.maven.agent.Main.launch(Main.java:173)
	at hudson.maven.MavenBuilder.call(MavenBuilder.java:164)
	at hudson.maven.MavenModuleSetBuild$Builder.call(MavenModuleSetBuild.java:872)
	at hudson.maven.MavenModuleSetBuild$Builder.call(MavenModuleSetBuild.java:803)
	at hudson.remoting.UserRequest.perform(UserRequest.java:114)
	at hudson.remoting.UserRequest.perform(UserRequest.java:48)
	at hudson.remoting.Request$2.run(Request.java:270)
	at java.util.concurrent.Executors$RunnableAdapter.call(Executors.java:441)
	at java.util.concurrent.FutureTask$Sync.innerRun(FutureTask.java:303)
	at java.util.concurrent.FutureTask.run(FutureTask.java:138)
	at java.util.concurrent.ThreadPoolExecutor$Worker.runTask(ThreadPoolExecutor.java:886)
	at java.util.concurrent.ThreadPoolExecutor$Worker.run(ThreadPoolExecutor.java:908)
	at java.lang.Thread.run(Thread.java:619)
Caused by: org.apache.maven.plugin.MojoExecutionException: Error assembling JAR
	at org.apache.maven.plugin.jar.AbstractJarMojo.createArchive(AbstractJarMojo.java:223)
	at org.apache.maven.plugin.jar.AbstractJarMojo.execute(AbstractJarMojo.java:235)
	at org.apache.maven.plugin.DefaultPluginManager.executeMojo(DefaultPluginManager.java:490)
	at hudson.maven.agent.PluginManagerInterceptor.executeMojo(PluginManagerInterceptor.java:182)
	at org.apache.maven.lifecycle.DefaultLifecycleExecutor.executeGoals(DefaultLifecycleExecutor.java:694)
	... 28 more
Caused by: org.codehaus.plexus.archiver.ArchiverException: Problem creating jar: There is
not enough space on the disk (and the archive is probably corrupt but I could not delete it)
	at org.codehaus.plexus.archiver.AbstractArchiver.createArchive(AbstractArchiver.java:869)
	at org.apache.maven.archiver.MavenArchiver.createArchive(MavenArchiver.java:543)
	at org.apache.maven.plugin.jar.AbstractJarMojo.createArchive(AbstractJarMojo.java:216)
	... 32 more
Caused by: java.io.IOException: There is not enough space on the disk
	at java.io.RandomAccessFile.writeBytes(Native Method)
	at java.io.RandomAccessFile.write(RandomAccessFile.java:466)
	at org.codehaus.plexus.archiver.zip.ZipOutputStream.writeOut(ZipOutputStream.java:925)
	at org.codehaus.plexus.archiver.zip.ZipOutputStream.deflate(ZipOutputStream.java:613)
	at org.codehaus.plexus.archiver.zip.ZipOutputStream.closeEntry(ZipOutputStream.java:349)
	at org.codehaus.plexus.archiver.zip.ZipOutputStream.putNextEntry(ZipOutputStream.java:414)
	at org.codehaus.plexus.archiver.zip.AbstractZipArchiver.zipFile(AbstractZipArchiver.java:555)
	at org.codehaus.plexus.archiver.jar.JarArchiver.zipFile(JarArchiver.java:553)
	at org.codehaus.plexus.archiver.zip.AbstractZipArchiver.zipFile(AbstractZipArchiver.java:595)
	at org.codehaus.plexus.archiver.zip.AbstractZipArchiver.addResources(AbstractZipArchiver.java:426)
	at org.codehaus.plexus.archiver.zip.AbstractZipArchiver.createArchiveMain(AbstractZipArchiver.java:349)
	at org.codehaus.plexus.archiver.zip.AbstractZipArchiver.execute(AbstractZipArchiver.java:250)
	at org.codehaus.plexus.archiver.AbstractArchiver.createArchive(AbstractArchiver.java:852)
	... 34 more
[INFO] ------------------------------------------------------------------------
[INFO] Total time: 9 minutes 6 seconds
[INFO] Finished at: Sat Mar 05 04:29:23 GMT 2011
[INFO] Final Memory: 257M/468M
[INFO] ------------------------------------------------------------------------
Sending e-mails to: notifications@cxf.apache.org
channel stopped


Mime
View raw message