cxf-notifications mailing list archives

Site index · List index
Message view « Date » · « Thread »
Top « Date » · « Thread »
From Apache Hudson Server <hud...@hudson.apache.org>
Subject Build failed in Hudson: CXF-Trunk-JDK15 » Apache CXF Runtime Web Management #1697
Date Fri, 04 Feb 2011 17:52:33 GMT
See <https://hudson.apache.org/hudson/job/CXF-Trunk-JDK15/org.apache.cxf$cxf-rt-management-web/1697/changes>

Changes:

[sergeyb] [CXF-2736] Moving the LogBrowser project to the trunk

------------------------------------------
[INFO] ------------------------------------------------------------------------
[INFO] Building Apache CXF Runtime Web Management
[INFO]    task-segment: [clean, install]
[INFO] ------------------------------------------------------------------------
Downloading: http://repo1.maven.org/maven2/org/codehaus/mojo/gwt-maven-plugin/1.2/gwt-maven-plugin-1.2.pom

Downloading: http://repo1.maven.org/maven2/org/codehaus/mojo/gwt-maven-plugin/1.2/gwt-maven-plugin-1.2.jar

[INFO] [clean:clean {execution: default-clean}]
[INFO] Deleting <https://hudson.apache.org/hudson/job/CXF-Trunk-JDK15/org.apache.cxf$cxf-rt-management-web/ws/target>
[INFO] [cxf-xml2fastinfoset:xml2fastinfoset {execution: xml2fastinfoset}]
[INFO] [remote-resources:process {execution: default}]
Downloading: http://gerrit.googlecode.com/svn/mavenrepo//com/google/gwt/gwt-servlet/2.0.3/gwt-servlet-2.0.3.pom
[INFO] Unable to find resource 'com.google.gwt:gwt-servlet:pom:2.0.3' in repository gerrit-maven-repository
(http://gerrit.googlecode.com/svn/mavenrepo/)
Downloading: http://repo1.maven.org/maven2/com/google/gwt/gwt-servlet/2.0.3/gwt-servlet-2.0.3.pom

Downloading: http://gerrit.googlecode.com/svn/mavenrepo//com/google/gwt/gwt-user/2.0.3/gwt-user-2.0.3.pom
[INFO] Unable to find resource 'com.google.gwt:gwt-user:pom:2.0.3' in repository gerrit-maven-repository
(http://gerrit.googlecode.com/svn/mavenrepo/)
Downloading: http://repo1.maven.org/maven2/com/google/gwt/gwt-user/2.0.3/gwt-user-2.0.3.pom

Downloading: http://gerrit.googlecode.com/svn/mavenrepo//com/googlecode/gwt/inject/gin/1.0/gin-1.0.pom
[INFO] Unable to find resource 'com.googlecode.gwt.inject:gin:pom:1.0' in repository gerrit-maven-repository
(http://gerrit.googlecode.com/svn/mavenrepo/)
Downloading: http://repo1.maven.org/maven2/com/googlecode/gwt/inject/gin/1.0/gin-1.0.pom

Downloading: http://gerrit.googlecode.com/svn/mavenrepo//com/google/inject/guice/2.0/guice-2.0.pom
[INFO] Unable to find resource 'com.google.inject:guice:pom:2.0' in repository gerrit-maven-repository
(http://gerrit.googlecode.com/svn/mavenrepo/)
Downloading: http://repo1.maven.org/maven2/com/google/inject/guice/2.0/guice-2.0.pom

Downloading: http://gerrit.googlecode.com/svn/mavenrepo//com/google/inject/guice-parent/2.0/guice-parent-2.0.pom
[INFO] Unable to find resource 'com.google.inject:guice-parent:pom:2.0' in repository gerrit-maven-repository
(http://gerrit.googlecode.com/svn/mavenrepo/)
Downloading: http://repo1.maven.org/maven2/com/google/inject/guice-parent/2.0/guice-parent-2.0.pom

Downloading: http://gerrit.googlecode.com/svn/mavenrepo//com/google/google/1/google-1.pom
[INFO] Unable to find resource 'com.google:google:pom:1' in repository gerrit-maven-repository
(http://gerrit.googlecode.com/svn/mavenrepo/)
Downloading: http://repo1.maven.org/maven2/com/google/google/1/google-1.pom

Downloading: http://gerrit.googlecode.com/svn/mavenrepo//com/google/gwt/gwt-servlet/1.5.3/gwt-servlet-1.5.3.pom
[INFO] Unable to find resource 'com.google.gwt:gwt-servlet:pom:1.5.3' in repository gerrit-maven-repository
(http://gerrit.googlecode.com/svn/mavenrepo/)
Downloading: http://repo1.maven.org/maven2/com/google/gwt/gwt-servlet/1.5.3/gwt-servlet-1.5.3.pom

Downloading: http://gerrit.googlecode.com/svn/mavenrepo//gwtexpui/gwtexpui/1.2.1/gwtexpui-1.2.1.pom
14K downloaded  (gwtexpui-1.2.1.pom)
[WARNING] *** CHECKSUM FAILED - Checksum failed on download: local = 'dd3e3f0661715152d4369de7750ddcfeb693e63a';
remote = '68186e6a2c1f4e0dcfa34ec91d908acda1282303' - RETRYING
Downloading: http://gerrit.googlecode.com/svn/mavenrepo//gwtexpui/gwtexpui/1.2.1/gwtexpui-1.2.1.pom
14K downloaded  (gwtexpui-1.2.1.pom)
[WARNING] *** CHECKSUM FAILED - Checksum failed on download: local = 'dd3e3f0661715152d4369de7750ddcfeb693e63a';
remote = '68186e6a2c1f4e0dcfa34ec91d908acda1282303' - IGNORING
Downloading: http://gerrit.googlecode.com/svn/mavenrepo//com/google/code/findbugs/jsr305/1.3.9/jsr305-1.3.9.pom
[INFO] Unable to find resource 'com.google.code.findbugs:jsr305:pom:1.3.9' in repository gerrit-maven-repository
(http://gerrit.googlecode.com/svn/mavenrepo/)
Downloading: http://repo1.maven.org/maven2/com/google/code/findbugs/jsr305/1.3.9/jsr305-1.3.9.pom

Downloading: http://gerrit.googlecode.com/svn/mavenrepo//com/googlecode/gwt/inject/gin/1.0/gin-1.0.jar
Downloading: http://gerrit.googlecode.com/svn/mavenrepo//com/google/gwt/gwt-servlet/2.0.3/gwt-servlet-2.0.3.jar
Downloading: http://gerrit.googlecode.com/svn/mavenrepo//gwtexpui/gwtexpui/1.2.1/gwtexpui-1.2.1.jar
Downloading: http://gerrit.googlecode.com/svn/mavenrepo//com/google/code/findbugs/jsr305/1.3.9/jsr305-1.3.9.jar
Downloading: http://gerrit.googlecode.com/svn/mavenrepo//com/google/inject/guice/2.0/guice-2.0.jar
[INFO] Unable to find resource 'com.google.gwt:gwt-servlet:jar:2.0.3' in repository gerrit-maven-repository
(http://gerrit.googlecode.com/svn/mavenrepo/)
Downloading: http://repo1.maven.org/maven2/com/google/gwt/gwt-servlet/2.0.3/gwt-servlet-2.0.3.jar
[INFO] Unable to find resource 'com.googlecode.gwt.inject:gin:jar:1.0' in repository gerrit-maven-repository
(http://gerrit.googlecode.com/svn/mavenrepo/)
Downloading: http://repo1.maven.org/maven2/com/googlecode/gwt/inject/gin/1.0/gin-1.0.jar
[INFO] Unable to find resource 'com.google.code.findbugs:jsr305:jar:1.3.9' in repository gerrit-maven-repository
(http://gerrit.googlecode.com/svn/mavenrepo/)
Downloading: http://repo1.maven.org/maven2/com/google/code/findbugs/jsr305/1.3.9/jsr305-1.3.9.jar
[INFO] Unable to find resource 'com.google.inject:guice:jar:2.0' in repository gerrit-maven-repository
(http://gerrit.googlecode.com/svn/mavenrepo/)
Downloading: http://repo1.maven.org/maven2/com/google/inject/guice/2.0/guice-2.0.jar
86K downloaded  (gwtexpui-1.2.1.jar)
[WARNING] *** CHECKSUM FAILED - Checksum failed on download: local = 'defde6503b6db86b56b1673f106f6afbce909275';
remote = '2e0353184fc79533629e3caf221e64c9de780139' - RETRYING
Downloading: http://gerrit.googlecode.com/svn/mavenrepo//gwtexpui/gwtexpui/1.2.1/gwtexpui-1.2.1.jar
86K downloaded  (gwtexpui-1.2.1.jar)
[WARNING] *** CHECKSUM FAILED - Checksum failed on download: local = 'defde6503b6db86b56b1673f106f6afbce909275';
remote = '2e0353184fc79533629e3caf221e64c9de780139' - IGNORING
Downloading: http://gerrit.googlecode.com/svn/mavenrepo//gwtexpui/gwtexpui/1.2.1/gwtexpui-1.2.1-sources.jar
70K downloaded  (gwtexpui-1.2.1-sources.jar)
[WARNING] *** CHECKSUM FAILED - Checksum failed on download: local = '5f890991bd737547c7c1f135cc216ac00b463f86';
remote = '0c86c4cfcb381838fa3940f03147636bd1059fea' - RETRYING
Downloading: http://gerrit.googlecode.com/svn/mavenrepo//gwtexpui/gwtexpui/1.2.1/gwtexpui-1.2.1-sources.jar
70K downloaded  (gwtexpui-1.2.1-sources.jar)
[WARNING] *** CHECKSUM FAILED - Checksum failed on download: local = '5f890991bd737547c7c1f135cc216ac00b463f86';
remote = '0c86c4cfcb381838fa3940f03147636bd1059fea' - IGNORING


Downloading: http://gerrit.googlecode.com/svn/mavenrepo//com/google/gwt/gwt-user/2.0.3/gwt-user-2.0.3.jar
[INFO] Unable to find resource 'com.google.gwt:gwt-user:jar:2.0.3' in repository gerrit-maven-repository
(http://gerrit.googlecode.com/svn/mavenrepo/)
Downloading: http://repo1.maven.org/maven2/com/google/gwt/gwt-user/2.0.3/gwt-user-2.0.3.jar



[INFO] [resources:resources {execution: default-resources}]
[INFO] Using 'UTF-8' encoding to copy filtered resources.
[INFO] Copying 17 resources
[INFO] skip non existing resourceDirectory <https://hudson.apache.org/hudson/job/CXF-Trunk-JDK15/org.apache.cxf$cxf-rt-management-web/ws/src/main/resources>
[INFO] skip non existing resourceDirectory <https://hudson.apache.org/hudson/job/CXF-Trunk-JDK15/org.apache.cxf$cxf-rt-management-web/ws/src/main/resources-filtered>
[INFO] skip non existing resourceDirectory <https://hudson.apache.org/hudson/job/CXF-Trunk-JDK15/org.apache.cxf$cxf-rt-management-web/ws/target/generated/src/main/resources>
[INFO] Copying 3 resources
[INFO] [compiler:compile {execution: default-compile}]
[INFO] Compiling 105 source files to <https://hudson.apache.org/hudson/job/CXF-Trunk-JDK15/org.apache.cxf$cxf-rt-management-web/ws/target/war/WEB-INF/classes>
[INFO] -------------------------------------------------------------
[ERROR] COMPILATION ERROR : 
[INFO] -------------------------------------------------------------
[ERROR] <https://hudson.apache.org/hudson/job/CXF-Trunk-JDK15/org.apache.cxf$cxf-rt-management-web/ws/src/main/java/org/apache/cxf/management/web/browser/client/ui/ErrorDialog.java>:[34,-1]
cannot access com.google.gwtexpui.user.client.PluginSafePopupPanel
bad class file: /home/hudson/hudson-slave/workspace/CXF-Trunk-JDK15/.repository/gwtexpui/gwtexpui/1.2.1/gwtexpui-1.2.1.jar(com/google/gwtexpui/user/client/PluginSafePopupPanel.class)
class file has wrong version 50.0, should be 49.0
[ERROR] <https://hudson.apache.org/hudson/job/CXF-Trunk-JDK15/org.apache.cxf$cxf-rt-management-web/ws/src/main/java/org/apache/cxf/management/web/browser/client/ui/ErrorDialog.java>:[46,18]
cannot find symbol
symbol  : class LogBrowserResources
location: class org.apache.cxf.management.web.browser.client.ui.ErrorDialog
[ERROR] <https://hudson.apache.org/hudson/job/CXF-Trunk-JDK15/org.apache.cxf$cxf-rt-management-web/ws/src/main/java/org/apache/cxf/management/web/browser/client/ui/ErrorDialog.java>:[49,18]
cannot find symbol
symbol  : class LogBrowserConstans
location: class org.apache.cxf.management.web.browser.client.ui.ErrorDialog
[ERROR] <https://hudson.apache.org/hudson/job/CXF-Trunk-JDK15/org.apache.cxf$cxf-rt-management-web/ws/src/main/java/org/apache/cxf/management/web/browser/client/ui/ErrorDialog.java>:[55,41]
cannot find symbol
symbol  : class LogBrowserResources
location: class org.apache.cxf.management.web.browser.client.ui.ErrorDialog
[ERROR] <https://hudson.apache.org/hudson/job/CXF-Trunk-JDK15/org.apache.cxf$cxf-rt-management-web/ws/src/main/java/org/apache/cxf/management/web/browser/client/ui/ErrorDialog.java>:[56,41]
cannot find symbol
symbol  : class LogBrowserConstans
location: class org.apache.cxf.management.web.browser.client.ui.ErrorDialog
[ERROR] <https://hudson.apache.org/hudson/job/CXF-Trunk-JDK15/org.apache.cxf$cxf-rt-management-web/ws/src/main/java/org/apache/cxf/management/web/browser/client/ui/ErrorDialog.java>:[54,5]
cannot find symbol
symbol  : class Inject
location: class org.apache.cxf.management.web.browser.client.ui.ErrorDialog
[INFO] 6 errors 
[INFO] -------------------------------------------------------------
[HUDSON] Archiving <https://hudson.apache.org/hudson/job/CXF-Trunk-JDK15/org.apache.cxf$cxf-rt-management-web/ws/pom.xml>
to /home/hudson/hudson/jobs/CXF-Trunk-JDK15/modules/org.apache.cxf$cxf-rt-management-web/builds/2011-02-04_17-39-45/archive/org.apache.cxf/cxf-rt-management-web/2.4.0-SNAPSHOT/pom.xml
[INFO] ------------------------------------------------------------------------
[ERROR] BUILD FAILURE
[INFO] ------------------------------------------------------------------------
[INFO] Compilation failure

<https://hudson.apache.org/hudson/job/CXF-Trunk-JDK15/org.apache.cxf$cxf-rt-management-web/ws/src/main/java/org/apache/cxf/management/web/browser/client/ui/ErrorDialog.java>:[34,-1]
cannot access com.google.gwtexpui.user.client.PluginSafePopupPanel
bad class file: /home/hudson/hudson-slave/workspace/CXF-Trunk-JDK15/.repository/gwtexpui/gwtexpui/1.2.1/gwtexpui-1.2.1.jar(com/google/gwtexpui/user/client/PluginSafePopupPanel.class)
class file has wrong version 50.0, should be 49.0
<https://hudson.apache.org/hudson/job/CXF-Trunk-JDK15/org.apache.cxf$cxf-rt-management-web/ws/src/main/java/org/apache/cxf/management/web/browser/client/ui/ErrorDialog.java>:[46,18]
cannot find symbol
symbol  : class LogBrowserResources
location: class org.apache.cxf.management.web.browser.client.ui.ErrorDialog
<https://hudson.apache.org/hudson/job/CXF-Trunk-JDK15/org.apache.cxf$cxf-rt-management-web/ws/src/main/java/org/apache/cxf/management/web/browser/client/ui/ErrorDialog.java>:[49,18]
cannot find symbol
symbol  : class LogBrowserConstans
location: class org.apache.cxf.management.web.browser.client.ui.ErrorDialog
<https://hudson.apache.org/hudson/job/CXF-Trunk-JDK15/org.apache.cxf$cxf-rt-management-web/ws/src/main/java/org/apache/cxf/management/web/browser/client/ui/ErrorDialog.java>:[55,41]
cannot find symbol
symbol  : class LogBrowserResources
location: class org.apache.cxf.management.web.browser.client.ui.ErrorDialog
<https://hudson.apache.org/hudson/job/CXF-Trunk-JDK15/org.apache.cxf$cxf-rt-management-web/ws/src/main/java/org/apache/cxf/management/web/browser/client/ui/ErrorDialog.java>:[56,41]
cannot find symbol
symbol  : class LogBrowserConstans
location: class org.apache.cxf.management.web.browser.client.ui.ErrorDialog
<https://hudson.apache.org/hudson/job/CXF-Trunk-JDK15/org.apache.cxf$cxf-rt-management-web/ws/src/main/java/org/apache/cxf/management/web/browser/client/ui/ErrorDialog.java>:[54,5]
cannot find symbol
symbol  : class Inject
location: class org.apache.cxf.management.web.browser.client.ui.ErrorDialog

[INFO] ------------------------------------------------------------------------
[INFO] Trace
org.apache.maven.BuildFailureException: Compilation failure
	at org.apache.maven.lifecycle.DefaultLifecycleExecutor.executeGoals(DefaultLifecycleExecutor.java:715)
	at org.apache.maven.lifecycle.DefaultLifecycleExecutor.executeGoalWithLifecycle(DefaultLifecycleExecutor.java:556)
	at org.apache.maven.lifecycle.DefaultLifecycleExecutor.executeGoal(DefaultLifecycleExecutor.java:535)
	at org.apache.maven.lifecycle.DefaultLifecycleExecutor.executeGoalAndHandleFailures(DefaultLifecycleExecutor.java:387)
	at org.apache.maven.lifecycle.DefaultLifecycleExecutor.executeTaskSegments(DefaultLifecycleExecutor.java:348)
	at org.apache.maven.lifecycle.DefaultLifecycleExecutor.execute(DefaultLifecycleExecutor.java:180)
	at org.apache.maven.lifecycle.LifecycleExecutorInterceptor.execute(LifecycleExecutorInterceptor.java:65)
	at org.apache.maven.DefaultMaven.doExecute(DefaultMaven.java:328)
	at org.apache.maven.DefaultMaven.execute(DefaultMaven.java:138)
	at org.apache.maven.cli.MavenCli.main(MavenCli.java:362)
	at sun.reflect.NativeMethodAccessorImpl.invoke0(Native Method)
	at sun.reflect.NativeMethodAccessorImpl.invoke(NativeMethodAccessorImpl.java:39)
	at sun.reflect.DelegatingMethodAccessorImpl.invoke(DelegatingMethodAccessorImpl.java:25)
	at java.lang.reflect.Method.invoke(Method.java:592)
	at org.codehaus.classworlds.Launcher.launchEnhanced(Launcher.java:315)
	at org.codehaus.classworlds.Launcher.launch(Launcher.java:255)
	at hudson.maven.agent.Main.launch(Main.java:173)
	at hudson.maven.MavenBuilder.call(MavenBuilder.java:164)
	at hudson.maven.MavenModuleSetBuild$Builder.call(MavenModuleSetBuild.java:868)
	at hudson.maven.MavenModuleSetBuild$Builder.call(MavenModuleSetBuild.java:799)
	at hudson.remoting.UserRequest.perform(UserRequest.java:114)
	at hudson.remoting.UserRequest.perform(UserRequest.java:48)
	at hudson.remoting.Request$2.run(Request.java:270)
	at java.util.concurrent.Executors$RunnableAdapter.call(Executors.java:417)
	at java.util.concurrent.FutureTask$Sync.innerRun(FutureTask.java:269)
	at java.util.concurrent.FutureTask.run(FutureTask.java:123)
	at java.util.concurrent.ThreadPoolExecutor$Worker.runTask(ThreadPoolExecutor.java:651)
	at java.util.concurrent.ThreadPoolExecutor$Worker.run(ThreadPoolExecutor.java:676)
	at java.lang.Thread.run(Thread.java:595)
Caused by: org.apache.maven.plugin.CompilationFailureException: Compilation failure
	at org.apache.maven.plugin.AbstractCompilerMojo.execute(AbstractCompilerMojo.java:656)
	at org.apache.maven.plugin.CompilerMojo.execute(CompilerMojo.java:128)
	at org.apache.maven.plugin.DefaultPluginManager.executeMojo(DefaultPluginManager.java:490)
	at hudson.maven.agent.PluginManagerInterceptor.executeMojo(PluginManagerInterceptor.java:182)
	at org.apache.maven.lifecycle.DefaultLifecycleExecutor.executeGoals(DefaultLifecycleExecutor.java:694)
	... 28 more
[INFO] ------------------------------------------------------------------------
[INFO] Total time: 12 minutes 18 seconds
[INFO] Finished at: Fri Feb 04 17:52:48 UTC 2011
[INFO] Final Memory: 101M/179M
[INFO] ------------------------------------------------------------------------


Mime
View raw message