cxf-notifications mailing list archives

Site index · List index
Message view « Date » · « Thread »
Top « Date » · « Thread »
From Apache Hudson Server <hud...@hudson.apache.org>
Subject Build failed in Hudson: cxf-wss4j-1.6-port » Apache CXF Runtime HTTP Transport #6
Date Tue, 09 Nov 2010 16:15:01 GMT
See <https://hudson.apache.org/hudson/job/cxf-wss4j-1.6-port/org.apache.cxf$cxf-rt-transports-http/6/>

------------------------------------------
[...truncated 13 lines...]
[INFO] 
[INFO] [cxf-xml2fastinfoset:xml2fastinfoset {execution: xml2fastinfoset}]
[INFO] [cxf-xjc:xsdtojava {execution: generate-sources}]
Downloading: http://repo1.maven.org/maven2/org/apache/cxf/xjcplugins/cxf-xjc-pl/2.3.0/cxf-xjc-pl-2.3.0.pom

Downloading: http://repo1.maven.org/maven2/org/apache/cxf/xjcplugins/cxf-xjc-pl/2.3.0/cxf-xjc-pl-2.3.0.jar

[INFO] [remote-resources:process {execution: default}]
[INFO] [resources:resources {execution: default-resources}]
[INFO] Using 'UTF-8' encoding to copy filtered resources.
[INFO] Copying 6 resources
[INFO] Copying 10 resources
[INFO] skip non existing resourceDirectory <https://hudson.apache.org/hudson/job/cxf-wss4j-1.6-port/org.apache.cxf$cxf-rt-transports-http/ws/src/main/resources-filtered>
[INFO] Copying 2 resources
[INFO] Copying 3 resources
[INFO] [compiler:compile {execution: default-compile}]
[INFO] Compiling 62 source files to <https://hudson.apache.org/hudson/job/cxf-wss4j-1.6-port/org.apache.cxf$cxf-rt-transports-http/ws/target/classes>
[WARNING] <https://hudson.apache.org/hudson/job/cxf-wss4j-1.6-port/org.apache.cxf$cxf-rt-transports-http/ws/src/main/java/org/apache/cxf/transport/http/HttpServletRequestSnapshot.java>:[136,23]
getHeaders(java.lang.String) in org.apache.cxf.transport.http.HttpServletRequestSnapshot implements
getHeaders(java.lang.String) in javax.servlet.http.HttpServletRequest; return type requires
unchecked conversion
found   : java.util.Enumeration
required: java.util.Enumeration<java.lang.String>

[WARNING] <https://hudson.apache.org/hudson/job/cxf-wss4j-1.6-port/org.apache.cxf$cxf-rt-transports-http/ws/src/main/java/org/apache/cxf/transport/http/HttpServletRequestSnapshot.java>:[130,23]
getHeaderNames() in org.apache.cxf.transport.http.HttpServletRequestSnapshot implements getHeaderNames()
in javax.servlet.http.HttpServletRequest; return type requires unchecked conversion
found   : java.util.Enumeration
required: java.util.Enumeration<java.lang.String>

[WARNING] <https://hudson.apache.org/hudson/job/cxf-wss4j-1.6-port/org.apache.cxf$cxf-rt-transports-http/ws/src/main/java/org/apache/cxf/transport/http/HttpServletRequestSnapshot.java>:[232,23]
getLocales() in org.apache.cxf.transport.http.HttpServletRequestSnapshot implements getLocales()
in javax.servlet.ServletRequest; return type requires unchecked conversion
found   : java.util.Enumeration
required: java.util.Enumeration<java.util.Locale>

[INFO] [resources:testResources {execution: default-testResources}]
[INFO] Using 'UTF-8' encoding to copy filtered resources.
[INFO] Copying 8 resources
[INFO] skip non existing resourceDirectory <https://hudson.apache.org/hudson/job/cxf-wss4j-1.6-port/org.apache.cxf$cxf-rt-transports-http/ws/src/test/resources>
[INFO] skip non existing resourceDirectory <https://hudson.apache.org/hudson/job/cxf-wss4j-1.6-port/org.apache.cxf$cxf-rt-transports-http/ws/target/generated/src/test/resources>
[INFO] Copying 3 resources
[INFO] [compiler:testCompile {execution: default-testCompile}]
[INFO] Compiling 11 source files to <https://hudson.apache.org/hudson/job/cxf-wss4j-1.6-port/org.apache.cxf$cxf-rt-transports-http/ws/target/test-classes>
[INFO] -------------------------------------------------------------
[ERROR] COMPILATION ERROR : 
[INFO] -------------------------------------------------------------
[ERROR] Failure executing javac, but could not parse the error:


The system is out of resources.
Consult the following stack trace for details.
java.lang.OutOfMemoryError: PermGen space
	at java.lang.ClassLoader.defineClass1(Native Method)
	at java.lang.ClassLoader.defineClassCond(ClassLoader.java:632)
	at java.lang.ClassLoader.defineClass(ClassLoader.java:616)
	at java.security.SecureClassLoader.defineClass(SecureClassLoader.java:141)
	at java.net.URLClassLoader.defineClass(URLClassLoader.java:283)
	at java.net.URLClassLoader.access$000(URLClassLoader.java:58)
	at java.net.URLClassLoader$1.run(URLClassLoader.java:197)
	at java.security.AccessController.doPrivileged(Native Method)
	at java.net.URLClassLoader.findClass(URLClassLoader.java:190)
	at org.codehaus.plexus.compiler.javac.IsolatedClassLoader.loadClass(IsolatedClassLoader.java:56)
	at com.sun.tools.javac.code.Types.subst(Types.java:1923)
	at com.sun.tools.javac.code.Types$18.visitClassType(Types.java:1616)
	at com.sun.tools.javac.code.Types$18.visitClassType(Types.java:1591)
	at com.sun.tools.javac.code.Type$ClassType.accept(Type.java:554)
	at com.sun.tools.javac.code.Types$UnaryVisitor.visit(Types.java:3252)
	at com.sun.tools.javac.code.Types.supertype(Types.java:1588)
	at com.sun.tools.javac.code.Symbol$ClassSymbol.isSubClass(Symbol.java:738)
	at com.sun.tools.javac.code.Symbol.isMemberOf(Symbol.java:290)
	at com.sun.tools.javac.comp.Attr.visitIdent(Attr.java:1733)
	at com.sun.tools.javac.tree.JCTree$JCIdent.accept(JCTree.java:1547)
	at com.sun.tools.javac.comp.Attr.attribTree(Attr.java:360)
	at com.sun.tools.javac.comp.Attr.attribType(Attr.java:390)
	at com.sun.tools.javac.comp.MemberEnter.visitVarDef(MemberEnter.java:607)
	at com.sun.tools.javac.tree.JCTree$JCVariableDecl.accept(JCTree.java:691)
	at com.sun.tools.javac.comp.MemberEnter.memberEnter(MemberEnter.java:387)
	at com.sun.tools.javac.comp.MemberEnter.memberEnter(MemberEnter.java:399)
	at com.sun.tools.javac.comp.MemberEnter.finishClass(MemberEnter.java:410)
	at com.sun.tools.javac.comp.MemberEnter.finish(MemberEnter.java:1000)
	at com.sun.tools.javac.comp.MemberEnter.complete(MemberEnter.java:967)
	at com.sun.tools.javac.code.Symbol.complete(Symbol.java:386)
	at com.sun.tools.javac.code.Symbol$ClassSymbol.complete(Symbol.java:758)
	at com.sun.tools.javac.comp.Enter.complete(Enter.java:451)

[INFO] 1error
[INFO] -------------------------------------------------------------
[INFO] ------------------------------------------------------------------------
[ERROR] BUILD FAILURE
[INFO] ------------------------------------------------------------------------
[INFO] Compilation failure
Failure executing javac, but could not parse the error:


The system is out of resources.
Consult the following stack trace for details.
java.lang.OutOfMemoryError: PermGen space
	at java.lang.ClassLoader.defineClass1(Native Method)
	at java.lang.ClassLoader.defineClassCond(ClassLoader.java:632)
	at java.lang.ClassLoader.defineClass(ClassLoader.java:616)
	at java.security.SecureClassLoader.defineClass(SecureClassLoader.java:141)
	at java.net.URLClassLoader.defineClass(URLClassLoader.java:283)
	at java.net.URLClassLoader.access$000(URLClassLoader.java:58)
	at java.net.URLClassLoader$1.run(URLClassLoader.java:197)
	at java.security.AccessController.doPrivileged(Native Method)
	at java.net.URLClassLoader.findClass(URLClassLoader.java:190)
	at org.codehaus.plexus.compiler.javac.IsolatedClassLoader.loadClass(IsolatedClassLoader.java:56)
	at com.sun.tools.javac.code.Types.subst(Types.java:1923)
	at com.sun.tools.javac.code.Types$18.visitClassType(Types.java:1616)
	at com.sun.tools.javac.code.Types$18.visitClassType(Types.java:1591)
	at com.sun.tools.javac.code.Type$ClassType.accept(Type.java:554)
	at com.sun.tools.javac.code.Types$UnaryVisitor.visit(Types.java:3252)
	at com.sun.tools.javac.code.Types.supertype(Types.java:1588)
	at com.sun.tools.javac.code.Symbol$ClassSymbol.isSubClass(Symbol.java:738)
	at com.sun.tools.javac.code.Symbol.isMemberOf(Symbol.java:290)
	at com.sun.tools.javac.comp.Attr.visitIdent(Attr.java:1733)
	at com.sun.tools.javac.tree.JCTree$JCIdent.accept(JCTree.java:1547)
	at com.sun.tools.javac.comp.Attr.attribTree(Attr.java:360)
	at com.sun.tools.javac.comp.Attr.attribType(Attr.java:390)
	at com.sun.tools.javac.comp.MemberEnter.visitVarDef(MemberEnter.java:607)
	at com.sun.tools.javac.tree.JCTree$JCVariableDecl.accept(JCTree.java:691)
	at com.sun.tools.javac.comp.MemberEnter.memberEnter(MemberEnter.java:387)
	at com.sun.tools.javac.comp.MemberEnter.memberEnter(MemberEnter.java:399)
	at com.sun.tools.javac.comp.MemberEnter.finishClass(MemberEnter.java:410)
	at com.sun.tools.javac.comp.MemberEnter.finish(MemberEnter.java:1000)
	at com.sun.tools.javac.comp.MemberEnter.complete(MemberEnter.java:967)
	at com.sun.tools.javac.code.Symbol.complete(Symbol.java:386)
	at com.sun.tools.javac.code.Symbol$ClassSymbol.complete(Symbol.java:758)
	at com.sun.tools.javac.comp.Enter.complete(Enter.java:451)


[INFO] ------------------------------------------------------------------------
[INFO] Trace
org.apache.maven.BuildFailureException: Compilation failure
Failure executing javac, but could not parse the error:


The system is out of resources.
Consult the following stack trace for details.
java.lang.OutOfMemoryError: PermGen space
	at java.lang.ClassLoader.defineClass1(Native Method)
	at java.lang.ClassLoader.defineClassCond(ClassLoader.java:632)
	at java.lang.ClassLoader.defineClass(ClassLoader.java:616)
	at java.security.SecureClassLoader.defineClass(SecureClassLoader.java:141)
	at java.net.URLClassLoader.defineClass(URLClassLoader.java:283)
	at java.net.URLClassLoader.access$000(URLClassLoader.java:58)
	at java.net.URLClassLoader$1.run(URLClassLoader.java:197)
	at java.security.AccessController.doPrivileged(Native Method)
	at java.net.URLClassLoader.findClass(URLClassLoader.java:190)
	at org.codehaus.plexus.compiler.javac.IsolatedClassLoader.loadClass(IsolatedClassLoader.java:56)
	at com.sun.tools.javac.code.Types.subst(Types.java:1923)
	at com.sun.tools.javac.code.Types$18.visitClassType(Types.java:1616)
	at com.sun.tools.javac.code.Types$18.visitClassType(Types.java:1591)
	at com.sun.tools.javac.code.Type$ClassType.accept(Type.java:554)
	at com.sun.tools.javac.code.Types$UnaryVisitor.visit(Types.java:3252)
	at com.sun.tools.javac.code.Types.supertype(Types.java:1588)
	at com.sun.tools.javac.code.Symbol$ClassSymbol.isSubClass(Symbol.java:738)
	at com.sun.tools.javac.code.Symbol.isMemberOf(Symbol.java:290)
	at com.sun.tools.javac.comp.Attr.visitIdent(Attr.java:1733)
	at com.sun.tools.javac.tree.JCTree$JCIdent.accept(JCTree.java:1547)
	at com.sun.tools.javac.comp.Attr.attribTree(Attr.java:360)
	at com.sun.tools.javac.comp.Attr.attribType(Attr.java:390)
	at com.sun.tools.javac.comp.MemberEnter.visitVarDef(MemberEnter.java:607)
	at com.sun.tools.javac.tree.JCTree$JCVariableDecl.accept(JCTree.java:691)
	at com.sun.tools.javac.comp.MemberEnter.memberEnter(MemberEnter.java:387)
	at com.sun.tools.javac.comp.MemberEnter.memberEnter(MemberEnter.java:399)
	at com.sun.tools.javac.comp.MemberEnter.finishClass(MemberEnter.java:410)
	at com.sun.tools.javac.comp.MemberEnter.finish(MemberEnter.java:1000)
	at com.sun.tools.javac.comp.MemberEnter.complete(MemberEnter.java:967)
	at com.sun.tools.javac.code.Symbol.complete(Symbol.java:386)
	at com.sun.tools.javac.code.Symbol$ClassSymbol.complete(Symbol.java:758)
	at com.sun.tools.javac.comp.Enter.complete(Enter.java:451)


	at org.apache.maven.lifecycle.DefaultLifecycleExecutor.executeGoals(DefaultLifecycleExecutor.java:715)
	at org.apache.maven.lifecycle.DefaultLifecycleExecutor.executeGoalWithLifecycle(DefaultLifecycleExecutor.java:556)
	at org.apache.maven.lifecycle.DefaultLifecycleExecutor.executeGoal(DefaultLifecycleExecutor.java:535)
	at org.apache.maven.lifecycle.DefaultLifecycleExecutor.executeGoalAndHandleFailures(DefaultLifecycleExecutor.java:387)
	at org.apache.maven.lifecycle.DefaultLifecycleExecutor.executeTaskSegments(DefaultLifecycleExecutor.java:348)
	at org.apache.maven.lifecycle.DefaultLifecycleExecutor.execute(DefaultLifecycleExecutor.java:180)
	at org.apache.maven.lifecycle.LifecycleExecutorInterceptor.execute(LifecycleExecutorInterceptor.java:65)
	at org.apache.maven.DefaultMaven.doExecute(DefaultMaven.java:328)
	at org.apache.maven.DefaultMaven.execute(DefaultMaven.java:138)
	at org.apache.maven.cli.MavenCli.main(MavenCli.java:362)
	at sun.reflect.NativeMethodAccessorImpl.invoke0(Native Method)
	at sun.reflect.NativeMethodAccessorImpl.invoke(NativeMethodAccessorImpl.java:39)
	at sun.reflect.DelegatingMethodAccessorImpl.invoke(DelegatingMethodAccessorImpl.java:25)
	at java.lang.reflect.Method.invoke(Method.java:597)
	at org.codehaus.classworlds.Launcher.launchEnhanced(Launcher.java:315)
	at org.codehaus.classworlds.Launcher.launch(Launcher.java:255)
	at hudson.maven.agent.Main.launch(Main.java:165)
	at hudson.maven.MavenBuilder.call(MavenBuilder.java:165)
	at hudson.maven.MavenModuleSetBuild$Builder.call(MavenModuleSetBuild.java:750)
	at hudson.maven.MavenModuleSetBuild$Builder.call(MavenModuleSetBuild.java:694)
	at hudson.remoting.UserRequest.perform(UserRequest.java:114)
	at hudson.remoting.UserRequest.perform(UserRequest.java:48)
	at hudson.remoting.Request$2.run(Request.java:270)
	at java.util.concurrent.Executors$RunnableAdapter.call(Executors.java:441)
	at java.util.concurrent.FutureTask$Sync.innerRun(FutureTask.java:303)
	at java.util.concurrent.FutureTask.run(FutureTask.java:138)
	at java.util.concurrent.ThreadPoolExecutor$Worker.runTask(ThreadPoolExecutor.java:886)
	at java.util.concurrent.ThreadPoolExecutor$Worker.run(ThreadPoolExecutor.java:908)
	at java.lang.Thread.run(Thread.java:619)
Caused by: org.apache.maven.plugin.CompilationFailureException: Compilation failure
Failure executing javac, but could not parse the error:


The system is out of resources.
Consult the following stack trace for details.
java.lang.OutOfMemoryError: PermGen space
	at java.lang.ClassLoader.defineClass1(Native Method)
	at java.lang.ClassLoader.defineClassCond(ClassLoader.java:632)
	at java.lang.ClassLoader.defineClass(ClassLoader.java:616)
	at java.security.SecureClassLoader.defineClass(SecureClassLoader.java:141)
	at java.net.URLClassLoader.defineClass(URLClassLoader.java:283)
	at java.net.URLClassLoader.access$000(URLClassLoader.java:58)
	at java.net.URLClassLoader$1.run(URLClassLoader.java:197)
	at java.security.AccessController.doPrivileged(Native Method)
	at java.net.URLClassLoader.findClass(URLClassLoader.java:190)
	at org.codehaus.plexus.compiler.javac.IsolatedClassLoader.loadClass(IsolatedClassLoader.java:56)
	at com.sun.tools.javac.code.Types.subst(Types.java:1923)
	at com.sun.tools.javac.code.Types$18.visitClassType(Types.java:1616)
	at com.sun.tools.javac.code.Types$18.visitClassType(Types.java:1591)
	at com.sun.tools.javac.code.Type$ClassType.accept(Type.java:554)
	at com.sun.tools.javac.code.Types$UnaryVisitor.visit(Types.java:3252)
	at com.sun.tools.javac.code.Types.supertype(Types.java:1588)
	at com.sun.tools.javac.code.Symbol$ClassSymbol.isSubClass(Symbol.java:738)
	at com.sun.tools.javac.code.Symbol.isMemberOf(Symbol.java:290)
	at com.sun.tools.javac.comp.Attr.visitIdent(Attr.java:1733)
	at com.sun.tools.javac.tree.JCTree$JCIdent.accept(JCTree.java:1547)
	at com.sun.tools.javac.comp.Attr.attribTree(Attr.java:360)
	at com.sun.tools.javac.comp.Attr.attribType(Attr.java:390)
	at com.sun.tools.javac.comp.MemberEnter.visitVarDef(MemberEnter.java:607)
	at com.sun.tools.javac.tree.JCTree$JCVariableDecl.accept(JCTree.java:691)
	at com.sun.tools.javac.comp.MemberEnter.memberEnter(MemberEnter.java:387)
	at com.sun.tools.javac.comp.MemberEnter.memberEnter(MemberEnter.java:399)
	at com.sun.tools.javac.comp.MemberEnter.finishClass(MemberEnter.java:410)
	at com.sun.tools.javac.comp.MemberEnter.finish(MemberEnter.java:1000)
	at com.sun.tools.javac.comp.MemberEnter.complete(MemberEnter.java:967)
	at com.sun.tools.javac.code.Symbol.complete(Symbol.java:386)
	at com.sun.tools.javac.code.Symbol$ClassSymbol.complete(Symbol.java:758)
	at com.sun.tools.javac.comp.Enter.complete(Enter.java:451)


	at org.apache.maven.plugin.AbstractCompilerMojo.execute(AbstractCompilerMojo.java:656)
	at org.apache.maven.plugin.TestCompilerMojo.execute(TestCompilerMojo.java:161)
	at org.apache.maven.plugin.DefaultPluginManager.executeMojo(DefaultPluginManager.java:490)
	at hudson.maven.agent.PluginManagerInterceptor.executeMojo(PluginManagerInterceptor.java:182)
	at org.apache.maven.lifecycle.DefaultLifecycleExecutor.executeGoals(DefaultLifecycleExecutor.java:694)
	... 28 more
[INFO] ------------------------------------------------------------------------
[INFO] Total time: 6 minutes 30 seconds
[INFO] Finished at: Tue Nov 09 16:15:01 UTC 2010
[INFO] Final Memory: 119M/964M
[INFO] ------------------------------------------------------------------------


Mime
View raw message