cxf-notifications mailing list archives

Site index · List index
Message view « Date » · « Thread »
Top « Date » · « Thread »
From Apache Hudson Server <hud...@hudson.apache.org>
Subject Build failed in Hudson: CXF-trunk-deploy #405
Date Sat, 09 Oct 2010 06:21:18 GMT
See <https://hudson.apache.org/hudson/job/CXF-trunk-deploy/405/changes>

Changes:

[sergeyb] [CXF-3052] : Optional support for decoupled faults in case of oneway requests

------------------------------------------
Started by an SCM change
Building remotely on ubuntu1
Updating http://svn.apache.org/repos/asf/cxf/trunk
AU        rt/ws/addr/src/test/java/org/apache/cxf/ws/addressing/soap/OneWayDecoupledFaultHandlerTest.java
AU        rt/ws/addr/src/main/java/org/apache/cxf/ws/addressing/soap/OneWayDecoupledFaultHandler.java
U         rt/ws/addr/src/main/java/org/apache/cxf/ws/addressing/soap/MAPCodec.java
At revision 1006109
[locks-and-latches] Checking to see if we really have the locks
[locks-and-latches] Have all the locks, build can start
Parsing POMs
[INFO ] snapshot org.apache.cxf.systests:cxf-systests-container-integration:2.3.0-SNAPSHOT:
checking for updates from maven2-repository.dev.java.net
[locks-and-latches] Releasing all the locks
[locks-and-latches] All the locks released
ERROR: Failed to parse POMs
hudson.util.IOException2: remote file operation failed: <https://hudson.apache.org/hudson/job/CXF-trunk-deploy/ws/trunk>
at hudson.remoting.Channel@6e0d168c:ubuntu1
	at hudson.FilePath.act(FilePath.java:749)
	at hudson.FilePath.act(FilePath.java:735)
	at hudson.maven.MavenModuleSetBuild$RunnerImpl.parsePoms(MavenModuleSetBuild.java:519)
	at hudson.maven.MavenModuleSetBuild$RunnerImpl.doRun(MavenModuleSetBuild.java:405)
	at hudson.model.AbstractBuild$AbstractRunner.run(AbstractBuild.java:416)
	at hudson.model.Run.run(Run.java:1273)
	at hudson.maven.MavenModuleSetBuild.run(MavenModuleSetBuild.java:291)
	at hudson.model.ResourceController.execute(ResourceController.java:88)
	at hudson.model.Executor.run(Executor.java:129)
Caused by: hudson.remoting.ProxyException: hudson.maven.MavenModuleSetBuild$MavenExecutionException:
org.apache.maven.project.ProjectBuildingException: Cannot find parent: org.apache.cxf.systests:cxf-systests-container-integration
for project: org.apache.cxf.systests:cxf-systests-ci-grizzly:jar:2.3.0-SNAPSHOT for project
org.apache.cxf.systests:cxf-systests-ci-grizzly:jar:2.3.0-SNAPSHOT
	at hudson.maven.MavenModuleSetBuild$PomParser.invoke(MavenModuleSetBuild.java:898)
	at hudson.maven.MavenModuleSetBuild$PomParser.invoke(MavenModuleSetBuild.java:796)
	at hudson.FilePath$FileCallableWrapper.call(FilePath.java:1899)
	at hudson.remoting.UserRequest.perform(UserRequest.java:114)
	at hudson.remoting.UserRequest.perform(UserRequest.java:48)
	at hudson.remoting.Request$2.run(Request.java:270)
	at java.util.concurrent.Executors$RunnableAdapter.call(Executors.java:471)
	at java.util.concurrent.FutureTask$Sync.innerRun(FutureTask.java:334)
	at java.util.concurrent.FutureTask.run(FutureTask.java:166)
	at java.util.concurrent.ThreadPoolExecutor.runWorker(ThreadPoolExecutor.java:1110)
	at java.util.concurrent.ThreadPoolExecutor$Worker.run(ThreadPoolExecutor.java:603)
	at java.lang.Thread.run(Thread.java:636)
Caused by: hudson.remoting.ProxyException: org.apache.maven.project.ProjectBuildingException:
Cannot find parent: org.apache.cxf.systests:cxf-systests-container-integration for project:
org.apache.cxf.systests:cxf-systests-ci-grizzly:jar:2.3.0-SNAPSHOT for project org.apache.cxf.systests:cxf-systests-ci-grizzly:jar:2.3.0-SNAPSHOT
	at org.apache.maven.project.DefaultMavenProjectBuilder.assembleLineage(DefaultMavenProjectBuilder.java:1370)
	at org.apache.maven.project.DefaultMavenProjectBuilder.buildInternal(DefaultMavenProjectBuilder.java:821)
	at org.apache.maven.project.DefaultMavenProjectBuilder.buildFromSourceFileInternal(DefaultMavenProjectBuilder.java:506)
	at org.apache.maven.project.DefaultMavenProjectBuilder.build(DefaultMavenProjectBuilder.java:215)
	at hudson.maven.MavenEmbedder.readProject(MavenEmbedder.java:332)
	at hudson.maven.MavenUtil.resolveModules(MavenUtil.java:226)
	at hudson.maven.MavenUtil.resolveModules(MavenUtil.java:227)
	at hudson.maven.MavenUtil.resolveModules(MavenUtil.java:227)
	at hudson.maven.MavenModuleSetBuild$PomParser.invoke(MavenModuleSetBuild.java:880)
	... 11 more
Caused by: hudson.remoting.ProxyException: org.apache.maven.project.ProjectBuildingException:
POM 'org.apache.cxf.systests:cxf-systests-container-integration' not found in repository:
Unable to download the artifact from any repository

  org.apache.cxf.systests:cxf-systests-container-integration:pom:2.3.0-SNAPSHOT

from the specified remote repositories:
  maven2-repository.dev.java.net (http://download.java.net/maven/2/),
  central (http://repo1.maven.org/maven2)
 for project org.apache.cxf.systests:cxf-systests-container-integration
	at org.apache.maven.project.DefaultMavenProjectBuilder.findModelFromRepository(DefaultMavenProjectBuilder.java:603)
	at org.apache.maven.project.DefaultMavenProjectBuilder.assembleLineage(DefaultMavenProjectBuilder.java:1366)
	... 19 more
Caused by: hudson.remoting.ProxyException: org.apache.maven.artifact.resolver.ArtifactNotFoundException:
Unable to download the artifact from any repository

  org.apache.cxf.systests:cxf-systests-container-integration:pom:2.3.0-SNAPSHOT

from the specified remote repositories:
  maven2-repository.dev.java.net (http://download.java.net/maven/2/),
  central (http://repo1.maven.org/maven2)

	at org.apache.maven.artifact.resolver.DefaultArtifactResolver.resolve(DefaultArtifactResolver.java:212)
	at org.apache.maven.artifact.resolver.DefaultArtifactResolver.resolve(DefaultArtifactResolver.java:74)
	at org.apache.maven.project.DefaultMavenProjectBuilder.findModelFromRepository(DefaultMavenProjectBuilder.java:556)
	... 20 more
Caused by: hudson.remoting.ProxyException: org.apache.maven.wagon.ResourceDoesNotExistException:
Unable to download the artifact from any repository
	at org.apache.maven.artifact.manager.DefaultWagonManager.getArtifact(DefaultWagonManager.java:331)
	at org.apache.maven.artifact.resolver.DefaultArtifactResolver.resolve(DefaultArtifactResolver.java:200)
	... 22 more


Mime
View raw message