cxf-notifications mailing list archives

Site index · List index
Message view « Date » · « Thread »
Top « Date » · « Thread »
From Apache Hudson Server <hud...@hudson.apache.org>
Subject Build failed in Hudson: CXF-Trunk-JDK15 #1441
Date Sun, 17 Oct 2010 23:41:10 GMT
See <https://hudson.apache.org/hudson/job/CXF-Trunk-JDK15/1441/changes>

Changes:

[bimargulies] CXF-3051: modify all POM props to start with cxf.

------------------------------------------
Started by an SCM change
Building remotely on ubuntu2
Updating http://svn.apache.org/repos/asf/cxf/trunk
U         rt/frontend/jaxrs/pom.xml
U         rt/frontend/simple/pom.xml
U         rt/frontend/jaxws/pom.xml
U         rt/transports/http/pom.xml
U         rt/transports/http-jetty/pom.xml
U         rt/transports/http-osgi/pom.xml
U         rt/databinding/jaxb/pom.xml
U         rt/databinding/sdo/pom.xml
U         rt/databinding/aegis/pom.xml
U         rt/databinding/xmlbeans/pom.xml
U         rt/javascript/pom.xml
U         rt/management-web/pom.xml
U         rt/ws/security/pom.xml
U         rt/ws/rm/pom.xml
U         rt/bindings/soap/pom.xml
U         rt/bindings/corba/pom.xml
U         common/common/pom.xml
U         parent/pom.xml
U         pom.xml
U         tools/javato/ws/pom.xml
U         tools/validator/pom.xml
U         tools/corba/pom.xml
U         tools/wsdlto/test/pom.xml
U         tools/wsdlto/core/pom.xml
U         tools/wsdlto/misc/pom.xml
U         systests/transports/pom.xml
U         systests/uncategorized/pom.xml
U         systests/databinding/pom.xml
U         systests/ws-specs/pom.xml
U         systests/jaxrs/pom.xml
U         systests/jaxws/pom.xml
U         api/pom.xml
At revision 1023598
[locks-and-latches] Checking to see if we really have the locks
[locks-and-latches] Have all the locks, build can start
Parsing POMs
[trunk] $ /home/hudson/tools/java/latest1.5/bin/java -ea -XX:MaxPermSize=192m -Xmx512M -cp
/home/hudson/hudson-slave/maven-agent.jar:/home/hudson/tools/maven/apache-maven-2.2.1/boot/classworlds-1.1.jar
hudson.maven.agent.Main /home/hudson/tools/maven/apache-maven-2.2.1 /home/hudson/hudson-slave/slave.jar
/home/hudson/hudson-slave/maven-interceptor.jar 40117 /home/hudson/hudson-slave/maven2.1-interceptor.jar
<===[HUDSON REMOTING CAPACITY]===>channel started
   + Error stacktraces are turned on.
Executing Maven:  -B -f <https://hudson.apache.org/hudson/job/CXF-Trunk-JDK15/ws/trunk/pom.xml>
-Dmaven.repo.local=<https://hudson.apache.org/hudson/job/CXF-Trunk-JDK15/ws/.repository>
-U -cpu -B -e clean install
[INFO] Scanning for projects...
[INFO] ------------------------------------------------------------------------
[ERROR] FATAL ERROR
[INFO] ------------------------------------------------------------------------
[INFO] Error building POM (may not be this project's POM).


Project ID: org.apache.cxf:cxf-common-utilities
POM Location: <https://hudson.apache.org/hudson/job/CXF-Trunk-JDK15/ws/trunk/common/common/pom.xml>
Validation Messages:

    [0]  'dependencies.dependency.groupId' with value 'cxf.saaj.impl.groupId}' does not match
a valid id pattern.
    [1]  'dependencies.dependency.version' is missing for cxf.saaj.impl.groupId}:saaj-impl:jar


Reason: Failed to validate POM for project org.apache.cxf:cxf-common-utilities at <https://hudson.apache.org/hudson/job/CXF-Trunk-JDK15/ws/trunk/common/common/pom.xml>


[INFO] ------------------------------------------------------------------------
[INFO] Trace
org.apache.maven.reactor.MavenExecutionException: Failed to validate POM for project org.apache.cxf:cxf-common-utilities
at <https://hudson.apache.org/hudson/job/CXF-Trunk-JDK15/ws/trunk/common/common/pom.xml>
	at org.apache.maven.DefaultMaven.getProjects(DefaultMaven.java:404)
	at org.apache.maven.DefaultMaven.doExecute(DefaultMaven.java:272)
	at org.apache.maven.DefaultMaven.execute(DefaultMaven.java:138)
	at org.apache.maven.cli.MavenCli.main(MavenCli.java:362)
	at sun.reflect.NativeMethodAccessorImpl.invoke0(Native Method)
	at sun.reflect.NativeMethodAccessorImpl.invoke(NativeMethodAccessorImpl.java:39)
	at sun.reflect.DelegatingMethodAccessorImpl.invoke(DelegatingMethodAccessorImpl.java:25)
	at java.lang.reflect.Method.invoke(Method.java:592)
	at org.codehaus.classworlds.Launcher.launchEnhanced(Launcher.java:315)
	at org.codehaus.classworlds.Launcher.launch(Launcher.java:255)
	at hudson.maven.agent.Main.launch(Main.java:165)
	at hudson.maven.MavenBuilder.call(MavenBuilder.java:165)
	at hudson.maven.MavenModuleSetBuild$Builder.call(MavenModuleSetBuild.java:694)
	at hudson.maven.MavenModuleSetBuild$Builder.call(MavenModuleSetBuild.java:638)
	at hudson.remoting.UserRequest.perform(UserRequest.java:114)
	at hudson.remoting.UserRequest.perform(UserRequest.java:48)
	at hudson.remoting.Request$2.run(Request.java:270)
	at java.util.concurrent.Executors$RunnableAdapter.call(Executors.java:417)
	at java.util.concurrent.FutureTask$Sync.innerRun(FutureTask.java:269)
	at java.util.concurrent.FutureTask.run(FutureTask.java:123)
	at java.util.concurrent.ThreadPoolExecutor$Worker.runTask(ThreadPoolExecutor.java:651)
	at java.util.concurrent.ThreadPoolExecutor$Worker.run(ThreadPoolExecutor.java:676)
	at java.lang.Thread.run(Thread.java:595)
Caused by: org.apache.maven.project.InvalidProjectModelException: Failed to validate POM for
project org.apache.cxf:cxf-common-utilities at <https://hudson.apache.org/hudson/job/CXF-Trunk-JDK15/ws/trunk/common/common/pom.xml>
	at org.apache.maven.project.DefaultMavenProjectBuilder.processProjectLogic(DefaultMavenProjectBuilder.java:1077)
	at org.apache.maven.project.DefaultMavenProjectBuilder.buildInternal(DefaultMavenProjectBuilder.java:880)
	at org.apache.maven.project.DefaultMavenProjectBuilder.buildFromSourceFileInternal(DefaultMavenProjectBuilder.java:508)
	at org.apache.maven.project.DefaultMavenProjectBuilder.build(DefaultMavenProjectBuilder.java:200)
	at org.apache.maven.DefaultMaven.getProject(DefaultMaven.java:604)
	at org.apache.maven.DefaultMaven.collectProjects(DefaultMaven.java:487)
	at org.apache.maven.DefaultMaven.collectProjects(DefaultMaven.java:560)
	at org.apache.maven.DefaultMaven.collectProjects(DefaultMaven.java:560)
	at org.apache.maven.DefaultMaven.getProjects(DefaultMaven.java:391)
	... 22 more
[INFO] ------------------------------------------------------------------------
[INFO] Total time: < 1 second
[INFO] Finished at: Sun Oct 17 23:41:08 UTC 2010
[INFO] Final Memory: 2M/13M
[INFO] ------------------------------------------------------------------------
channel stopped
[locks-and-latches] Releasing all the locks
[locks-and-latches] All the locks released


Mime
View raw message