cxf-notifications mailing list archives

Site index · List index
Message view « Date » · « Thread »
Top « Date » · « Thread »
From Apache Hudson Server <hud...@hudson.apache.org>
Subject Build failed in Hudson: CXF-Trunk-JDK15 » Apache CXF Common Utilities #1455
Date Sat, 23 Oct 2010 03:28:22 GMT
See <https://hudson.apache.org/hudson/job/CXF-Trunk-JDK15/org.apache.cxf$cxf-common-utilities/1455/>

------------------------------------------
[INFO] ------------------------------------------------------------------------
[INFO] Building Apache CXF Common Utilities
[INFO]    task-segment: [clean, install]
[INFO] ------------------------------------------------------------------------
[INFO] [clean:clean {execution: default-clean}]
[INFO] Deleting <https://hudson.apache.org/hudson/job/CXF-Trunk-JDK15/org.apache.cxf$cxf-common-utilities/ws/target>
[INFO] [cxf-xml2fastinfoset:xml2fastinfoset {execution: xml2fastinfoset}]
[INFO] [remote-resources:process {execution: default}]
[INFO] snapshot org.apache.ws.commons.schema:XmlSchema:2.0-SNAPSHOT: checking for updates
from apache.snapshots
Downloading: http://repo1.maven.org/maven2/com/sun/xml/messaging/saaj/saaj-impl/1.3.4/saaj-impl-1.3.4.pom
[INFO] Unable to find resource 'com.sun.xml.messaging.saaj:saaj-impl:pom:1.3.4' in repository
central (http://repo1.maven.org/maven2)
Downloading: http://repo1.maven.org/maven2/com/sun/xml/messaging/saaj/saaj-impl/1.3.4/saaj-impl-1.3.4.jar
[INFO] Unable to find resource 'com.sun.xml.messaging.saaj:saaj-impl:jar:1.3.4' in repository
central (http://repo1.maven.org/maven2)
[HUDSON] Archiving <https://hudson.apache.org/hudson/job/CXF-Trunk-JDK15/org.apache.cxf$cxf-common-utilities/ws/pom.xml>
to /home/hudson/hudson/jobs/CXF-Trunk-JDK15/modules/org.apache.cxf$cxf-common-utilities/builds/2010-10-23_03-27-49/archive/org.apache.cxf/cxf-common-utilities/2.4.0-SNAPSHOT/pom.xml
[INFO] ------------------------------------------------------------------------
[ERROR] BUILD ERROR
[INFO] ------------------------------------------------------------------------
[INFO] Failed to resolve artifact.

Missing:
----------
1) com.sun.xml.messaging.saaj:saaj-impl:jar:1.3.4

  Try downloading the file manually from the project website.

  Then, install it using the command: 
      mvn install:install-file -DgroupId=com.sun.xml.messaging.saaj -DartifactId=saaj-impl
-Dversion=1.3.4 -Dpackaging=jar -Dfile=/path/to/file

  Alternatively, if you host your own repository you can deploy the file there: 
      mvn deploy:deploy-file -DgroupId=com.sun.xml.messaging.saaj -DartifactId=saaj-impl -Dversion=1.3.4
-Dpackaging=jar -Dfile=/path/to/file -Durl=[url] -DrepositoryId=[id]

  Path to dependency: 
  	1) org.apache.cxf:cxf-common-utilities:jar:2.4.0-SNAPSHOT
  	2) com.sun.xml.messaging.saaj:saaj-impl:jar:1.3.4

----------
1 required artifact is missing.

for artifact: 
  org.apache.cxf:cxf-common-utilities:jar:2.4.0-SNAPSHOT

from the specified remote repositories:
  central (http://repo1.maven.org/maven2),
  Nexus (http://repository.apache.org/snapshots)



[INFO] ------------------------------------------------------------------------
[INFO] Trace
org.apache.maven.lifecycle.LifecycleExecutionException: Failed to resolve dependencies for
one or more projects in the reactor. Reason: Missing:
----------
1) com.sun.xml.messaging.saaj:saaj-impl:jar:1.3.4

  Try downloading the file manually from the project website.

  Then, install it using the command: 
      mvn install:install-file -DgroupId=com.sun.xml.messaging.saaj -DartifactId=saaj-impl
-Dversion=1.3.4 -Dpackaging=jar -Dfile=/path/to/file

  Alternatively, if you host your own repository you can deploy the file there: 
      mvn deploy:deploy-file -DgroupId=com.sun.xml.messaging.saaj -DartifactId=saaj-impl -Dversion=1.3.4
-Dpackaging=jar -Dfile=/path/to/file -Durl=[url] -DrepositoryId=[id]

  Path to dependency: 
  	1) org.apache.cxf:cxf-common-utilities:jar:2.4.0-SNAPSHOT
  	2) com.sun.xml.messaging.saaj:saaj-impl:jar:1.3.4

----------
1 required artifact is missing.

for artifact: 
  org.apache.cxf:cxf-common-utilities:jar:2.4.0-SNAPSHOT

from the specified remote repositories:
  central (http://repo1.maven.org/maven2),
  Nexus (http://repository.apache.org/snapshots)


	at org.apache.maven.lifecycle.DefaultLifecycleExecutor.executeGoals(DefaultLifecycleExecutor.java:719)
	at org.apache.maven.lifecycle.DefaultLifecycleExecutor.executeGoalWithLifecycle(DefaultLifecycleExecutor.java:556)
	at org.apache.maven.lifecycle.DefaultLifecycleExecutor.executeGoal(DefaultLifecycleExecutor.java:535)
	at org.apache.maven.lifecycle.DefaultLifecycleExecutor.executeGoalAndHandleFailures(DefaultLifecycleExecutor.java:387)
	at org.apache.maven.lifecycle.DefaultLifecycleExecutor.executeTaskSegments(DefaultLifecycleExecutor.java:348)
	at org.apache.maven.lifecycle.DefaultLifecycleExecutor.execute(DefaultLifecycleExecutor.java:180)
	at org.apache.maven.lifecycle.LifecycleExecutorInterceptor.execute(LifecycleExecutorInterceptor.java:65)
	at org.apache.maven.DefaultMaven.doExecute(DefaultMaven.java:328)
	at org.apache.maven.DefaultMaven.execute(DefaultMaven.java:138)
	at org.apache.maven.cli.MavenCli.main(MavenCli.java:362)
	at sun.reflect.NativeMethodAccessorImpl.invoke0(Native Method)
	at sun.reflect.NativeMethodAccessorImpl.invoke(NativeMethodAccessorImpl.java:39)
	at sun.reflect.DelegatingMethodAccessorImpl.invoke(DelegatingMethodAccessorImpl.java:25)
	at java.lang.reflect.Method.invoke(Method.java:592)
	at org.codehaus.classworlds.Launcher.launchEnhanced(Launcher.java:315)
	at org.codehaus.classworlds.Launcher.launch(Launcher.java:255)
	at hudson.maven.agent.Main.launch(Main.java:165)
	at hudson.maven.MavenBuilder.call(MavenBuilder.java:165)
	at hudson.maven.MavenModuleSetBuild$Builder.call(MavenModuleSetBuild.java:694)
	at hudson.maven.MavenModuleSetBuild$Builder.call(MavenModuleSetBuild.java:638)
	at hudson.remoting.UserRequest.perform(UserRequest.java:114)
	at hudson.remoting.UserRequest.perform(UserRequest.java:48)
	at hudson.remoting.Request$2.run(Request.java:270)
	at java.util.concurrent.Executors$RunnableAdapter.call(Executors.java:417)
	at java.util.concurrent.FutureTask$Sync.innerRun(FutureTask.java:269)
	at java.util.concurrent.FutureTask.run(FutureTask.java:123)
	at java.util.concurrent.ThreadPoolExecutor$Worker.runTask(ThreadPoolExecutor.java:651)
	at java.util.concurrent.ThreadPoolExecutor$Worker.run(ThreadPoolExecutor.java:676)
	at java.lang.Thread.run(Thread.java:595)
Caused by: org.apache.maven.plugin.MojoExecutionException: Failed to resolve dependencies
for one or more projects in the reactor. Reason: Missing:
----------
1) com.sun.xml.messaging.saaj:saaj-impl:jar:1.3.4

  Try downloading the file manually from the project website.

  Then, install it using the command: 
      mvn install:install-file -DgroupId=com.sun.xml.messaging.saaj -DartifactId=saaj-impl
-Dversion=1.3.4 -Dpackaging=jar -Dfile=/path/to/file

  Alternatively, if you host your own repository you can deploy the file there: 
      mvn deploy:deploy-file -DgroupId=com.sun.xml.messaging.saaj -DartifactId=saaj-impl -Dversion=1.3.4
-Dpackaging=jar -Dfile=/path/to/file -Durl=[url] -DrepositoryId=[id]

  Path to dependency: 
  	1) org.apache.cxf:cxf-common-utilities:jar:2.4.0-SNAPSHOT
  	2) com.sun.xml.messaging.saaj:saaj-impl:jar:1.3.4

----------
1 required artifact is missing.

for artifact: 
  org.apache.cxf:cxf-common-utilities:jar:2.4.0-SNAPSHOT

from the specified remote repositories:
  central (http://repo1.maven.org/maven2),
  Nexus (http://repository.apache.org/snapshots)


	at org.apache.maven.plugin.resources.remote.ProcessRemoteResourcesMojo.resolveProjectArtifacts(ProcessRemoteResourcesMojo.java:702)
	at org.apache.maven.plugin.resources.remote.ProcessRemoteResourcesMojo.getProjects(ProcessRemoteResourcesMojo.java:602)
	at org.apache.maven.plugin.resources.remote.ProcessRemoteResourcesMojo.configureVelocityContext(ProcessRemoteResourcesMojo.java:969)
	at org.apache.maven.plugin.resources.remote.ProcessRemoteResourcesMojo.execute(ProcessRemoteResourcesMojo.java:492)
	at org.apache.maven.plugin.DefaultPluginManager.executeMojo(DefaultPluginManager.java:490)
	at hudson.maven.agent.PluginManagerInterceptor.executeMojo(PluginManagerInterceptor.java:182)
	at org.apache.maven.lifecycle.DefaultLifecycleExecutor.executeGoals(DefaultLifecycleExecutor.java:694)
	... 28 more
Caused by: org.apache.maven.artifact.resolver.MultipleArtifactsNotFoundException: Missing:
----------
1) com.sun.xml.messaging.saaj:saaj-impl:jar:1.3.4

  Try downloading the file manually from the project website.

  Then, install it using the command: 
      mvn install:install-file -DgroupId=com.sun.xml.messaging.saaj -DartifactId=saaj-impl
-Dversion=1.3.4 -Dpackaging=jar -Dfile=/path/to/file

  Alternatively, if you host your own repository you can deploy the file there: 
      mvn deploy:deploy-file -DgroupId=com.sun.xml.messaging.saaj -DartifactId=saaj-impl -Dversion=1.3.4
-Dpackaging=jar -Dfile=/path/to/file -Durl=[url] -DrepositoryId=[id]

  Path to dependency: 
  	1) org.apache.cxf:cxf-common-utilities:jar:2.4.0-SNAPSHOT
  	2) com.sun.xml.messaging.saaj:saaj-impl:jar:1.3.4

----------
1 required artifact is missing.

for artifact: 
  org.apache.cxf:cxf-common-utilities:jar:2.4.0-SNAPSHOT

from the specified remote repositories:
  central (http://repo1.maven.org/maven2),
  Nexus (http://repository.apache.org/snapshots)


	at org.apache.maven.artifact.resolver.DefaultArtifactResolver.resolveTransitively(DefaultArtifactResolver.java:360)
	at org.apache.maven.artifact.resolver.DefaultArtifactResolver.resolveTransitively(DefaultArtifactResolver.java:304)
	at org.apache.maven.shared.artifact.resolver.DefaultProjectDependenciesResolver.resolve(DefaultProjectDependenciesResolver.java:140)
	at org.apache.maven.shared.artifact.resolver.DefaultProjectDependenciesResolver.resolve(DefaultProjectDependenciesResolver.java:187)
	at org.apache.maven.plugin.resources.remote.ProcessRemoteResourcesMojo.resolveProjectArtifacts(ProcessRemoteResourcesMojo.java:697)
	... 34 more
[INFO] ------------------------------------------------------------------------
[INFO] Total time: 22 seconds
[INFO] Finished at: Sat Oct 23 03:28:22 UTC 2010
[INFO] Final Memory: 38M/81M
[INFO] ------------------------------------------------------------------------


Mime
View raw message