cxf-notifications mailing list archives

Site index · List index
Message view « Date » · « Thread »
Top « Date » · « Thread »
From Apache Hudson Server <hud...@hudson.apache.org>
Subject Build failed in Hudson: CXF-2.2.x-JDK15 #536
Date Thu, 30 Sep 2010 21:35:45 GMT
See <https://hudson.apache.org/hudson/job/CXF-2.2.x-JDK15/536/changes>

Changes:

[dkulp] Blocked revisions 1000548,1000620 via svnmerge

........
  r1000548 | dkulp | 2010-09-23 13:22:41 -0400 (Thu, 23 Sep 2010) | 1 line
  
  Exclude some unrequired deps
........
  r1000620 | dkulp | 2010-09-23 16:55:57 -0400 (Thu, 23 Sep 2010) | 1 line
  
  Add readme to let people know we can provide raw results if requested.
........

[dkulp] Merged revisions 1003251 via svnmerge from 
https://svn.apache.org/repos/asf/cxf/trunk

........
  r1003251 | dkulp | 2010-09-30 16:49:34 -0400 (Thu, 30 Sep 2010) | 1 line
  
  [CXF-3004] Make sure the response codes for ws-add and ws-rm things are correct
........

[dkulp] Merged revisions 1002841 via svnmerge from 
https://svn.apache.org/repos/asf/cxf/trunk

........
  r1002841 | dkulp | 2010-09-29 16:46:34 -0400 (Wed, 29 Sep 2010) | 1 line
  
  Fix an issue of using an @XmlList with a doc/lit/bare service
........

[dkulp] Merged revisions 1001953 via svnmerge from 
https://svn.apache.org/repos/asf/cxf/trunk

........
  r1001953 | bimargulies | 2010-09-27 18:57:14 -0400 (Mon, 27 Sep 2010) | 1 line
  
  Move to new XML schema version (1.4.7).
........

[dkulp] Blocked revisions 998280,998339-998340,998718,998731-998732,998770,998773,1000547,1001494,1002250
via svnmerge

........
  r998280 | dkulp | 2010-09-17 15:35:37 -0400 (Fri, 17 Sep 2010) | 1 line
  
  Fix some javadoc
........
  r998339 | dkulp | 2010-09-17 17:35:14 -0400 (Fri, 17 Sep 2010) | 1 line
  
  Add SDO stuff into bundle, update manifests for jetty change
........
  r998340 | dkulp | 2010-09-17 17:35:24 -0400 (Fri, 17 Sep 2010) | 1 line
  
  Updates to get wstx-msv-validation into as well as remove jdk 1.6 deps.
........
  r998718 | bimargulies | 2010-09-19 15:12:57 -0400 (Sun, 19 Sep 2010) | 1 line
  
  Move to new JMS config universe.
........
  r998731 | bimargulies | 2010-09-19 17:04:25 -0400 (Sun, 19 Sep 2010) | 2 lines
  
  1. Switch sample to new JMS config.
  2. Fix typo in comment.
........
  r998732 | bimargulies | 2010-09-19 17:04:56 -0400 (Sun, 19 Sep 2010) | 1 line
  
  Fix spelling of JMS URI constant. Add JAX-WS API code to sample; client don't work yet.
........
  r998770 | ningjiang | 2010-09-19 23:51:13 -0400 (Sun, 19 Sep 2010) | 1 line
  
  CXF-3003 Fixed the JAXWS client issue of java first JMS example
........
  r998773 | ningjiang | 2010-09-20 00:06:15 -0400 (Mon, 20 Sep 2010) | 1 line
  
  CXF-3003 Removed the java files of ServerHTTP and ClientHTTP, also updated the pom.xml with
jaxws profile
........
  r1000547 | dkulp | 2010-09-23 13:22:27 -0400 (Thu, 23 Sep 2010) | 1 line
  
  Add survey summary
........
  r1001494 | sergeyb | 2010-09-26 14:56:28 -0400 (Sun, 26 Sep 2010) | 1 line
  
  Fixing checkstyle errors in the java_first_jms demo
........
  r1002250 | dkulp | 2010-09-28 12:38:31 -0400 (Tue, 28 Sep 2010) | 2 lines
  
  Set mime type
........

[dkulp] Merged revisions 999649 via svnmerge from 
https://svn.apache.org/repos/asf/cxf/trunk

........
  r999649 | sergeyb | 2010-09-21 17:23:55 -0400 (Tue, 21 Sep 2010) | 1 line
  
  Adding a test confirming post parameters can be retrieved from HttpServletContext
........

------------------------------------------
[...truncated 1854 lines...]
[INFO] Building Apache CXF Runtime Local Transport
[INFO]    task-segment: [clean, install]
[INFO] ------------------------------------------------------------------------
[INFO] [clean:clean {execution: default-clean}]
[INFO] Deleting <https://hudson.apache.org/hudson/job/CXF-2.2.x-JDK15/ws/2.2.x-fixes/rt/transports/local/target>
[INFO] [checkstyle:checkstyle {execution: validate}]
[INFO] Starting audit...
Audit done.

[INFO] Preparing pmd:check
[HUDSON] Archiving <https://hudson.apache.org/hudson/job/CXF-2.2.x-JDK15/ws/2.2.x-fixes/rt/transports/local/pom.xml>
to /home/hudson/hudson/jobs/CXF-2.2.x-JDK15/modules/org.apache.cxf$cxf-rt-transports-local/builds/2010-09-30_21-27-13/archive/org.apache.cxf/cxf-rt-transports-local/2.2.11-SNAPSHOT/pom.xml
[INFO] [pmd:pmd {execution: pmd}]
[INFO] [pmd:check {execution: validate}]
[INFO] 
[INFO] [cxf-xml2fastinfoset:xml2fastinfoset {execution: xml2fastinfoset}]
[INFO] [remote-resources:process {execution: default}]
[INFO] [resources:resources {execution: default-resources}]
[INFO] Using 'UTF-8' encoding to copy filtered resources.
[INFO] Copying 1 resource
[INFO] Copying 2 resources
[INFO] skip non existing resourceDirectory <https://hudson.apache.org/hudson/job/CXF-2.2.x-JDK15/ws/2.2.x-fixes/rt/transports/local/src/main/resources-filtered>
[INFO] Copying 1 resource
[INFO] Copying 3 resources
[INFO] [compiler:compile {execution: default-compile}]
[INFO] Compiling 3 source files to <https://hudson.apache.org/hudson/job/CXF-2.2.x-JDK15/ws/2.2.x-fixes/rt/transports/local/target/classes>
[INFO] [resources:testResources {execution: default-testResources}]
[INFO] Using 'UTF-8' encoding to copy filtered resources.
[INFO] Copying 0 resource
[INFO] skip non existing resourceDirectory <https://hudson.apache.org/hudson/job/CXF-2.2.x-JDK15/ws/2.2.x-fixes/rt/transports/local/src/test/resources>
[INFO] skip non existing resourceDirectory <https://hudson.apache.org/hudson/job/CXF-2.2.x-JDK15/ws/2.2.x-fixes/rt/transports/local/target/generated/src/test/resources>
[INFO] Copying 3 resources
[INFO] [compiler:testCompile {execution: default-testCompile}]
[INFO] Compiling 1 source file to <https://hudson.apache.org/hudson/job/CXF-2.2.x-JDK15/ws/2.2.x-fixes/rt/transports/local/target/test-classes>
[INFO] [surefire:test {execution: default-test}]
[INFO] Surefire report directory: <https://hudson.apache.org/hudson/job/CXF-2.2.x-JDK15/ws/2.2.x-fixes/rt/transports/local/target/surefire-reports>

-------------------------------------------------------
 T E S T S
-------------------------------------------------------
Running org.apache.cxf.transport.local.LocalTransportFactoryTest
Tests run: 2, Failures: 0, Errors: 0, Skipped: 0, Time elapsed: 0.236 sec

Results :

Tests run: 2, Failures: 0, Errors: 0, Skipped: 0

[HUDSON] Recording test results
[INFO] [jar:jar {execution: default-jar}]
[INFO] Building jar: <https://hudson.apache.org/hudson/job/CXF-2.2.x-JDK15/ws/2.2.x-fixes/rt/transports/local/target/cxf-rt-transports-local-2.2.11-SNAPSHOT.jar>
[INFO] [install:install {execution: default-install}]
[INFO] Installing <https://hudson.apache.org/hudson/job/CXF-2.2.x-JDK15/ws/2.2.x-fixes/rt/transports/local/target/cxf-rt-transports-local-2.2.11-SNAPSHOT.jar>
to <https://hudson.apache.org/hudson/job/CXF-2.2.x-JDK15/ws/.repository/org/apache/cxf/cxf-rt-transports-local/2.2.11-SNAPSHOT/cxf-rt-transports-local-2.2.11-SNAPSHOT.jar>
[HUDSON] Archiving <https://hudson.apache.org/hudson/job/CXF-2.2.x-JDK15/ws/2.2.x-fixes/rt/transports/local/target/cxf-rt-transports-local-2.2.11-SNAPSHOT.jar>
to /home/hudson/hudson/jobs/CXF-2.2.x-JDK15/modules/org.apache.cxf$cxf-rt-transports-local/builds/2010-09-30_21-27-13/archive/org.apache.cxf/cxf-rt-transports-local/2.2.11-SNAPSHOT/cxf-rt-transports-local-2.2.11-SNAPSHOT.jar
[INFO] ------------------------------------------------------------------------
[INFO] Building Apache CXF Runtime Simple Frontend
[INFO]    task-segment: [clean, install]
[INFO] ------------------------------------------------------------------------
[INFO] [clean:clean {execution: default-clean}]
[INFO] Deleting <https://hudson.apache.org/hudson/job/CXF-2.2.x-JDK15/ws/2.2.x-fixes/rt/frontend/simple/target>
[INFO] [checkstyle:checkstyle {execution: validate}]
[INFO] Starting audit...
Audit done.

[INFO] Preparing pmd:check
[HUDSON] Archiving <https://hudson.apache.org/hudson/job/CXF-2.2.x-JDK15/ws/2.2.x-fixes/rt/frontend/simple/pom.xml>
to /home/hudson/hudson/jobs/CXF-2.2.x-JDK15/modules/org.apache.cxf$cxf-rt-frontend-simple/builds/2010-09-30_21-27-13/archive/org.apache.cxf/cxf-rt-frontend-simple/2.2.11-SNAPSHOT/pom.xml
[INFO] [pmd:pmd {execution: pmd}]
[INFO] [pmd:check {execution: validate}]
[INFO] 
[INFO] [cxf-xml2fastinfoset:xml2fastinfoset {execution: xml2fastinfoset}]
[INFO] [remote-resources:process {execution: default}]
[INFO] [resources:resources {execution: default-resources}]
[INFO] Using 'UTF-8' encoding to copy filtered resources.
[INFO] Copying 2 resources
[INFO] Copying 3 resources
[INFO] skip non existing resourceDirectory <https://hudson.apache.org/hudson/job/CXF-2.2.x-JDK15/ws/2.2.x-fixes/rt/frontend/simple/src/main/resources-filtered>
[INFO] skip non existing resourceDirectory <https://hudson.apache.org/hudson/job/CXF-2.2.x-JDK15/ws/2.2.x-fixes/rt/frontend/simple/target/generated/src/main/resources>
[INFO] Copying 3 resources
[INFO] [compiler:compile {execution: default-compile}]
[INFO] Compiling 16 source files to <https://hudson.apache.org/hudson/job/CXF-2.2.x-JDK15/ws/2.2.x-fixes/rt/frontend/simple/target/classes>
[INFO] [resources:testResources {execution: default-testResources}]
[INFO] Using 'UTF-8' encoding to copy filtered resources.
[INFO] Copying 7 resources
[INFO] skip non existing resourceDirectory <https://hudson.apache.org/hudson/job/CXF-2.2.x-JDK15/ws/2.2.x-fixes/rt/frontend/simple/src/test/resources>
[INFO] skip non existing resourceDirectory <https://hudson.apache.org/hudson/job/CXF-2.2.x-JDK15/ws/2.2.x-fixes/rt/frontend/simple/target/generated/src/test/resources>
[INFO] Copying 3 resources
[INFO] [compiler:testCompile {execution: default-testCompile}]
[INFO] Compiling 13 source files to <https://hudson.apache.org/hudson/job/CXF-2.2.x-JDK15/ws/2.2.x-fixes/rt/frontend/simple/target/test-classes>
[INFO] [surefire:test {execution: default-test}]
[INFO] Surefire report directory: <https://hudson.apache.org/hudson/job/CXF-2.2.x-JDK15/ws/2.2.x-fixes/rt/frontend/simple/target/surefire-reports>

-------------------------------------------------------
 T E S T S
-------------------------------------------------------
Running org.apache.cxf.frontend.spring.SpringBeansTest
Tests run: 2, Failures: 0, Errors: 0, Skipped: 0, Time elapsed: 2.063 sec
Running org.apache.cxf.service.factory.ClientFactoryBeanTest
Tests run: 2, Failures: 0, Errors: 0, Skipped: 0, Time elapsed: 0.496 sec
Running org.apache.cxf.frontend.soap.SoapBindingSelectionTest
Tests run: 1, Failures: 0, Errors: 0, Skipped: 0, Time elapsed: 0.187 sec
Running org.apache.cxf.frontend.spring.ClientServerTest
Tests run: 1, Failures: 0, Errors: 0, Skipped: 0, Time elapsed: 0.168 sec
Running org.apache.cxf.service.factory.ServerFactoryTest
Tests run: 3, Failures: 0, Errors: 0, Skipped: 0, Time elapsed: 0.271 sec
Running org.apache.cxf.service.factory.ReflectionServiceFactoryTest
Tests run: 4, Failures: 0, Errors: 0, Skipped: 0, Time elapsed: 0.271 sec
Running org.apache.cxf.service.factory.RountripTest
Tests run: 2, Failures: 0, Errors: 0, Skipped: 0, Time elapsed: 0.198 sec
Running org.apache.cxf.service.stax.StaxDatabindingTest
Tests run: 2, Failures: 0, Errors: 0, Skipped: 0, Time elapsed: 0.145 sec

Results :

Tests run: 17, Failures: 0, Errors: 0, Skipped: 0

[HUDSON] Recording test results
[INFO] [jar:jar {execution: default-jar}]
[INFO] Building jar: <https://hudson.apache.org/hudson/job/CXF-2.2.x-JDK15/ws/2.2.x-fixes/rt/frontend/simple/target/cxf-rt-frontend-simple-2.2.11-SNAPSHOT.jar>
[INFO] [install:install {execution: default-install}]
[INFO] Installing <https://hudson.apache.org/hudson/job/CXF-2.2.x-JDK15/ws/2.2.x-fixes/rt/frontend/simple/target/cxf-rt-frontend-simple-2.2.11-SNAPSHOT.jar>
to <https://hudson.apache.org/hudson/job/CXF-2.2.x-JDK15/ws/.repository/org/apache/cxf/cxf-rt-frontend-simple/2.2.11-SNAPSHOT/cxf-rt-frontend-simple-2.2.11-SNAPSHOT.jar>
[HUDSON] Archiving <https://hudson.apache.org/hudson/job/CXF-2.2.x-JDK15/ws/2.2.x-fixes/rt/frontend/simple/target/cxf-rt-frontend-simple-2.2.11-SNAPSHOT.jar>
to /home/hudson/hudson/jobs/CXF-2.2.x-JDK15/modules/org.apache.cxf$cxf-rt-frontend-simple/builds/2010-09-30_21-27-13/archive/org.apache.cxf/cxf-rt-frontend-simple/2.2.11-SNAPSHOT/cxf-rt-frontend-simple-2.2.11-SNAPSHOT.jar
[INFO] ------------------------------------------------------------------------
[INFO] Building Apache CXF Runtime HTTP Transport
[INFO]    task-segment: [clean, install]
[INFO] ------------------------------------------------------------------------
[INFO] [clean:clean {execution: default-clean}]
[INFO] Deleting <https://hudson.apache.org/hudson/job/CXF-2.2.x-JDK15/ws/2.2.x-fixes/rt/transports/http/target>
[INFO] [checkstyle:checkstyle {execution: validate}]
[INFO] Starting audit...
Audit done.

[INFO] Preparing pmd:check
[HUDSON] Archiving <https://hudson.apache.org/hudson/job/CXF-2.2.x-JDK15/ws/2.2.x-fixes/rt/transports/http/pom.xml>
to /home/hudson/hudson/jobs/CXF-2.2.x-JDK15/modules/org.apache.cxf$cxf-rt-transports-http/builds/2010-09-30_21-27-13/archive/org.apache.cxf/cxf-rt-transports-http/2.2.11-SNAPSHOT/pom.xml
[INFO] [pmd:pmd {execution: pmd}]
[INFO] [pmd:check {execution: validate}]
[INFO] 
[INFO] [cxf-xml2fastinfoset:xml2fastinfoset {execution: xml2fastinfoset}]
[INFO] [cxf-common-xsd:xsdtojava {execution: generate-sources}]
[INFO] [remote-resources:process {execution: default}]
[INFO] [resources:resources {execution: default-resources}]
[INFO] Using 'UTF-8' encoding to copy filtered resources.
[INFO] Copying 6 resources
[INFO] Copying 10 resources
[INFO] skip non existing resourceDirectory <https://hudson.apache.org/hudson/job/CXF-2.2.x-JDK15/ws/2.2.x-fixes/rt/transports/http/src/main/resources-filtered>
[INFO] Copying 2 resources
[INFO] Copying 3 resources
[INFO] [compiler:compile {execution: default-compile}]
[INFO] Compiling 59 source files to <https://hudson.apache.org/hudson/job/CXF-2.2.x-JDK15/ws/2.2.x-fixes/rt/transports/http/target/classes>
[INFO] -------------------------------------------------------------
[WARNING] COMPILATION WARNING : 
[INFO] -------------------------------------------------------------
[WARNING] <https://hudson.apache.org/hudson/job/CXF-2.2.x-JDK15/ws/2.2.x-fixes/rt/transports/http/src/main/java/org/apache/cxf/transport/servlet/AbstractHTTPServlet.java>:[241,19]
[deprecation] getRealPath(java.lang.String) in javax.servlet.ServletRequest has been deprecated

[WARNING] <https://hudson.apache.org/hudson/job/CXF-2.2.x-JDK15/ws/2.2.x-fixes/rt/transports/http/src/main/java/org/apache/cxf/transport/servlet/AbstractHTTPServlet.java>:[241,19]
[deprecation] isRequestedSessionIdFromUrl() in javax.servlet.http.HttpServletRequest has been
deprecated

[WARNING] <https://hudson.apache.org/hudson/job/CXF-2.2.x-JDK15/ws/2.2.x-fixes/rt/transports/http/src/main/java/org/apache/cxf/transport/servlet/AbstractHTTPServlet.java>:[241,19]
[deprecation] getRealPath(java.lang.String) in javax.servlet.ServletRequest has been deprecated

[WARNING] <https://hudson.apache.org/hudson/job/CXF-2.2.x-JDK15/ws/2.2.x-fixes/rt/transports/http/src/main/java/org/apache/cxf/transport/http/HttpServletRequestSnapshot.java>:[31,7]
[deprecation] getRealPath(java.lang.String) in javax.servlet.ServletRequest has been deprecated

[WARNING] <https://hudson.apache.org/hudson/job/CXF-2.2.x-JDK15/ws/2.2.x-fixes/rt/transports/http/src/main/java/org/apache/cxf/transport/http/HttpServletRequestSnapshot.java>:[31,7]
[deprecation] isRequestedSessionIdFromUrl() in javax.servlet.http.HttpServletRequest has been
deprecated

[WARNING] <https://hudson.apache.org/hudson/job/CXF-2.2.x-JDK15/ws/2.2.x-fixes/rt/transports/http/src/main/java/org/apache/cxf/transport/http/HttpServletRequestSnapshot.java>:[31,7]
[deprecation] getRealPath(java.lang.String) in javax.servlet.ServletRequest has been deprecated

[WARNING] <https://hudson.apache.org/hudson/job/CXF-2.2.x-JDK15/ws/2.2.x-fixes/rt/transports/http/src/main/java/org/apache/cxf/transport/http/HttpServletRequestSnapshot.java>:[73,51]
[unchecked] unchecked conversion
found   : java.util.Enumeration
required: java.util.Enumeration<java.lang.String>

[WARNING] <https://hudson.apache.org/hudson/job/CXF-2.2.x-JDK15/ws/2.2.x-fixes/rt/transports/http/src/main/java/org/apache/cxf/transport/http/HttpServletRequestSnapshot.java>:[74,77]
[unchecked] unchecked cast
found   : java.util.Enumeration
required: java.util.Enumeration<java.lang.String>

[WARNING] <https://hudson.apache.org/hudson/job/CXF-2.2.x-JDK15/ws/2.2.x-fixes/rt/transports/http/src/main/java/org/apache/cxf/transport/http/HttpServletRequestSnapshot.java>:[77,50]
[unchecked] unchecked conversion
found   : java.util.Enumeration
required: java.util.Enumeration<java.lang.String>

[INFO] 9 warnings 
[INFO] -------------------------------------------------------------
[INFO] -------------------------------------------------------------
[ERROR] COMPILATION ERROR : 
[INFO] -------------------------------------------------------------
[ERROR] <https://hudson.apache.org/hudson/job/CXF-2.2.x-JDK15/ws/2.2.x-fixes/rt/transports/http/src/main/java/org/apache/cxf/transport/http/AbstractHTTPDestination.java>:[536,34]
cannot find symbol
symbol  : variable MessageUtils
location: class org.apache.cxf.transport.http.AbstractHTTPDestination

[INFO] 1error
[INFO] -------------------------------------------------------------
[INFO] ------------------------------------------------------------------------
[ERROR] BUILD FAILURE
[INFO] ------------------------------------------------------------------------
[INFO] Compilation failure
<https://hudson.apache.org/hudson/job/CXF-2.2.x-JDK15/ws/2.2.x-fixes/rt/transports/http/src/main/java/org/apache/cxf/transport/http/AbstractHTTPDestination.java>:[536,34]
cannot find symbol
symbol  : variable MessageUtils
location: class org.apache.cxf.transport.http.AbstractHTTPDestination


[INFO] ------------------------------------------------------------------------
[INFO] Trace
org.apache.maven.BuildFailureException: Compilation failure
<https://hudson.apache.org/hudson/job/CXF-2.2.x-JDK15/ws/2.2.x-fixes/rt/transports/http/src/main/java/org/apache/cxf/transport/http/AbstractHTTPDestination.java>:[536,34]
cannot find symbol
symbol  : variable MessageUtils
location: class org.apache.cxf.transport.http.AbstractHTTPDestination


	at org.apache.maven.lifecycle.DefaultLifecycleExecutor.executeGoals(DefaultLifecycleExecutor.java:715)
	at org.apache.maven.lifecycle.DefaultLifecycleExecutor.executeGoalWithLifecycle(DefaultLifecycleExecutor.java:556)
	at org.apache.maven.lifecycle.DefaultLifecycleExecutor.executeGoal(DefaultLifecycleExecutor.java:535)
	at org.apache.maven.lifecycle.DefaultLifecycleExecutor.executeGoalAndHandleFailures(DefaultLifecycleExecutor.java:387)
	at org.apache.maven.lifecycle.DefaultLifecycleExecutor.executeTaskSegments(DefaultLifecycleExecutor.java:348)
	at org.apache.maven.lifecycle.DefaultLifecycleExecutor.execute(DefaultLifecycleExecutor.java:180)
	at org.apache.maven.lifecycle.LifecycleExecutorInterceptor.execute(LifecycleExecutorInterceptor.java:65)
	at org.apache.maven.DefaultMaven.doExecute(DefaultMaven.java:328)
	at org.apache.maven.DefaultMaven.execute(DefaultMaven.java:138)
	at org.apache.maven.cli.MavenCli.main(MavenCli.java:362)
	at sun.reflect.NativeMethodAccessorImpl.invoke0(Native Method)
	at sun.reflect.NativeMethodAccessorImpl.invoke(NativeMethodAccessorImpl.java:39)
	at sun.reflect.DelegatingMethodAccessorImpl.invoke(DelegatingMethodAccessorImpl.java:25)
	at java.lang.reflect.Method.invoke(Method.java:592)
	at org.codehaus.classworlds.Launcher.launchEnhanced(Launcher.java:315)
	at org.codehaus.classworlds.Launcher.launch(Launcher.java:255)
	at hudson.maven.agent.Main.launch(Main.java:165)
	at hudson.maven.MavenBuilder.call(MavenBuilder.java:165)
	at hudson.maven.MavenModuleSetBuild$Builder.call(MavenModuleSetBuild.java:681)
	at hudson.maven.MavenModuleSetBuild$Builder.call(MavenModuleSetBuild.java:625)
	at hudson.remoting.UserRequest.perform(UserRequest.java:114)
	at hudson.remoting.UserRequest.perform(UserRequest.java:48)
	at hudson.remoting.Request$2.run(Request.java:270)
	at java.util.concurrent.Executors$RunnableAdapter.call(Executors.java:417)
	at java.util.concurrent.FutureTask$Sync.innerRun(FutureTask.java:269)
	at java.util.concurrent.FutureTask.run(FutureTask.java:123)
	at java.util.concurrent.ThreadPoolExecutor$Worker.runTask(ThreadPoolExecutor.java:651)
	at java.util.concurrent.ThreadPoolExecutor$Worker.run(ThreadPoolExecutor.java:676)
	at java.lang.Thread.run(Thread.java:595)
Caused by: org.apache.maven.plugin.CompilationFailureException: Compilation failure
<https://hudson.apache.org/hudson/job/CXF-2.2.x-JDK15/ws/2.2.x-fixes/rt/transports/http/src/main/java/org/apache/cxf/transport/http/AbstractHTTPDestination.java>:[536,34]
cannot find symbol
symbol  : variable MessageUtils
location: class org.apache.cxf.transport.http.AbstractHTTPDestination


	at org.apache.maven.plugin.AbstractCompilerMojo.execute(AbstractCompilerMojo.java:656)
	at org.apache.maven.plugin.CompilerMojo.execute(CompilerMojo.java:128)
	at org.apache.maven.plugin.DefaultPluginManager.executeMojo(DefaultPluginManager.java:490)
	at hudson.maven.agent.PluginManagerInterceptor.executeMojo(PluginManagerInterceptor.java:182)
	at org.apache.maven.lifecycle.DefaultLifecycleExecutor.executeGoals(DefaultLifecycleExecutor.java:694)
	... 28 more
[INFO] ------------------------------------------------------------------------
[INFO] Total time: 8 minutes 18 seconds
[INFO] Finished at: Thu Sep 30 21:35:42 UTC 2010
[INFO] Final Memory: 113M/217M
[INFO] ------------------------------------------------------------------------
Sending e-mails to: notifications@cxf.apache.org dkulp_apache@dankulp.com
channel stopped


Mime
View raw message