cxf-notifications mailing list archives

Site index · List index
Message view « Date » · « Thread »
Top « Date » · « Thread »
From Apache Hudson Server <hud...@hudson.zones.apache.org>
Subject Build failed in Hudson: CXF-2.2.x-JDK15 #492
Date Thu, 05 Aug 2010 08:16:08 GMT
See <http://hudson.zones.apache.org/hudson/job/CXF-2.2.x-JDK15/492/changes>

Changes:

[ningjiang] Merged revisions 982491 via svnmerge from 
https://svn.apache.org/repos/asf/cxf/trunk

........
  r982491 | ningjiang | 2010-08-05 15:42:57 +0800 (Thu, 05 Aug 2010) | 1 line
  
  CXF-2931 Add configurable pretty printing to the CXF logging in/out interceptors
........

------------------------------------------
[...truncated 809 lines...]
[INFO] Surefire report directory: <http://hudson.zones.apache.org/hudson/job/CXF-2.2.x-JDK15/ws/2.2.x-fixes/api/target/surefire-reports>

-------------------------------------------------------
 T E S T S
-------------------------------------------------------
Running org.apache.cxf.NSManagerTest
Tests run: 1, Failures: 0, Errors: 0, Skipped: 0, Time elapsed: 0.074 sec
Running org.apache.cxf.wsdl.JAXBExtensionHelperTest
Tests run: 3, Failures: 0, Errors: 0, Skipped: 0, Time elapsed: 0.657 sec
Running org.apache.cxf.service.model.BindingMessageInfoTest
Tests run: 1, Failures: 0, Errors: 0, Skipped: 0, Time elapsed: 0.008 sec
Running org.apache.cxf.ws.policy.IntersectorTest
Tests run: 3, Failures: 0, Errors: 0, Skipped: 0, Time elapsed: 0.034 sec
Running org.apache.cxf.databinding.AbstractDataBindingTest
Tests run: 2, Failures: 0, Errors: 0, Skipped: 0, Time elapsed: 0.007 sec
Running org.apache.cxf.ws.policy.builder.jaxb.JaxbAssertionTest
Tests run: 3, Failures: 0, Errors: 0, Skipped: 0, Time elapsed: 0.145 sec
Running org.apache.cxf.continuations.ContinuationInfoTest
Tests run: 1, Failures: 0, Errors: 0, Skipped: 0, Time elapsed: 0.007 sec
Running org.apache.cxf.ws.policy.builder.jaxb.JaxbAssertionBuilderTest
Tests run: 3, Failures: 0, Errors: 0, Skipped: 0, Time elapsed: 0.029 sec
Running org.apache.cxf.service.model.OperationInfoTest
Tests run: 5, Failures: 0, Errors: 0, Skipped: 0, Time elapsed: 0.013 sec
Running org.apache.cxf.ws.policy.AssertionInfoMapTest
Tests run: 4, Failures: 0, Errors: 0, Skipped: 0, Time elapsed: 0.015 sec
Running org.apache.cxf.BusFactoryTest
Tests run: 1, Failures: 0, Errors: 0, Skipped: 0, Time elapsed: 0.008 sec
Running org.apache.cxf.service.model.FaultInfoTest
Tests run: 1, Failures: 0, Errors: 0, Skipped: 0, Time elapsed: 0.003 sec
Running org.apache.cxf.service.model.MessagePartInfoTest
Tests run: 3, Failures: 0, Errors: 0, Skipped: 0, Time elapsed: 0.013 sec
Running org.apache.cxf.ws.policy.builder.primitive.NestedPrimitiveAssertionTest
Tests run: 4, Failures: 0, Errors: 0, Skipped: 0, Time elapsed: 0.007 sec
Running org.apache.cxf.service.model.BindingFaultInfoTest
Tests run: 1, Failures: 0, Errors: 0, Skipped: 0, Time elapsed: 0.003 sec
Running org.apache.cxf.service.model.InterfaceInfoTest
Tests run: 2, Failures: 0, Errors: 0, Skipped: 0, Time elapsed: 0.031 sec
Running org.apache.cxf.ws.policy.builder.primitive.NestedPrimitiveAssertionBuilderTest
Tests run: 6, Failures: 0, Errors: 0, Skipped: 0, Time elapsed: 0.061 sec
Running org.apache.cxf.phase.PhaseInterceptorChainTest
Tests run: 21, Failures: 0, Errors: 0, Skipped: 0, Time elapsed: 0.079 sec
Running org.apache.cxf.service.model.BindingOperationInfoTest
Tests run: 6, Failures: 0, Errors: 0, Skipped: 0, Time elapsed: 0.008 sec
Running org.apache.cxf.service.model.MessageInfoTest
Tests run: 2, Failures: 0, Errors: 0, Skipped: 0, Time elapsed: 0.005 sec
Running org.apache.cxf.continuations.SuspendedInvocationExceptionTest
Tests run: 2, Failures: 0, Errors: 0, Skipped: 0, Time elapsed: 0.004 sec

Results :

Tests run: 75, Failures: 0, Errors: 0, Skipped: 0

[HUDSON] Recording test results
[INFO] [jar:jar {execution: default-jar}]
[INFO] Building jar: <http://hudson.zones.apache.org/hudson/job/CXF-2.2.x-JDK15/ws/2.2.x-fixes/api/target/cxf-api-2.2.10-SNAPSHOT.jar>
[INFO] [javadoc:jar {execution: package}]
[INFO] 
16 warnings
[WARNING] Javadoc Warnings
[WARNING] javadoc: warning - Multiple sources of package comments found for package "org.apache.cxf"
[WARNING] javadoc: warning - Multiple sources of package comments found for package "org.apache.cxf.service"
[WARNING] javadoc: warning - Multiple sources of package comments found for package "org.apache.cxf.endpoint"
[WARNING] javadoc: warning - Multiple sources of package comments found for package "org.apache.cxf.transport"
[WARNING] javadoc: warning - Multiple sources of package comments found for package "org.apache.cxf.phase"
[WARNING] javadoc: warning - Multiple sources of package comments found for package "org.apache.cxf.interceptor"
[WARNING] javadoc: warning - Multiple sources of package comments found for package "org.apache.cxf.binding"
[WARNING] <http://hudson.zones.apache.org/hudson/job/CXF-2.2.x-JDK15/ws/2.2.x-fixes/api/src/main/java/org/apache/cxf/io/StaxValidationManager.java>:39:
warning - @param argument "schemas" is not a parameter name.
[WARNING] <http://hudson.zones.apache.org/hudson/job/CXF-2.2.x-JDK15/ws/2.2.x-fixes/api/src/main/java/org/apache/cxf/continuations/Continuation.java>:36:
warning - @param argument "timeout." is not a parameter name.
[WARNING] <http://hudson.zones.apache.org/hudson/job/CXF-2.2.x-JDK15/ws/2.2.x-fixes/api/src/main/java/org/apache/cxf/clustering/FailoverStrategy.java>:63:
warning - @param argument "alternates" is not a parameter name.
[WARNING] <http://hudson.zones.apache.org/hudson/job/CXF-2.2.x-JDK15/ws/2.2.x-fixes/api/src/main/java/org/apache/cxf/ws/policy/AssertionBuilderRegistry.java>:56:
warning - @return tag has no arguments.
[WARNING] <http://hudson.zones.apache.org/hudson/job/CXF-2.2.x-JDK15/ws/2.2.x-fixes/api/src/main/java/org/apache/cxf/service/model/SchemaInfo.java>:86:
warning - @return tag has no arguments.
[WARNING] <http://hudson.zones.apache.org/hudson/job/CXF-2.2.x-JDK15/ws/2.2.x-fixes/api/src/main/java/org/apache/cxf/endpoint/Client.java>:240:
warning - @return tag has no arguments.
[WARNING] <http://hudson.zones.apache.org/hudson/job/CXF-2.2.x-JDK15/ws/2.2.x-fixes/api/src/main/java/org/apache/cxf/wsdl/WSDLManager.java>:100:
warning - @return tag has no arguments.
[WARNING] <http://hudson.zones.apache.org/hudson/job/CXF-2.2.x-JDK15/ws/2.2.x-fixes/api/src/main/java/org/apache/cxf/phase/AbstractPhaseInterceptor.java>:75:
warning - @param argument "p" is not a parameter name.
[WARNING] <http://hudson.zones.apache.org/hudson/job/CXF-2.2.x-JDK15/ws/2.2.x-fixes/api/src/main/java/org/apache/cxf/annotations/DataBinding.java>:42:
warning - @return tag has no arguments.
[INFO] Building jar: <http://hudson.zones.apache.org/hudson/job/CXF-2.2.x-JDK15/ws/2.2.x-fixes/api/target/cxf-api-2.2.10-SNAPSHOT-javadoc.jar>
[INFO] [install:install {execution: default-install}]
[INFO] Installing <http://hudson.zones.apache.org/hudson/job/CXF-2.2.x-JDK15/ws/2.2.x-fixes/api/target/cxf-api-2.2.10-SNAPSHOT.jar>
to <http://hudson.zones.apache.org/hudson/job/CXF-2.2.x-JDK15/ws/.repository/org/apache/cxf/cxf-api/2.2.10-SNAPSHOT/cxf-api-2.2.10-SNAPSHOT.jar>
[INFO] Installing <http://hudson.zones.apache.org/hudson/job/CXF-2.2.x-JDK15/ws/2.2.x-fixes/api/target/cxf-api-2.2.10-SNAPSHOT-javadoc.jar>
to <http://hudson.zones.apache.org/hudson/job/CXF-2.2.x-JDK15/ws/.repository/org/apache/cxf/cxf-api/2.2.10-SNAPSHOT/cxf-api-2.2.10-SNAPSHOT-javadoc.jar>
[HUDSON] Archiving <http://hudson.zones.apache.org/hudson/job/CXF-2.2.x-JDK15/ws/2.2.x-fixes/api/target/cxf-api-2.2.10-SNAPSHOT.jar>
to /export/home/hudson/hudson/jobs/CXF-2.2.x-JDK15/modules/org.apache.cxf$cxf-api/builds/2010-08-05_08-12-18/archive/org.apache.cxf/cxf-api/2.2.10-SNAPSHOT/cxf-api-2.2.10-SNAPSHOT.jar
[HUDSON] Archiving <http://hudson.zones.apache.org/hudson/job/CXF-2.2.x-JDK15/ws/2.2.x-fixes/api/target/cxf-api-2.2.10-SNAPSHOT-javadoc.jar>
to /export/home/hudson/hudson/jobs/CXF-2.2.x-JDK15/modules/org.apache.cxf$cxf-api/builds/2010-08-05_08-12-18/archive/org.apache.cxf/cxf-api/2.2.10-SNAPSHOT/cxf-api-2.2.10-SNAPSHOT-javadoc.jar
[INFO] ------------------------------------------------------------------------
[INFO] Building Apache CXF XML Schema Validation with Xerces
[INFO]    task-segment: [clean, install]
[INFO] ------------------------------------------------------------------------
[INFO] [clean:clean {execution: default-clean}]
[INFO] Deleting <http://hudson.zones.apache.org/hudson/job/CXF-2.2.x-JDK15/ws/2.2.x-fixes/common/xerces-xsd-validation/target>
[INFO] [checkstyle:checkstyle {execution: validate}]
[INFO] Starting audit...
Audit done.

[INFO] Preparing pmd:check
[HUDSON] Archiving <http://hudson.zones.apache.org/hudson/job/CXF-2.2.x-JDK15/ws/2.2.x-fixes/common/xerces-xsd-validation/pom.xml>
to /export/home/hudson/hudson/jobs/CXF-2.2.x-JDK15/modules/org.apache.cxf$cxf-xerces-xsd-validation/builds/2010-08-05_08-12-18/archive/org.apache.cxf/cxf-xerces-xsd-validation/2.2.10-SNAPSHOT/pom.xml
[INFO] [pmd:pmd {execution: pmd}]
[INFO] [pmd:check {execution: validate}]
[INFO] 
[INFO] [cxf-xml2fastinfoset:xml2fastinfoset {execution: xml2fastinfoset}]
[INFO] [remote-resources:process {execution: default}]
[INFO] [resources:resources {execution: default-resources}]
[INFO] Using 'UTF-8' encoding to copy filtered resources.
[INFO] Copying 0 resource
[INFO] Copying 3 resources
[INFO] skip non existing resourceDirectory <http://hudson.zones.apache.org/hudson/job/CXF-2.2.x-JDK15/ws/2.2.x-fixes/common/xerces-xsd-validation/src/main/resources-filtered>
[INFO] Copying 1 resource
[INFO] Copying 3 resources
[INFO] [compiler:compile {execution: default-compile}]
[INFO] Compiling 3 source files to <http://hudson.zones.apache.org/hudson/job/CXF-2.2.x-JDK15/ws/2.2.x-fixes/common/xerces-xsd-validation/target/classes>
[INFO] [resources:testResources {execution: default-testResources}]
[INFO] Using 'UTF-8' encoding to copy filtered resources.
[INFO] skip non existing resourceDirectory <http://hudson.zones.apache.org/hudson/job/CXF-2.2.x-JDK15/ws/2.2.x-fixes/common/xerces-xsd-validation/src/test/java>
[INFO] skip non existing resourceDirectory <http://hudson.zones.apache.org/hudson/job/CXF-2.2.x-JDK15/ws/2.2.x-fixes/common/xerces-xsd-validation/src/test/resources>
[INFO] skip non existing resourceDirectory <http://hudson.zones.apache.org/hudson/job/CXF-2.2.x-JDK15/ws/2.2.x-fixes/common/xerces-xsd-validation/target/generated/src/test/resources>
[INFO] Copying 3 resources
[INFO] [compiler:testCompile {execution: default-testCompile}]
[INFO] No sources to compile
[INFO] [surefire:test {execution: default-test}]
[INFO] Surefire report directory: <http://hudson.zones.apache.org/hudson/job/CXF-2.2.x-JDK15/ws/2.2.x-fixes/common/xerces-xsd-validation/target/surefire-reports>

-------------------------------------------------------
 T E S T S
-------------------------------------------------------
There are no tests to run.

Results :

Tests run: 0, Failures: 0, Errors: 0, Skipped: 0

[HUDSON] Recording test results
[INFO] [jar:jar {execution: default-jar}]
[INFO] Building jar: <http://hudson.zones.apache.org/hudson/job/CXF-2.2.x-JDK15/ws/2.2.x-fixes/common/xerces-xsd-validation/target/cxf-xerces-xsd-validation-2.2.10-SNAPSHOT.jar>
[INFO] [install:install {execution: default-install}]
[INFO] Installing <http://hudson.zones.apache.org/hudson/job/CXF-2.2.x-JDK15/ws/2.2.x-fixes/common/xerces-xsd-validation/target/cxf-xerces-xsd-validation-2.2.10-SNAPSHOT.jar>
to <http://hudson.zones.apache.org/hudson/job/CXF-2.2.x-JDK15/ws/.repository/org/apache/cxf/cxf-xerces-xsd-validation/2.2.10-SNAPSHOT/cxf-xerces-xsd-validation-2.2.10-SNAPSHOT.jar>
[HUDSON] Archiving <http://hudson.zones.apache.org/hudson/job/CXF-2.2.x-JDK15/ws/2.2.x-fixes/common/xerces-xsd-validation/target/cxf-xerces-xsd-validation-2.2.10-SNAPSHOT.jar>
to /export/home/hudson/hudson/jobs/CXF-2.2.x-JDK15/modules/org.apache.cxf$cxf-xerces-xsd-validation/builds/2010-08-05_08-12-18/archive/org.apache.cxf/cxf-xerces-xsd-validation/2.2.10-SNAPSHOT/cxf-xerces-xsd-validation-2.2.10-SNAPSHOT.jar
[INFO] ------------------------------------------------------------------------
[INFO] Building Apache CXF Common
[INFO]    task-segment: [clean, install]
[INFO] ------------------------------------------------------------------------
[INFO] [clean:clean {execution: default-clean}]
[INFO] [site:attach-descriptor {execution: default-attach-descriptor}]
[INFO] [install:install {execution: default-install}]
[INFO] Installing <http://hudson.zones.apache.org/hudson/job/CXF-2.2.x-JDK15/ws/2.2.x-fixes/common/pom.xml>
to <http://hudson.zones.apache.org/hudson/job/CXF-2.2.x-JDK15/ws/.repository/org/apache/cxf/cxf-common/2.2.10-SNAPSHOT/cxf-common-2.2.10-SNAPSHOT.pom>
[HUDSON] Archiving <http://hudson.zones.apache.org/hudson/job/CXF-2.2.x-JDK15/ws/2.2.x-fixes/common/pom.xml>
to /export/home/hudson/hudson/jobs/CXF-2.2.x-JDK15/modules/org.apache.cxf$cxf-common/builds/2010-08-05_08-12-18/archive/org.apache.cxf/cxf-common/2.2.10-SNAPSHOT/pom.xml
[HUDSON] Archiving <http://hudson.zones.apache.org/hudson/job/CXF-2.2.x-JDK15/ws/.repository/org/apache/cxf/cxf-common/2.2.10-SNAPSHOT/cxf-common-2.2.10-SNAPSHOT.pom>
to /export/home/hudson/hudson/jobs/CXF-2.2.x-JDK15/modules/org.apache.cxf$cxf-common/builds/2010-08-05_08-12-18/archive/org.apache.cxf/cxf-common/2.2.10-SNAPSHOT/cxf-common-2.2.10-SNAPSHOT.pom
[INFO] ------------------------------------------------------------------------
[INFO] Building Apache CXF Runtime Core
[INFO]    task-segment: [clean, install]
[INFO] ------------------------------------------------------------------------
[INFO] [clean:clean {execution: default-clean}]
[INFO] Deleting <http://hudson.zones.apache.org/hudson/job/CXF-2.2.x-JDK15/ws/2.2.x-fixes/rt/core/target>
[INFO] [checkstyle:checkstyle {execution: validate}]
[INFO] Starting audit...
Audit done.

[INFO] Preparing pmd:check
[HUDSON] Archiving <http://hudson.zones.apache.org/hudson/job/CXF-2.2.x-JDK15/ws/2.2.x-fixes/rt/core/pom.xml>
to /export/home/hudson/hudson/jobs/CXF-2.2.x-JDK15/modules/org.apache.cxf$cxf-rt-core/builds/2010-08-05_08-12-18/archive/org.apache.cxf/cxf-rt-core/2.2.10-SNAPSHOT/pom.xml
[INFO] [pmd:pmd {execution: pmd}]
[INFO] [pmd:check {execution: validate}]
[INFO] 
[INFO] [cxf-xml2fastinfoset:xml2fastinfoset {execution: xml2fastinfoset}]
[INFO] [remote-resources:process {execution: default}]
[INFO] [resources:resources {execution: default-resources}]
[INFO] Using 'UTF-8' encoding to copy filtered resources.
[INFO] Copying 14 resources
[INFO] Copying 8 resources
[INFO] skip non existing resourceDirectory <http://hudson.zones.apache.org/hudson/job/CXF-2.2.x-JDK15/ws/2.2.x-fixes/rt/core/src/main/resources-filtered>
[INFO] Copying 1 resource
[INFO] Copying 3 resources
[INFO] [compiler:compile {execution: default-compile}]
[INFO] Compiling 172 source files to <http://hudson.zones.apache.org/hudson/job/CXF-2.2.x-JDK15/ws/2.2.x-fixes/rt/core/target/classes>
[INFO] -------------------------------------------------------------
[WARNING] COMPILATION WARNING : 
[INFO] -------------------------------------------------------------
[WARNING] <http://hudson.zones.apache.org/hudson/job/CXF-2.2.x-JDK15/ws/2.2.x-fixes/rt/core/src/main/java/org/apache/cxf/bus/spring/ControlledValidationXmlBeanDefinitionReader.java>:[62,7]
[deprecation] getBeanFactory() in org.springframework.beans.factory.support.BeanDefinitionReader
has been deprecated

[INFO] 1warning
[INFO] -------------------------------------------------------------
[INFO] -------------------------------------------------------------
[ERROR] COMPILATION ERROR : 
[INFO] -------------------------------------------------------------
[ERROR] <http://hudson.zones.apache.org/hudson/job/CXF-2.2.x-JDK15/ws/2.2.x-fixes/rt/core/src/main/java/org/apache/cxf/interceptor/LoggingOutInterceptor.java>:[162,16]
cannot find symbol
symbol  : method writePayload(java.lang.StringBuilder,org.apache.cxf.io.CachedOutputStream,java.lang.String)
location: class org.apache.cxf.interceptor.LoggingOutInterceptor.LoggingCallback

[ERROR] <http://hudson.zones.apache.org/hudson/job/CXF-2.2.x-JDK15/ws/2.2.x-fixes/rt/core/src/main/java/org/apache/cxf/interceptor/LoggingInInterceptor.java>:[152,16]
cannot find symbol
symbol  : method writePayload(java.lang.StringBuilder,org.apache.cxf.io.CachedOutputStream,java.lang.String)
location: class org.apache.cxf.interceptor.LoggingInInterceptor

[INFO] 2 errors 
[INFO] -------------------------------------------------------------
[INFO] ------------------------------------------------------------------------
[ERROR] BUILD FAILURE
[INFO] ------------------------------------------------------------------------
[INFO] Compilation failure

<http://hudson.zones.apache.org/hudson/job/CXF-2.2.x-JDK15/ws/2.2.x-fixes/rt/core/src/main/java/org/apache/cxf/interceptor/LoggingOutInterceptor.java>:[162,16]
cannot find symbol
symbol  : method writePayload(java.lang.StringBuilder,org.apache.cxf.io.CachedOutputStream,java.lang.String)
location: class org.apache.cxf.interceptor.LoggingOutInterceptor.LoggingCallback

<http://hudson.zones.apache.org/hudson/job/CXF-2.2.x-JDK15/ws/2.2.x-fixes/rt/core/src/main/java/org/apache/cxf/interceptor/LoggingInInterceptor.java>:[152,16]
cannot find symbol
symbol  : method writePayload(java.lang.StringBuilder,org.apache.cxf.io.CachedOutputStream,java.lang.String)
location: class org.apache.cxf.interceptor.LoggingInInterceptor


[INFO] ------------------------------------------------------------------------
[INFO] Trace
org.apache.maven.BuildFailureException: Compilation failure
	at org.apache.maven.lifecycle.DefaultLifecycleExecutor.executeGoals(DefaultLifecycleExecutor.java:715)
	at org.apache.maven.lifecycle.DefaultLifecycleExecutor.executeGoalWithLifecycle(DefaultLifecycleExecutor.java:556)
	at org.apache.maven.lifecycle.DefaultLifecycleExecutor.executeGoal(DefaultLifecycleExecutor.java:535)
	at org.apache.maven.lifecycle.DefaultLifecycleExecutor.executeGoalAndHandleFailures(DefaultLifecycleExecutor.java:387)
	at org.apache.maven.lifecycle.DefaultLifecycleExecutor.executeTaskSegments(DefaultLifecycleExecutor.java:348)
	at org.apache.maven.lifecycle.DefaultLifecycleExecutor.execute(DefaultLifecycleExecutor.java:180)
	at org.apache.maven.lifecycle.LifecycleExecutorInterceptor.execute(LifecycleExecutorInterceptor.java:65)
	at org.apache.maven.DefaultMaven.doExecute(DefaultMaven.java:328)
	at org.apache.maven.DefaultMaven.execute(DefaultMaven.java:138)
	at org.apache.maven.cli.MavenCli.main(MavenCli.java:362)
	at sun.reflect.NativeMethodAccessorImpl.invoke0(Native Method)
	at sun.reflect.NativeMethodAccessorImpl.invoke(NativeMethodAccessorImpl.java:39)
	at sun.reflect.DelegatingMethodAccessorImpl.invoke(DelegatingMethodAccessorImpl.java:25)
	at java.lang.reflect.Method.invoke(Method.java:592)
	at org.codehaus.classworlds.Launcher.launchEnhanced(Launcher.java:315)
	at org.codehaus.classworlds.Launcher.launch(Launcher.java:255)
	at hudson.maven.agent.Main.launch(Main.java:165)
	at hudson.maven.MavenBuilder.call(MavenBuilder.java:165)
	at hudson.maven.MavenModuleSetBuild$Builder.call(MavenModuleSetBuild.java:696)
	at hudson.maven.MavenModuleSetBuild$Builder.call(MavenModuleSetBuild.java:640)
	at hudson.remoting.UserRequest.perform(UserRequest.java:114)
	at hudson.remoting.UserRequest.perform(UserRequest.java:48)
	at hudson.remoting.Request$2.run(Request.java:270)
	at java.util.concurrent.Executors$RunnableAdapter.call(Executors.java:417)
	at java.util.concurrent.FutureTask$Sync.innerRun(FutureTask.java:269)
	at java.util.concurrent.FutureTask.run(FutureTask.java:123)
	at java.util.concurrent.ThreadPoolExecutor$Worker.runTask(ThreadPoolExecutor.java:651)
	at java.util.concurrent.ThreadPoolExecutor$Worker.run(ThreadPoolExecutor.java:676)
	at java.lang.Thread.run(Thread.java:595)
Caused by: org.apache.maven.plugin.CompilationFailureException: Compilation failure
	at org.apache.maven.plugin.AbstractCompilerMojo.execute(AbstractCompilerMojo.java:656)
	at org.apache.maven.plugin.CompilerMojo.execute(CompilerMojo.java:128)
	at org.apache.maven.plugin.DefaultPluginManager.executeMojo(DefaultPluginManager.java:490)
	at hudson.maven.agent.PluginManagerInterceptor.executeMojo(PluginManagerInterceptor.java:182)
	at org.apache.maven.lifecycle.DefaultLifecycleExecutor.executeGoals(DefaultLifecycleExecutor.java:694)
	... 28 more
[INFO] ------------------------------------------------------------------------
[INFO] Total time: 3 minutes 29 seconds
[INFO] Finished at: Thu Aug 05 08:15:56 UTC 2010
[INFO] Final Memory: 88M/159M
[INFO] ------------------------------------------------------------------------
Sending e-mails to: notifications@cxf.apache.org ningjiang@apache.org
channel stopped


Mime
View raw message