cxf-notifications mailing list archives

Site index · List index
Message view « Date » · « Thread »
Top « Date » · « Thread »
From Apache Hudson Server <hud...@hudson.zones.apache.org>
Subject Build failed in Hudson: CXF-trunk-deploy » Apache CXF Run Samples as Integration Tests #362
Date Sun, 25 Jul 2010 06:49:25 GMT
See <http://hudson.zones.apache.org/hudson/job/CXF-trunk-deploy/org.apache.cxf.systests$cxf-test-samples/362/changes>

Changes:

[bimargulies] now all the samples build from test-samples

[bimargulies] instant mechanism for compiling all the samples from the build

------------------------------------------
[INFO] ------------------------------------------------------------------------
[INFO] Building Apache CXF Run Samples as Integration Tests
[INFO]    task-segment: [clean, deploy]
[INFO] ------------------------------------------------------------------------
Downloading: http://repo1.maven.org/maven2/org/apache/maven/plugins/maven-invoker-plugin/1.5/maven-invoker-plugin-1.5.pom

Downloading: http://repo1.maven.org/maven2/org/apache/maven/plugins/maven-invoker-plugin/1.5/maven-invoker-plugin-1.5.jar

[INFO] [clean:clean {execution: default-clean}]
[INFO] [site:attach-descriptor {execution: default-attach-descriptor}]
[INFO] Preparing source:jar
[WARNING] Removing: jar from forked lifecycle, to prevent recursive invocation.
[INFO] No goals needed for project - skipping
[INFO] [source:jar {execution: attach-sources}]
[INFO] [javadoc:jar {execution: attach-javadocs}]
[INFO] Not executing Javadoc as the project is not a Java classpath-capable package
Downloading: http://repo1.maven.org/maven2/org/apache/maven/shared/maven-invoker/2.0.11/maven-invoker-2.0.11.pom

Downloading: http://repo1.maven.org/maven2/org/beanshell/bsh/2.0b4/bsh-2.0b4.pom

Downloading: http://repo1.maven.org/maven2/org/beanshell/beanshell/2.0b4/beanshell-2.0b4.pom

Downloading: http://repo1.maven.org/maven2/org/codehaus/groovy/groovy/1.5.6/groovy-1.5.6.pom

Downloading: http://repo1.maven.org/maven2/asm/asm/2.2/asm-2.2.pom

Downloading: http://repo1.maven.org/maven2/asm/asm-util/2.2/asm-util-2.2.pom

Downloading: http://repo1.maven.org/maven2/asm/asm-analysis/2.2/asm-analysis-2.2.pom

Downloading: http://repo1.maven.org/maven2/asm/asm-tree/2.2/asm-tree-2.2.pom

Downloading: http://repo1.maven.org/maven2/jline/jline/0.9.94/jline-0.9.94.pom

Downloading: http://repo1.maven.org/maven2/org/codehaus/plexus/plexus-interpolation/1.2/plexus-interpolation-1.2.pom

Downloading: http://repo1.maven.org/maven2/org/beanshell/bsh/2.0b4/bsh-2.0b4.jar
Downloading: http://repo1.maven.org/maven2/org/codehaus/groovy/groovy/1.5.6/groovy-1.5.6.jar
Downloading: http://repo1.maven.org/maven2/asm/asm/2.2/asm-2.2.jar
Downloading: http://repo1.maven.org/maven2/org/apache/maven/shared/maven-invoker/2.0.11/maven-invoker-2.0.11.jar
Downloading: http://repo1.maven.org/maven2/jline/jline/0.9.94/jline-0.9.94.jar

Downloading: http://repo1.maven.org/maven2/org/codehaus/plexus/plexus-interpolation/1.2/plexus-interpolation-1.2.jar





Downloading: http://repo1.maven.org/maven2/asm/asm-util/2.2/asm-util-2.2.jar

Downloading: http://repo1.maven.org/maven2/asm/asm-analysis/2.2/asm-analysis-2.2.jar

Downloading: http://repo1.maven.org/maven2/asm/asm-tree/2.2/asm-tree-2.2.jar

[INFO] [invoker:run {execution: integration-test}]
[WARNING] File encoding has not been set, using platform encoding UTF-8, i.e. build is platform
dependent!
[INFO] Building: wsdl_first_xmlbeans/pom.xml
[INFO] ..SUCCESS (9.4 s)
[INFO] Building: restful_dispatch/pom.xml
[INFO] ..SUCCESS (11.1 s)
[INFO] Building: wsdl_first_https/pom.xml
[INFO] ..SUCCESS (7.0 s)
[INFO] Building: aegis_standalone/pom.xml
[INFO] ..SUCCESS (4.7 s)
[INFO] Building: wsdl_first_xml_wrapped/pom.xml
[INFO] ..SUCCESS (6.7 s)
[INFO] Building: wsdl_first/pom.xml
[INFO] ..SUCCESS (15.4 s)
[INFO] Building: wsdl_first_dynamic_client/pom.xml
[INFO] ..SUCCESS (6.8 s)
[INFO] Building: callback/pom.xml
[INFO] ..SUCCESS (7.4 s)
[INFO] Building: java_first_jaxws/pom.xml
[INFO] ..SUCCESS (3.7 s)
[INFO] Building: wsdl_first_soap12/pom.xml
[INFO] ..SUCCESS (7.0 s)
[INFO] Building: js_client/pom.xml
[INFO] ..SUCCESS (8.5 s)
[INFO] Building: configuration_interceptor/pom.xml
[INFO] ..SUCCESS (7.2 s)
[INFO] Building: ws_policy/pom.xml
[INFO] ..SUCCESS (7.6 s)
[INFO] Building: java_first_jaxws_factory_bean/pom.xml
[INFO] ..SUCCESS (4.0 s)
[INFO] Building: jax_server_aegis_client/pom.xml
[INFO] ..SUCCESS (3.8 s)
[INFO] Building: js_browser_client_simple/pom.xml
[INFO] ..SUCCESS (7.5 s)
[INFO] Building: java_first_spring_support/pom.xml
[INFO] ..SUCCESS (4.0 s)
[INFO] Building: jaxws_handlers/pom.xml
[INFO] ..SUCCESS (7.4 s)
[INFO] Building: jaxws_async/pom.xml
[INFO] ..SUCCESS (7.0 s)
[INFO] Building: jaxws_dispatch_provider/pom.xml
[INFO] ..SUCCESS (8.1 s)
[INFO] Building: wsdl_first_rpclit/pom.xml
[INFO] ..SUCCESS (6.8 s)
[INFO] Building: in_jvm_transport/pom.xml
[INFO] ..SUCCESS (6.9 s)
[INFO] Building: aegis/pom.xml
[INFO] ..SUCCESS (10.7 s)
[INFO] Building: jms_pubsub/pom.xml
[INFO] ..SUCCESS (9.3 s)
[INFO] Building: mtom/pom.xml
[INFO] ..SUCCESS (7.3 s)
[INFO] Building: wsdl_first_pure_xml/pom.xml
[INFO] ..SUCCESS (6.6 s)
[INFO] Building: soap_header/pom.xml
[INFO] ..SUCCESS (6.5 s)
[INFO] Building: ws_rm/pom.xml
[INFO] ..SUCCESS (7.1 s)
[INFO] Building: java_first_pojo/pom.xml
[INFO] ..SUCCESS (3.6 s)
[INFO] Building: jms-spec-demo/pom.xml
[INFO] ..SUCCESS (7.3 s)
[INFO] Building: jms_queue/pom.xml
[INFO] ..SUCCESS (7.2 s)
[INFO] Building: js_browser_client_java_first/pom.xml
[INFO] ..FAILED (3.0 s)
[INFO]   The build exited with code 1. See <http://hudson.zones.apache.org/hudson/job/CXF-trunk-deploy/org.apache.cxf.systests$cxf-test-samples/ws/target/it/js_browser_client_java_first/build.log>
for details.
[INFO] Building: restful_http_binding/pom.xml
[INFO] ..SUCCESS (5.8 s)
[INFO] Building: ws_addressing/pom.xml
[INFO] ..SUCCESS (6.9 s)
[INFO] -------------------------------------------------
[INFO] Build Summary:
[INFO]   Passed: 33, Failed: 1, Errors: 0, Skipped: 0
[INFO] -------------------------------------------------
[ERROR] The following builds failed:
[ERROR] *  js_browser_client_java_first/pom.xml
[INFO] -------------------------------------------------
[HUDSON] Archiving <http://hudson.zones.apache.org/hudson/job/CXF-trunk-deploy/org.apache.cxf.systests$cxf-test-samples/ws/pom.xml>
to /export/home/hudson/hudson/jobs/CXF-trunk-deploy/modules/org.apache.cxf.systests$cxf-test-samples/builds/2010-07-25_06-21-55/archive/org.apache.cxf.systests/cxf-test-samples/2.3.0-SNAPSHOT/pom.xml
[INFO] ------------------------------------------------------------------------
[ERROR] BUILD FAILURE
[INFO] ------------------------------------------------------------------------
[INFO] : org.apache.maven.plugin.invoker.InvokerSession@12f62ef
1 build failed.
[INFO] ------------------------------------------------------------------------
[INFO] Trace
org.apache.maven.BuildFailureException: 1 build failed.
	at org.apache.maven.lifecycle.DefaultLifecycleExecutor.executeGoals(DefaultLifecycleExecutor.java:715)
	at org.apache.maven.lifecycle.DefaultLifecycleExecutor.executeGoalWithLifecycle(DefaultLifecycleExecutor.java:556)
	at org.apache.maven.lifecycle.DefaultLifecycleExecutor.executeGoal(DefaultLifecycleExecutor.java:535)
	at org.apache.maven.lifecycle.DefaultLifecycleExecutor.executeGoalAndHandleFailures(DefaultLifecycleExecutor.java:387)
	at org.apache.maven.lifecycle.DefaultLifecycleExecutor.executeTaskSegments(DefaultLifecycleExecutor.java:348)
	at org.apache.maven.lifecycle.DefaultLifecycleExecutor.execute(DefaultLifecycleExecutor.java:180)
	at org.apache.maven.lifecycle.LifecycleExecutorInterceptor.execute(LifecycleExecutorInterceptor.java:65)
	at org.apache.maven.DefaultMaven.doExecute(DefaultMaven.java:328)
	at org.apache.maven.DefaultMaven.execute(DefaultMaven.java:138)
	at org.apache.maven.cli.MavenCli.main(MavenCli.java:362)
	at sun.reflect.NativeMethodAccessorImpl.invoke0(Native Method)
	at sun.reflect.NativeMethodAccessorImpl.invoke(NativeMethodAccessorImpl.java:39)
	at sun.reflect.DelegatingMethodAccessorImpl.invoke(DelegatingMethodAccessorImpl.java:25)
	at java.lang.reflect.Method.invoke(Method.java:592)
	at org.codehaus.classworlds.Launcher.launchEnhanced(Launcher.java:315)
	at org.codehaus.classworlds.Launcher.launch(Launcher.java:255)
	at hudson.maven.agent.Main.launch(Main.java:165)
	at hudson.maven.MavenBuilder.call(MavenBuilder.java:165)
	at hudson.maven.MavenModuleSetBuild$Builder.call(MavenModuleSetBuild.java:696)
	at hudson.maven.MavenModuleSetBuild$Builder.call(MavenModuleSetBuild.java:640)
	at hudson.remoting.UserRequest.perform(UserRequest.java:114)
	at hudson.remoting.UserRequest.perform(UserRequest.java:48)
	at hudson.remoting.Request$2.run(Request.java:270)
	at java.util.concurrent.Executors$RunnableAdapter.call(Executors.java:417)
	at java.util.concurrent.FutureTask$Sync.innerRun(FutureTask.java:269)
	at java.util.concurrent.FutureTask.run(FutureTask.java:123)
	at java.util.concurrent.ThreadPoolExecutor$Worker.runTask(ThreadPoolExecutor.java:651)
	at java.util.concurrent.ThreadPoolExecutor$Worker.run(ThreadPoolExecutor.java:676)
	at java.lang.Thread.run(Thread.java:595)
Caused by: org.apache.maven.plugin.MojoFailureException: 1 build failed.
	at org.apache.maven.plugin.invoker.InvokerSession.handleFailures(InvokerSession.java:263)
	at org.apache.maven.plugin.invoker.InvokerMojo.processResults(InvokerMojo.java:58)
	at org.apache.maven.plugin.invoker.AbstractInvokerMojo.execute(AbstractInvokerMojo.java:620)
	at org.apache.maven.plugin.DefaultPluginManager.executeMojo(DefaultPluginManager.java:490)
	at hudson.maven.agent.PluginManagerInterceptor.executeMojo(PluginManagerInterceptor.java:182)
	at org.apache.maven.lifecycle.DefaultLifecycleExecutor.executeGoals(DefaultLifecycleExecutor.java:694)
	... 28 more
[INFO] ------------------------------------------------------------------------
[INFO] Total time: 27 minutes 21 seconds
[INFO] Finished at: Sun Jul 25 06:49:23 UTC 2010
[INFO] Final Memory: 121M/205M
[INFO] ------------------------------------------------------------------------


Mime
View raw message