cxf-notifications mailing list archives

Site index · List index
Message view « Date » · « Thread »
Top « Date » · « Thread »
From Apache Hudson Server <hud...@hudson.zones.apache.org>
Subject Build failed in Hudson: CXF-Trunk-JDK16 #328
Date Sat, 22 May 2010 06:14:40 GMT
See <http://hudson.zones.apache.org/hudson/job/CXF-Trunk-JDK16/328/changes>

Changes:

[sergeyb] Updating rt Attachment to save headers without converting them to lower case

[ema] [CXF-2819]:Added the lines wrongly deleted in previous commit

[ema] [CXF-2819]:Modified the bindingID to SOAP12HTTPBinding when the SOAP12Binding transportid
from wsdl is http://schemas.xmlsoap.org/soap/http

[ema] [CXF-2788]:Close all the connection when bus shutdown

------------------------------------------
[...truncated 6624 lines...]
-------------------------------------------------------
Running org.apache.cxf.systest.servlet.JaxRsServletTest
Tests run: 1, Failures: 0, Errors: 0, Skipped: 1, Time elapsed: 0.1 sec

Results :

Tests run: 145, Failures: 0, Errors: 0, Skipped: 3


-------------------------------------------------------
 T E S T S
-------------------------------------------------------
Running org.apache.cxf.systest.jaxrs.JAXRSClientServerBookTest
Tests run: 84, Failures: 0, Errors: 0, Skipped: 1, Time elapsed: 6.059 sec

Results :

Tests run: 229, Failures: 0, Errors: 0, Skipped: 4


-------------------------------------------------------
 T E S T S
-------------------------------------------------------
Running org.apache.cxf.systest.jaxrs.JAXRSClientServerStreamingTest
Tests run: 2, Failures: 0, Errors: 0, Skipped: 0, Time elapsed: 3.232 sec

Results :

Tests run: 231, Failures: 0, Errors: 0, Skipped: 4


-------------------------------------------------------
 T E S T S
-------------------------------------------------------
Running org.apache.cxf.systest.jaxrs.JAXRSClientServerUserResourceTest
Tests run: 3, Failures: 0, Errors: 0, Skipped: 0, Time elapsed: 3.185 sec

Results :

Tests run: 234, Failures: 0, Errors: 0, Skipped: 4


-------------------------------------------------------
 T E S T S
-------------------------------------------------------
Running org.apache.cxf.systest.jaxrs.security.JAXRSSpringSecurityInterfaceTest
Tests run: 10, Failures: 0, Errors: 0, Skipped: 0, Time elapsed: 5.338 sec

Results :

Tests run: 244, Failures: 0, Errors: 0, Skipped: 4


-------------------------------------------------------
 T E S T S
-------------------------------------------------------
Running org.apache.cxf.systest.jaxrs.JAXRSClientServerProxySpringBookTest
Tests run: 12, Failures: 0, Errors: 0, Skipped: 0, Time elapsed: 8.637 sec

Results :

Tests run: 256, Failures: 0, Errors: 0, Skipped: 4


-------------------------------------------------------
 T E S T S
-------------------------------------------------------
Running org.apache.cxf.systest.jaxrs.JAXRSContinuationsTest
Tests run: 1, Failures: 0, Errors: 0, Skipped: 0, Time elapsed: 4.62 sec

Results :

Tests run: 257, Failures: 0, Errors: 0, Skipped: 4


-------------------------------------------------------
 T E S T S
-------------------------------------------------------
Running org.apache.cxf.systest.jaxrs.JAXRSClientServerResourceCreatedSpringBookTest
Tests run: 2, Failures: 0, Errors: 0, Skipped: 0, Time elapsed: 8.804 sec

Results :

Tests run: 259, Failures: 0, Errors: 0, Skipped: 4


-------------------------------------------------------
 T E S T S
-------------------------------------------------------
Running org.apache.cxf.systest.jaxrs.JAXRSUriInfoTest
Starting Server
Tests run: 1, Failures: 0, Errors: 0, Skipped: 0, Time elapsed: 11.864 sec

Results :

Tests run: 260, Failures: 0, Errors: 0, Skipped: 4


-------------------------------------------------------
 T E S T S
-------------------------------------------------------
Running org.apache.cxf.systest.jaxrs.JAXRSAtomBookTest
Tests run: 4, Failures: 0, Errors: 0, Skipped: 0, Time elapsed: 20.182 sec

Results :

Tests run: 264, Failures: 0, Errors: 0, Skipped: 4


-------------------------------------------------------
 T E S T S
-------------------------------------------------------
Running org.apache.cxf.systest.jaxrs.JAXRSLoggingAtomPushSpringTest
Starting Server
Tests run: 5, Failures: 0, Errors: 0, Skipped: 0, Time elapsed: 25.939 sec

Results :

Tests run: 269, Failures: 0, Errors: 0, Skipped: 4

engine shutdown
engine shutdown
engine shutdown
engine shutdown
engine shutdown

-------------------------------------------------------
 T E S T S
-------------------------------------------------------
Running org.apache.cxf.systest.jaxrs.JAXRSDataBindingTest
Tests run: 4, Failures: 0, Errors: 0, Skipped: 0, Time elapsed: 10.812 sec

Results :

Tests run: 273, Failures: 0, Errors: 0, Skipped: 4


-------------------------------------------------------
 T E S T S
-------------------------------------------------------
Running org.apache.cxf.systest.jaxrs.JAXRSClientServerResourceJacksonSpringProviderTest
Tests run: 3, Failures: 0, Errors: 0, Skipped: 0, Time elapsed: 14.772 sec

Results :

Tests run: 276, Failures: 0, Errors: 0, Skipped: 4


-------------------------------------------------------
 T E S T S
-------------------------------------------------------
Running org.apache.cxf.systest.jaxrs.JAXRSLoggingAtomPushTest
May 22, 2010 5:53:35 AM org.apache.cxf.systest.jaxrs.JAXRSLoggingAtomPushTest logSixEvents
SEVERE: severe message
May 22, 2010 5:53:35 AM org.apache.cxf.systest.jaxrs.JAXRSLoggingAtomPushTest logSixEvents
WARNING: warning message
May 22, 2010 5:53:35 AM org.apache.cxf.systest.jaxrs.JAXRSLoggingAtomPushTest logSixEvents
INFO: info message
May 22, 2010 5:53:38 AM org.apache.cxf.systest.jaxrs.JAXRSLoggingAtomPushTest logSixEvents
SEVERE: severe message
May 22, 2010 5:53:38 AM org.apache.cxf.systest.jaxrs.JAXRSLoggingAtomPushTest logSixEvents
WARNING: warning message
May 22, 2010 5:53:38 AM org.apache.cxf.systest.jaxrs.JAXRSLoggingAtomPushTest logSixEvents
INFO: info message
May 22, 2010 5:53:41 AM org.apache.cxf.systest.jaxrs.JAXRSLoggingAtomPushTest logSixEvents
SEVERE: severe message
May 22, 2010 5:53:41 AM org.apache.cxf.systest.jaxrs.JAXRSLoggingAtomPushTest logSixEvents
WARNING: warning message
May 22, 2010 5:53:41 AM org.apache.cxf.systest.jaxrs.JAXRSLoggingAtomPushTest logSixEvents
INFO: info message
May 22, 2010 5:53:44 AM org.apache.cxf.systest.jaxrs.JAXRSLoggingAtomPushTest logSixEvents
SEVERE: severe message
May 22, 2010 5:53:44 AM org.apache.cxf.systest.jaxrs.JAXRSLoggingAtomPushTest logSixEvents
WARNING: warning message
May 22, 2010 5:53:44 AM org.apache.cxf.systest.jaxrs.JAXRSLoggingAtomPushTest logSixEvents
INFO: info message
May 22, 2010 5:53:47 AM org.apache.cxf.systest.jaxrs.JAXRSLoggingAtomPushTest logSixEvents
SEVERE: severe message
May 22, 2010 5:53:47 AM org.apache.cxf.systest.jaxrs.JAXRSLoggingAtomPushTest logSixEvents
WARNING: warning message
May 22, 2010 5:53:47 AM org.apache.cxf.systest.jaxrs.JAXRSLoggingAtomPushTest logSixEvents
INFO: info message
Tests run: 5, Failures: 0, Errors: 0, Skipped: 0, Time elapsed: 16.584 sec

Results :

Tests run: 281, Failures: 0, Errors: 0, Skipped: 4

[HUDSON] Recording test results
[INFO] [jar:jar {execution: default-jar}]
[INFO] Building jar: <http://hudson.zones.apache.org/hudson/job/CXF-Trunk-JDK16/ws/trunk/systests/jaxrs/target/cxf-systests-jaxrs-2.3.0-SNAPSHOT.jar>
[INFO] [jar:test-jar {execution: attach-sources}]
[INFO] Building jar: <http://hudson.zones.apache.org/hudson/job/CXF-Trunk-JDK16/ws/trunk/systests/jaxrs/target/cxf-systests-jaxrs-2.3.0-SNAPSHOT-tests.jar>
[INFO] [install:install {execution: default-install}]
[INFO] Installing <http://hudson.zones.apache.org/hudson/job/CXF-Trunk-JDK16/ws/trunk/systests/jaxrs/target/cxf-systests-jaxrs-2.3.0-SNAPSHOT.jar>
to <http://hudson.zones.apache.org/hudson/job/CXF-Trunk-JDK16/ws/.repository/org/apache/cxf/systests/cxf-systests-jaxrs/2.3.0-SNAPSHOT/cxf-systests-jaxrs-2.3.0-SNAPSHOT.jar>
[INFO] Installing <http://hudson.zones.apache.org/hudson/job/CXF-Trunk-JDK16/ws/trunk/systests/jaxrs/target/cxf-systests-jaxrs-2.3.0-SNAPSHOT-tests.jar>
to <http://hudson.zones.apache.org/hudson/job/CXF-Trunk-JDK16/ws/.repository/org/apache/cxf/systests/cxf-systests-jaxrs/2.3.0-SNAPSHOT/cxf-systests-jaxrs-2.3.0-SNAPSHOT-tests.jar>
[HUDSON] Archiving <http://hudson.zones.apache.org/hudson/job/CXF-Trunk-JDK16/ws/trunk/systests/jaxrs/target/cxf-systests-jaxrs-2.3.0-SNAPSHOT.jar>
to /export/home/hudson/hudson/jobs/CXF-Trunk-JDK16/modules/org.apache.cxf.systests$cxf-systests-jaxrs/builds/2010-05-22_05-17-41/archive/org.apache.cxf.systests/cxf-systests-jaxrs/2.3.0-SNAPSHOT/cxf-systests-jaxrs-2.3.0-SNAPSHOT.jar
[HUDSON] Archiving <http://hudson.zones.apache.org/hudson/job/CXF-Trunk-JDK16/ws/trunk/systests/jaxrs/target/cxf-systests-jaxrs-2.3.0-SNAPSHOT-tests.jar>
to /export/home/hudson/hudson/jobs/CXF-Trunk-JDK16/modules/org.apache.cxf.systests$cxf-systests-jaxrs/builds/2010-05-22_05-17-41/archive/org.apache.cxf.systests/cxf-systests-jaxrs/2.3.0-SNAPSHOT/cxf-systests-jaxrs-2.3.0-SNAPSHOT-tests.jar
[INFO] ------------------------------------------------------------------------
[INFO] Building Apache CXF WS-* Specifications System Tests
[INFO]    task-segment: [clean, install]
[INFO] ------------------------------------------------------------------------
[INFO] [clean:clean {execution: default-clean}]
[INFO] Deleting <http://hudson.zones.apache.org/hudson/job/CXF-Trunk-JDK16/ws/trunk/systests/ws-specs/target>
[INFO] [checkstyle:checkstyle {execution: validate}]
[INFO] Starting audit...
Audit done.

[INFO] Preparing pmd:check
[HUDSON] Archiving <http://hudson.zones.apache.org/hudson/job/CXF-Trunk-JDK16/ws/trunk/systests/ws-specs/pom.xml>
to /export/home/hudson/hudson/jobs/CXF-Trunk-JDK16/modules/org.apache.cxf.systests$cxf-systests-ws-specs/builds/2010-05-22_05-17-41/archive/org.apache.cxf.systests/cxf-systests-ws-specs/2.3.0-SNAPSHOT/pom.xml
[INFO] [pmd:pmd {execution: pmd}]
[locks-and-latches] Releasing all the locks
[locks-and-latches] All the locks released
ERROR: Failed to parse POMs
hudson.util.IOException2: Failed to join the process
	at hudson.Proc$RemoteProc.join(Proc.java:312)
	at hudson.maven.ProcessCache$MavenProcess.call(ProcessCache.java:164)
	at hudson.maven.MavenModuleSetBuild$RunnerImpl.doRun(MavenModuleSetBuild.java:480)
	at hudson.model.AbstractBuild$AbstractRunner.run(AbstractBuild.java:416)
	at hudson.model.Run.run(Run.java:1243)
	at hudson.maven.MavenModuleSetBuild.run(MavenModuleSetBuild.java:304)
	at hudson.model.ResourceController.execute(ResourceController.java:88)
	at hudson.model.Executor.run(Executor.java:122)
Caused by: java.util.concurrent.ExecutionException: hudson.remoting.RequestAbortedException:
java.io.EOFException
	at hudson.remoting.Request$1.get(Request.java:218)
	at hudson.remoting.Request$1.get(Request.java:172)
	at hudson.remoting.FutureAdapter.get(FutureAdapter.java:55)
	at hudson.Proc$RemoteProc.join(Proc.java:304)
	... 7 more
Caused by: hudson.remoting.RequestAbortedException: java.io.EOFException
	at hudson.remoting.Request.abort(Request.java:257)
	at hudson.remoting.Channel.terminate(Channel.java:598)
	at hudson.remoting.Channel$ReaderThread.run(Channel.java:876)
Caused by: java.io.EOFException
	at java.io.ObjectInputStream$BlockDataInputStream.peekByte(ObjectInputStream.java:2554)
	at java.io.ObjectInputStream.readObject0(ObjectInputStream.java:1297)
	at java.io.ObjectInputStream.readObject(ObjectInputStream.java:351)
	at hudson.remoting.Channel$ReaderThread.run(Channel.java:856)
FATAL: channel is already closed
hudson.remoting.ChannelClosedException: channel is already closed
	at hudson.remoting.Channel.send(Channel.java:412)
	at hudson.remoting.Request.call(Request.java:105)
	at hudson.remoting.Channel.call(Channel.java:551)
	at hudson.Launcher$RemoteLauncher.kill(Launcher.java:735)
	at hudson.model.AbstractBuild$AbstractRunner.run(AbstractBuild.java:421)
	at hudson.model.Run.run(Run.java:1243)
	at hudson.maven.MavenModuleSetBuild.run(MavenModuleSetBuild.java:304)
	at hudson.model.ResourceController.execute(ResourceController.java:88)
	at hudson.model.Executor.run(Executor.java:122)


Mime
View raw message