cxf-notifications mailing list archives

Site index · List index
Message view « Date » · « Thread »
Top « Date » · « Thread »
From Apache Hudson Server <hud...@hudson.zones.apache.org>
Subject Build failed in Hudson: CXF-trunk-deploy » Apache CXF Distribution #311
Date Thu, 15 Apr 2010 07:26:51 GMT
See <http://hudson.zones.apache.org/hudson/job/CXF-trunk-deploy/org.apache.cxf$apache-cxf/311/>

------------------------------------------
[INFO] ------------------------------------------------------------------------
[INFO] Building Apache CXF Distribution
[INFO]    task-segment: [clean, deploy]
[INFO] ------------------------------------------------------------------------
[INFO] [clean:clean]
[INFO] Deleting file set: <http://hudson.zones.apache.org/hudson/job/CXF-trunk-deploy/org.apache.cxf$apache-cxf/ws/target>
(included: [**], excluded: [])
[INFO] [checkstyle:checkstyle {execution: validate}]
[INFO] [cxf-xml2fastinfoset:xml2fastinfoset {execution: xml2fastinfoset}]
[INFO] [antrun:run {execution: process-sources-xsl}]
[INFO] Executing tasks
     [copy] Copying 1 file to <http://hudson.zones.apache.org/hudson/job/CXF-trunk-deploy/org.apache.cxf$apache-cxf/ws/target>
[INFO] Executed tasks
[INFO] [remote-resources:process {execution: default}]
[INFO] [site:attach-descriptor]
[INFO] Preparing source:jar
[WARNING] Removing: jar from forked lifecycle, to prevent recursive invocation.
[HUDSON] Archiving <http://hudson.zones.apache.org/hudson/job/CXF-trunk-deploy/org.apache.cxf$apache-cxf/ws/pom.xml>
to /export/home/hudson/hudson/jobs/CXF-trunk-deploy/modules/org.apache.cxf$apache-cxf/builds/2010-04-15_06-02-48/archive/org.apache.cxf/apache-cxf/2.3.0-SNAPSHOT/pom.xml
[INFO] [checkstyle:checkstyle {execution: validate}]
[INFO] [cxf-xml2fastinfoset:xml2fastinfoset {execution: xml2fastinfoset}]
[INFO] [source:jar {execution: attach-sources}]
[INFO] [javadoc:jar {execution: attach-javadocs}]
[INFO] Not executing Javadoc as the project is not a Java classpath-capable package
[INFO] [dependency:unpack {execution: unpack-javadoc}]
[INFO] Configured Artifact: org.apache.cxf:cxf-api:javadoc:2.3.0-SNAPSHOT:jar
[INFO] Unpacking /home/hudson/hudson-slave/workspace/CXF-trunk-deploy/.repository/org/apache/cxf/cxf-api/2.3.0-SNAPSHOT/cxf-api-2.3.0-SNAPSHOT-javadoc.jar
to
  <http://hudson.zones.apache.org/hudson/job/CXF-trunk-deploy/org.apache.cxf$apache-cxf/ws/target/javadoc>
   with includes null and excludes:null
[INFO] [dependency:copy {execution: add-jars}]
[INFO] Configured Artifact: org.apache.cxf:cxf-integration-jbi:2.3.0-SNAPSHOT:jar
[INFO] snapshot org.apache.cxf:cxf-integration-jbi:2.3.0-SNAPSHOT: checking for updates from
apache.snapshots
[INFO] Configured Artifact: org.apache.cxf:cxf-integration-jca:2.3.0-SNAPSHOT:jar
[INFO] snapshot org.apache.cxf:cxf-integration-jca:2.3.0-SNAPSHOT: checking for updates from
apache.snapshots
[INFO] Configured Artifact: org.apache.cxf:cxf-rt-bindings-jbi:2.3.0-SNAPSHOT:jar
[INFO] snapshot org.apache.cxf:cxf-rt-bindings-jbi:2.3.0-SNAPSHOT: checking for updates from
apache.snapshots
[INFO] Configured Artifact: org.apache.cxf:cxf-rt-transports-jbi:2.3.0-SNAPSHOT:jar
[INFO] snapshot org.apache.cxf:cxf-rt-transports-jbi:2.3.0-SNAPSHOT: checking for updates
from apache.snapshots
[INFO] Configured Artifact: junit:junit:4.4:jar
[INFO] Configured Artifact: commons-httpclient:commons-httpclient:3.1:jar
[INFO] Configured Artifact: org.apache.geronimo.specs:geronimo-ejb_3.0_spec:1.0.1:jar
[INFO] Copying cxf-integration-jbi-2.3.0-SNAPSHOT.jar to <http://hudson.zones.apache.org/hudson/job/CXF-trunk-deploy/org.apache.cxf$apache-cxf/ws/target/additional-libs/cxf-integration-jbi-2.3.0-SNAPSHOT.jar>
[INFO] Copying cxf-integration-jca-2.3.0-SNAPSHOT.jar to <http://hudson.zones.apache.org/hudson/job/CXF-trunk-deploy/org.apache.cxf$apache-cxf/ws/target/additional-libs/cxf-integration-jca-2.3.0-SNAPSHOT.jar>
[INFO] Copying cxf-rt-bindings-jbi-2.3.0-SNAPSHOT.jar to <http://hudson.zones.apache.org/hudson/job/CXF-trunk-deploy/org.apache.cxf$apache-cxf/ws/target/additional-libs/cxf-rt-bindings-jbi-2.3.0-SNAPSHOT.jar>
[INFO] Copying cxf-rt-transports-jbi-2.3.0-SNAPSHOT.jar to <http://hudson.zones.apache.org/hudson/job/CXF-trunk-deploy/org.apache.cxf$apache-cxf/ws/target/additional-libs/cxf-rt-transports-jbi-2.3.0-SNAPSHOT.jar>
[INFO] Copying junit-4.4.jar to <http://hudson.zones.apache.org/hudson/job/CXF-trunk-deploy/org.apache.cxf$apache-cxf/ws/target/sample-libs/junit-4.4.jar>
[INFO] Copying commons-httpclient-3.1.jar to <http://hudson.zones.apache.org/hudson/job/CXF-trunk-deploy/org.apache.cxf$apache-cxf/ws/target/sample-libs/commons-httpclient-3.1.jar>
[INFO] Copying geronimo-ejb_3.0_spec-1.0.1.jar to <http://hudson.zones.apache.org/hudson/job/CXF-trunk-deploy/org.apache.cxf$apache-cxf/ws/target/sample-libs/geronimo-ejb_3.0_spec-1.0.1.jar>
[INFO] [assembly:single {execution: distribution-package}]
[INFO] Reading assembly descriptor: src/main/assembly/bin.xml
[INFO] Reading assembly descriptor: src/main/assembly/src.xml
[WARNING] Cannot include project artifact: org.apache.cxf:apache-cxf:pom:2.3.0-SNAPSHOT; it
doesn't have an associated file or directory.
[WARNING] Attempting to build MavenProject instance for Artifact (org.apache.cxf.xjcplugins:cxf-xjc-dv:2.3.0-20100312.055219-5)
of type: jar; constructing POM artifact instead.
[WARNING] Attempting to build MavenProject instance for Artifact (org.apache.cxf.xjcplugins:cxf-xjc-ts:2.3.0-20100312.055219-5)
of type: jar; constructing POM artifact instead.
[WARNING] Cannot include project artifact: org.apache.cxf:apache-cxf:pom:2.3.0-SNAPSHOT; it
doesn't have an associated file or directory.
[WARNING] Attempting to build MavenProject instance for Artifact (org.apache.cxf.xjcplugins:cxf-xjc-dv:2.3.0-20100312.055219-5)
of type: jar; constructing POM artifact instead.
[WARNING] Attempting to build MavenProject instance for Artifact (org.apache.cxf.xjcplugins:cxf-xjc-ts:2.3.0-20100312.055219-5)
of type: jar; constructing POM artifact instead.
[WARNING] Cannot include project artifact: org.apache.cxf:apache-cxf:pom:2.3.0-SNAPSHOT; it
doesn't have an associated file or directory.
[INFO] Copying files to <http://hudson.zones.apache.org/hudson/job/CXF-trunk-deploy/org.apache.cxf$apache-cxf/ws/target/apache-cxf-2.3.0-SNAPSHOT>
[WARNING] Assembly file: <http://hudson.zones.apache.org/hudson/job/CXF-trunk-deploy/org.apache.cxf$apache-cxf/ws/target/apache-cxf-2.3.0-SNAPSHOT>
is not a regular file (it may be a directory). It cannot be attached to the project build
for installation or deployment.
[WARNING] Cannot include project artifact: org.apache.cxf:apache-cxf:pom:2.3.0-SNAPSHOT; it
doesn't have an associated file or directory.
[WARNING] Attempting to build MavenProject instance for Artifact (org.apache.cxf.xjcplugins:cxf-xjc-dv:2.3.0-20100312.055219-5)
of type: jar; constructing POM artifact instead.
[WARNING] Attempting to build MavenProject instance for Artifact (org.apache.cxf.xjcplugins:cxf-xjc-ts:2.3.0-20100312.055219-5)
of type: jar; constructing POM artifact instead.
[WARNING] Cannot include project artifact: org.apache.cxf:apache-cxf:pom:2.3.0-SNAPSHOT; it
doesn't have an associated file or directory.
[WARNING] Attempting to build MavenProject instance for Artifact (org.apache.cxf.xjcplugins:cxf-xjc-dv:2.3.0-20100312.055219-5)
of type: jar; constructing POM artifact instead.
[WARNING] Attempting to build MavenProject instance for Artifact (org.apache.cxf.xjcplugins:cxf-xjc-ts:2.3.0-20100312.055219-5)
of type: jar; constructing POM artifact instead.
[WARNING] Cannot include project artifact: org.apache.cxf:apache-cxf:pom:2.3.0-SNAPSHOT; it
doesn't have an associated file or directory.
[INFO] Building tar : <http://hudson.zones.apache.org/hudson/job/CXF-trunk-deploy/org.apache.cxf$apache-cxf/ws/target/apache-cxf-2.3.0-SNAPSHOT.tar.gz>
[WARNING] Cannot include project artifact: org.apache.cxf:apache-cxf:pom:2.3.0-SNAPSHOT; it
doesn't have an associated file or directory.
[WARNING] Attempting to build MavenProject instance for Artifact (org.apache.cxf.xjcplugins:cxf-xjc-dv:2.3.0-20100312.055219-5)
of type: jar; constructing POM artifact instead.
[WARNING] Attempting to build MavenProject instance for Artifact (org.apache.cxf.xjcplugins:cxf-xjc-ts:2.3.0-20100312.055219-5)
of type: jar; constructing POM artifact instead.
[WARNING] Cannot include project artifact: org.apache.cxf:apache-cxf:pom:2.3.0-SNAPSHOT; it
doesn't have an associated file or directory.
[WARNING] Attempting to build MavenProject instance for Artifact (org.apache.cxf.xjcplugins:cxf-xjc-dv:2.3.0-20100312.055219-5)
of type: jar; constructing POM artifact instead.
[WARNING] Attempting to build MavenProject instance for Artifact (org.apache.cxf.xjcplugins:cxf-xjc-ts:2.3.0-20100312.055219-5)
of type: jar; constructing POM artifact instead.
[WARNING] Cannot include project artifact: org.apache.cxf:apache-cxf:pom:2.3.0-SNAPSHOT; it
doesn't have an associated file or directory.
[INFO] Building zip: <http://hudson.zones.apache.org/hudson/job/CXF-trunk-deploy/org.apache.cxf$apache-cxf/ws/target/apache-cxf-2.3.0-SNAPSHOT.zip>
[INFO] Building tar : <http://hudson.zones.apache.org/hudson/job/CXF-trunk-deploy/org.apache.cxf$apache-cxf/ws/target/apache-cxf-2.3.0-SNAPSHOT-src.tar.gz>
[INFO] Building zip: <http://hudson.zones.apache.org/hudson/job/CXF-trunk-deploy/org.apache.cxf$apache-cxf/ws/target/apache-cxf-2.3.0-SNAPSHOT-src.zip>
[INFO] [install:install]
[INFO] Installing <http://hudson.zones.apache.org/hudson/job/CXF-trunk-deploy/org.apache.cxf$apache-cxf/ws/pom.xml>
to /home/hudson/hudson-slave/workspace/CXF-trunk-deploy/.repository/org/apache/cxf/apache-cxf/2.3.0-SNAPSHOT/apache-cxf-2.3.0-SNAPSHOT.pom
[INFO] Installing <http://hudson.zones.apache.org/hudson/job/CXF-trunk-deploy/org.apache.cxf$apache-cxf/ws/target/apache-cxf-2.3.0-SNAPSHOT.tar.gz>
to /home/hudson/hudson-slave/workspace/CXF-trunk-deploy/.repository/org/apache/cxf/apache-cxf/2.3.0-SNAPSHOT/apache-cxf-2.3.0-SNAPSHOT.tar.gz
[INFO] Installing <http://hudson.zones.apache.org/hudson/job/CXF-trunk-deploy/org.apache.cxf$apache-cxf/ws/target/apache-cxf-2.3.0-SNAPSHOT.zip>
to /home/hudson/hudson-slave/workspace/CXF-trunk-deploy/.repository/org/apache/cxf/apache-cxf/2.3.0-SNAPSHOT/apache-cxf-2.3.0-SNAPSHOT.zip
[INFO] Installing <http://hudson.zones.apache.org/hudson/job/CXF-trunk-deploy/org.apache.cxf$apache-cxf/ws/target/apache-cxf-2.3.0-SNAPSHOT-src.tar.gz>
to /home/hudson/hudson-slave/workspace/CXF-trunk-deploy/.repository/org/apache/cxf/apache-cxf/2.3.0-SNAPSHOT/apache-cxf-2.3.0-SNAPSHOT-src.tar.gz
[INFO] Installing <http://hudson.zones.apache.org/hudson/job/CXF-trunk-deploy/org.apache.cxf$apache-cxf/ws/target/apache-cxf-2.3.0-SNAPSHOT-src.zip>
to /home/hudson/hudson-slave/workspace/CXF-trunk-deploy/.repository/org/apache/cxf/apache-cxf/2.3.0-SNAPSHOT/apache-cxf-2.3.0-SNAPSHOT-src.zip
[INFO] [deploy:deploy]
[INFO] Retrieving previous build number from apache.snapshots.https
Uploading: https://repository.apache.org/content/repositories/snapshots/org/apache/cxf/apache-cxf/2.3.0-SNAPSHOT/apache-cxf-2.3.0-SNAPSHOT.pom
18K uploaded
[INFO] Retrieving previous metadata from apache.snapshots.https
[INFO] Uploading repository metadata for: 'snapshot org.apache.cxf:apache-cxf:2.3.0-SNAPSHOT'
[INFO] Retrieving previous metadata from apache.snapshots.https
[INFO] Uploading repository metadata for: 'artifact org.apache.cxf:apache-cxf'
[INFO] Retrieving previous build number from apache.snapshots.https
Uploading: https://repository.apache.org/content/repositories/snapshots/org/apache/cxf/apache-cxf/2.3.0-SNAPSHOT/apache-cxf-2.3.0-SNAPSHOT.tar.gz
31409K uploaded
[INFO] Retrieving previous build number from apache.snapshots.https
Uploading: https://repository.apache.org/content/repositories/snapshots/org/apache/cxf/apache-cxf/2.3.0-SNAPSHOT/apache-cxf-2.3.0-SNAPSHOT.zip
33406K uploaded
[HUDSON] Archiving <http://hudson.zones.apache.org/hudson/job/CXF-trunk-deploy/org.apache.cxf$apache-cxf/ws/target/apache-cxf-2.3.0-SNAPSHOT.tar.gz>
to /export/home/hudson/hudson/jobs/CXF-trunk-deploy/modules/org.apache.cxf$apache-cxf/builds/2010-04-15_06-02-48/archive/org.apache.cxf/apache-cxf/2.3.0-SNAPSHOT/apache-cxf-2.3.0-SNAPSHOT.tar.gz
[HUDSON] Archiving <http://hudson.zones.apache.org/hudson/job/CXF-trunk-deploy/org.apache.cxf$apache-cxf/ws/target/apache-cxf-2.3.0-SNAPSHOT.zip>
to /export/home/hudson/hudson/jobs/CXF-trunk-deploy/modules/org.apache.cxf$apache-cxf/builds/2010-04-15_06-02-48/archive/org.apache.cxf/apache-cxf/2.3.0-SNAPSHOT/apache-cxf-2.3.0-SNAPSHOT.zip
[HUDSON] Archiving <http://hudson.zones.apache.org/hudson/job/CXF-trunk-deploy/org.apache.cxf$apache-cxf/ws/target/apache-cxf-2.3.0-SNAPSHOT-src.tar.gz>
to /export/home/hudson/hudson/jobs/CXF-trunk-deploy/modules/org.apache.cxf$apache-cxf/builds/2010-04-15_06-02-48/archive/org.apache.cxf/apache-cxf/2.3.0-SNAPSHOT/apache-cxf-2.3.0-SNAPSHOT-src.tar.gz
[HUDSON] Archiving <http://hudson.zones.apache.org/hudson/job/CXF-trunk-deploy/org.apache.cxf$apache-cxf/ws/target/apache-cxf-2.3.0-SNAPSHOT-src.zip>
to /export/home/hudson/hudson/jobs/CXF-trunk-deploy/modules/org.apache.cxf$apache-cxf/builds/2010-04-15_06-02-48/archive/org.apache.cxf/apache-cxf/2.3.0-SNAPSHOT/apache-cxf-2.3.0-SNAPSHOT-src.zip
[INFO] ------------------------------------------------------------------------
[ERROR] BUILD ERROR
[INFO] ------------------------------------------------------------------------
[INFO] Error deploying artifact: Failed to transfer file: https://repository.apache.org/content/repositories/snapshots/org/apache/cxf/apache-cxf/2.3.0-SNAPSHOT/apache-cxf-2.3.0-SNAPSHOT.zip.
Return code is: 502

[INFO] ------------------------------------------------------------------------
[INFO] Trace
org.apache.maven.lifecycle.LifecycleExecutionException: Error deploying artifact: Failed to
transfer file: https://repository.apache.org/content/repositories/snapshots/org/apache/cxf/apache-cxf/2.3.0-SNAPSHOT/apache-cxf-2.3.0-SNAPSHOT.zip.
Return code is: 502
	at org.apache.maven.lifecycle.DefaultLifecycleExecutor.executeGoals(DefaultLifecycleExecutor.java:583)
	at org.apache.maven.lifecycle.DefaultLifecycleExecutor.executeGoalWithLifecycle(DefaultLifecycleExecutor.java:499)
	at org.apache.maven.lifecycle.DefaultLifecycleExecutor.executeGoal(DefaultLifecycleExecutor.java:478)
	at org.apache.maven.lifecycle.DefaultLifecycleExecutor.executeGoalAndHandleFailures(DefaultLifecycleExecutor.java:330)
	at org.apache.maven.lifecycle.DefaultLifecycleExecutor.executeTaskSegments(DefaultLifecycleExecutor.java:291)
	at org.apache.maven.lifecycle.DefaultLifecycleExecutor.execute(DefaultLifecycleExecutor.java:142)
	at org.apache.maven.lifecycle.LifecycleExecutorInterceptor.execute(LifecycleExecutorInterceptor.java:65)
	at org.apache.maven.DefaultMaven.doExecute(DefaultMaven.java:336)
	at org.apache.maven.DefaultMaven.execute(DefaultMaven.java:129)
	at org.apache.maven.cli.MavenCli.main(MavenCli.java:287)
	at sun.reflect.NativeMethodAccessorImpl.invoke0(Native Method)
	at sun.reflect.NativeMethodAccessorImpl.invoke(NativeMethodAccessorImpl.java:39)
	at sun.reflect.DelegatingMethodAccessorImpl.invoke(DelegatingMethodAccessorImpl.java:25)
	at java.lang.reflect.Method.invoke(Method.java:592)
	at org.codehaus.classworlds.Launcher.launchEnhanced(Launcher.java:315)
	at org.codehaus.classworlds.Launcher.launch(Launcher.java:255)
	at hudson.maven.agent.Main.launch(Main.java:165)
	at hudson.maven.MavenBuilder.call(MavenBuilder.java:159)
	at hudson.maven.MavenModuleSetBuild$Builder.call(MavenModuleSetBuild.java:688)
	at hudson.maven.MavenModuleSetBuild$Builder.call(MavenModuleSetBuild.java:632)
	at hudson.remoting.UserRequest.perform(UserRequest.java:104)
	at hudson.remoting.UserRequest.perform(UserRequest.java:48)
	at hudson.remoting.Request$2.run(Request.java:236)
	at java.util.concurrent.Executors$RunnableAdapter.call(Executors.java:417)
	at java.util.concurrent.FutureTask$Sync.innerRun(FutureTask.java:269)
	at java.util.concurrent.FutureTask.run(FutureTask.java:123)
	at java.util.concurrent.ThreadPoolExecutor$Worker.runTask(ThreadPoolExecutor.java:651)
	at java.util.concurrent.ThreadPoolExecutor$Worker.run(ThreadPoolExecutor.java:676)
	at java.lang.Thread.run(Thread.java:595)
Caused by: org.apache.maven.plugin.MojoExecutionException: Error deploying artifact: Failed
to transfer file: https://repository.apache.org/content/repositories/snapshots/org/apache/cxf/apache-cxf/2.3.0-SNAPSHOT/apache-cxf-2.3.0-SNAPSHOT.zip.
Return code is: 502
	at org.apache.maven.plugin.deploy.DeployMojo.execute(DeployMojo.java:195)
	at org.apache.maven.plugin.DefaultPluginManager.executeMojo(DefaultPluginManager.java:451)
	at hudson.maven.agent.PluginManagerInterceptor.executeMojo(PluginManagerInterceptor.java:182)
	at org.apache.maven.lifecycle.DefaultLifecycleExecutor.executeGoals(DefaultLifecycleExecutor.java:558)
	... 28 more
Caused by: org.apache.maven.artifact.deployer.ArtifactDeploymentException: Error deploying
artifact: Failed to transfer file: https://repository.apache.org/content/repositories/snapshots/org/apache/cxf/apache-cxf/2.3.0-SNAPSHOT/apache-cxf-2.3.0-SNAPSHOT.zip.
Return code is: 502
	at org.apache.maven.artifact.deployer.DefaultArtifactDeployer.deploy(DefaultArtifactDeployer.java:94)
	at org.apache.maven.plugin.deploy.DeployMojo.execute(DeployMojo.java:190)
	... 31 more
Caused by: org.apache.maven.wagon.TransferFailedException: Failed to transfer file: https://repository.apache.org/content/repositories/snapshots/org/apache/cxf/apache-cxf/2.3.0-SNAPSHOT/apache-cxf-2.3.0-SNAPSHOT.zip.
Return code is: 502
	at org.apache.maven.wagon.providers.http.LightweightHttpWagon.put(LightweightHttpWagon.java:172)
	at org.apache.maven.artifact.manager.DefaultWagonManager.putRemoteFile(DefaultWagonManager.java:244)
	at org.apache.maven.artifact.manager.DefaultWagonManager.putArtifact(DefaultWagonManager.java:160)
	at org.apache.maven.artifact.deployer.DefaultArtifactDeployer.deploy(DefaultArtifactDeployer.java:80)
	... 32 more
[INFO] ------------------------------------------------------------------------
[INFO] Total time: 83 minutes 37 seconds
[INFO] Finished at: Thu Apr 15 07:26:36 UTC 2010
[INFO] Final Memory: 170M/327M
[INFO] ------------------------------------------------------------------------
Waiting for Hudson to finish collecting data


Mime
View raw message