cxf-notifications mailing list archives

Site index · List index
Message view « Date » · « Thread »
Top « Date » · « Thread »
From Apache Hudson Server <hud...@hudson.zones.apache.org>
Subject Build failed in Hudson: CXF-Trunk-JDK15 » Apache CXF Runtime HTTP Transport #1127
Date Tue, 09 Mar 2010 09:30:28 GMT
See <http://hudson.zones.apache.org/hudson/job/CXF-Trunk-JDK15/org.apache.cxf$cxf-rt-transports-http/1127/changes>

Changes:

[cleclerc] [CXF-2693] Allow to use HttpsURLConnection's defaultSSLSocketFactory and defaultHostnameVerifier
in CXF client

------------------------------------------
[INFO] ------------------------------------------------------------------------
[INFO] Building Apache CXF Runtime HTTP Transport
[INFO]    task-segment: [clean, install]
[INFO] ------------------------------------------------------------------------
[INFO] [clean:clean {execution: default-clean}]
[INFO] Deleting file set: <http://hudson.zones.apache.org/hudson/job/CXF-Trunk-JDK15/org.apache.cxf$cxf-rt-transports-http/ws/target>
(included: [**], excluded: [])
[INFO] [checkstyle:checkstyle {execution: validate}]
[INFO] Starting audit...
Audit done.

[INFO] Preparing pmd:check
[HUDSON] Archiving <http://hudson.zones.apache.org/hudson/job/CXF-Trunk-JDK15/org.apache.cxf$cxf-rt-transports-http/ws/pom.xml>
to /export/home/hudson/hudson/jobs/CXF-Trunk-JDK15/modules/org.apache.cxf$cxf-rt-transports-http/builds/2010-03-09_09-24-11/archive/org.apache.cxf/cxf-rt-transports-http/2.3.0-SNAPSHOT/pom.xml
[INFO] [pmd:pmd {execution: pmd}]
[INFO] [pmd:check {execution: validate}]
[INFO] 
[INFO] [cxf-xml2fastinfoset:xml2fastinfoset {execution: xml2fastinfoset}]
[INFO] [cxf-xjc:xsdtojava {execution: generate-sources}]
[INFO] snapshot org.apache.cxf.xjcplugins:cxf-xjc-pl:2.3.0-SNAPSHOT: checking for updates
from apache.snapshots
[INFO] [remote-resources:process {execution: default}]
[INFO] [resources:resources {execution: default-resources}]
[INFO] Using 'UTF-8' encoding to copy filtered resources.
[INFO] Copying 6 resources
[INFO] Copying 10 resources
[INFO] skip non existing resourceDirectory <http://hudson.zones.apache.org/hudson/job/CXF-Trunk-JDK15/org.apache.cxf$cxf-rt-transports-http/ws/src/main/resources-filtered>
[INFO] Copying 2 resources
[INFO] Copying 3 resources
[INFO] [compiler:compile {execution: default-compile}]
[INFO] Compiling 58 source files to <http://hudson.zones.apache.org/hudson/job/CXF-Trunk-JDK15/org.apache.cxf$cxf-rt-transports-http/ws/target/classes>
[INFO] ------------------------------------------------------------------------
[ERROR] BUILD FAILURE
[INFO] ------------------------------------------------------------------------
[INFO] Compilation failure

<http://hudson.zones.apache.org/hudson/job/CXF-Trunk-JDK15/org.apache.cxf$cxf-rt-transports-http/ws/src/main/java/org/apache/cxf/transport/servlet/AbstractHTTPServlet.java>:[241,19]
[deprecation] getRealPath(java.lang.String) in javax.servlet.ServletRequest has been deprecated

<http://hudson.zones.apache.org/hudson/job/CXF-Trunk-JDK15/org.apache.cxf$cxf-rt-transports-http/ws/src/main/java/org/apache/cxf/transport/servlet/AbstractHTTPServlet.java>:[241,19]
[deprecation] isRequestedSessionIdFromUrl() in javax.servlet.http.HttpServletRequest has been
deprecated

<http://hudson.zones.apache.org/hudson/job/CXF-Trunk-JDK15/org.apache.cxf$cxf-rt-transports-http/ws/src/main/java/org/apache/cxf/transport/servlet/AbstractHTTPServlet.java>:[241,19]
[deprecation] getRealPath(java.lang.String) in javax.servlet.ServletRequest has been deprecated

<http://hudson.zones.apache.org/hudson/job/CXF-Trunk-JDK15/org.apache.cxf$cxf-rt-transports-http/ws/src/main/java/org/apache/cxf/transport/https/HttpsURLConnectionFactory.java>:[133,26]
cannot find symbol
symbol  : constructor IOException(java.lang.String,java.lang.Exception)
location: class java.io.IOException


[INFO] ------------------------------------------------------------------------
[INFO] Trace
org.apache.maven.BuildFailureException: Compilation failure
	at org.apache.maven.lifecycle.DefaultLifecycleExecutor.executeGoals(DefaultLifecycleExecutor.java:715)
	at org.apache.maven.lifecycle.DefaultLifecycleExecutor.executeGoalWithLifecycle(DefaultLifecycleExecutor.java:556)
	at org.apache.maven.lifecycle.DefaultLifecycleExecutor.executeGoal(DefaultLifecycleExecutor.java:535)
	at org.apache.maven.lifecycle.DefaultLifecycleExecutor.executeGoalAndHandleFailures(DefaultLifecycleExecutor.java:387)
	at org.apache.maven.lifecycle.DefaultLifecycleExecutor.executeTaskSegments(DefaultLifecycleExecutor.java:348)
	at org.apache.maven.lifecycle.DefaultLifecycleExecutor.execute(DefaultLifecycleExecutor.java:180)
	at org.apache.maven.lifecycle.LifecycleExecutorInterceptor.execute(LifecycleExecutorInterceptor.java:65)
	at org.apache.maven.DefaultMaven.doExecute(DefaultMaven.java:328)
	at org.apache.maven.DefaultMaven.execute(DefaultMaven.java:138)
	at org.apache.maven.cli.MavenCli.main(MavenCli.java:362)
	at sun.reflect.NativeMethodAccessorImpl.invoke0(Native Method)
	at sun.reflect.NativeMethodAccessorImpl.invoke(NativeMethodAccessorImpl.java:39)
	at sun.reflect.DelegatingMethodAccessorImpl.invoke(DelegatingMethodAccessorImpl.java:25)
	at java.lang.reflect.Method.invoke(Method.java:585)
	at org.codehaus.classworlds.Launcher.launchEnhanced(Launcher.java:315)
	at org.codehaus.classworlds.Launcher.launch(Launcher.java:255)
	at hudson.maven.agent.Main.launch(Main.java:165)
	at hudson.maven.MavenBuilder.call(MavenBuilder.java:159)
	at hudson.maven.MavenModuleSetBuild$Builder.call(MavenModuleSetBuild.java:688)
	at hudson.maven.MavenModuleSetBuild$Builder.call(MavenModuleSetBuild.java:632)
	at hudson.remoting.UserRequest.perform(UserRequest.java:104)
	at hudson.remoting.UserRequest.perform(UserRequest.java:48)
	at hudson.remoting.Request$2.run(Request.java:236)
	at java.util.concurrent.Executors$RunnableAdapter.call(Executors.java:417)
	at java.util.concurrent.FutureTask$Sync.innerRun(FutureTask.java:269)
	at java.util.concurrent.FutureTask.run(FutureTask.java:123)
	at java.util.concurrent.ThreadPoolExecutor$Worker.runTask(ThreadPoolExecutor.java:650)
	at java.util.concurrent.ThreadPoolExecutor$Worker.run(ThreadPoolExecutor.java:675)
	at java.lang.Thread.run(Thread.java:595)
Caused by: org.apache.maven.plugin.CompilationFailureException: Compilation failure
	at org.apache.maven.plugin.AbstractCompilerMojo.execute(AbstractCompilerMojo.java:516)
	at org.apache.maven.plugin.CompilerMojo.execute(CompilerMojo.java:114)
	at org.apache.maven.plugin.DefaultPluginManager.executeMojo(DefaultPluginManager.java:490)
	at hudson.maven.agent.PluginManagerInterceptor.executeMojo(PluginManagerInterceptor.java:182)
	at org.apache.maven.lifecycle.DefaultLifecycleExecutor.executeGoals(DefaultLifecycleExecutor.java:694)
	... 28 more
[INFO] ------------------------------------------------------------------------
[INFO] Total time: 6 minutes 
[INFO] Finished at: Tue Mar 09 09:30:23 UTC 2010
[INFO] Final Memory: 92M/171M
[INFO] ------------------------------------------------------------------------


Mime
View raw message