cxf-notifications mailing list archives

Site index · List index
Message view « Date » · « Thread »
Top « Date » · « Thread »
From Apache Hudson Server <hud...@hudson.zones.apache.org>
Subject Build failed in Hudson: CXF-Trunk-JDK15 » Apache CXF Runtime HTTP Binding #1065
Date Fri, 05 Feb 2010 20:54:52 GMT
See <http://hudson.zones.apache.org/hudson/job/CXF-Trunk-JDK15/org.apache.cxf$cxf-rt-bindings-http/1065/changes>

Changes:

[dkulp] Use new versions of stuff in cxf-build-utils and cxf-xjc-plugins

------------------------------------------
[INFO] ------------------------------------------------------------------------
[INFO] Building Apache CXF Runtime HTTP Binding
[INFO]    task-segment: [clean, install]
[INFO] ------------------------------------------------------------------------
[INFO] [clean:clean {execution: default-clean}]
[INFO] Deleting file set: <http://hudson.zones.apache.org/hudson/job/CXF-Trunk-JDK15/org.apache.cxf$cxf-rt-bindings-http/ws/target>
(included: [**], excluded: [])
[INFO] [checkstyle:checkstyle {execution: validate}]
[INFO] Starting audit...
Audit done.

[INFO] Preparing pmd:check
[HUDSON] Archiving <http://hudson.zones.apache.org/hudson/job/CXF-Trunk-JDK15/org.apache.cxf$cxf-rt-bindings-http/ws/pom.xml>
to /export/home/hudson/hudson/jobs/CXF-Trunk-JDK15/modules/org.apache.cxf$cxf-rt-bindings-http/builds/2010-02-05_20-38-23/archive/org.apache.cxf/cxf-rt-bindings-http/2.3.0-SNAPSHOT/pom.xml
[INFO] [pmd:pmd {execution: pmd}]
[INFO] [pmd:check {execution: validate}]
[INFO] 
[INFO] [cxf-xml2fastinfoset:xml2fastinfoset {execution: xml2fastinfoset}]
[INFO] [remote-resources:process {execution: default}]
[INFO] [resources:resources {execution: default-resources}]
[INFO] Using 'UTF-8' encoding to copy filtered resources.
[INFO] Copying 2 resources
[INFO] Copying 3 resources
[INFO] skip non existing resourceDirectory <http://hudson.zones.apache.org/hudson/job/CXF-Trunk-JDK15/org.apache.cxf$cxf-rt-bindings-http/ws/src/main/resources-filtered>
[INFO] Copying 1 resource
[INFO] Copying 3 resources
[INFO] [compiler:compile {execution: default-compile}]
[INFO] Compiling 16 source files to <http://hudson.zones.apache.org/hudson/job/CXF-Trunk-JDK15/org.apache.cxf$cxf-rt-bindings-http/ws/target/classes>
[INFO] [cxf-xjc:xsdtojava {execution: generate-sources}]
[INFO] [resources:testResources {execution: default-testResources}]
[INFO] Using 'UTF-8' encoding to copy filtered resources.
[INFO] Copying 7 resources
[INFO] Copying 1 resource
[INFO] skip non existing resourceDirectory <http://hudson.zones.apache.org/hudson/job/CXF-Trunk-JDK15/org.apache.cxf$cxf-rt-bindings-http/ws/target/generated/src/test/resources>
[INFO] Copying 3 resources
[INFO] [compiler:testCompile {execution: default-testCompile}]
[INFO] Compiling 15 source files to <http://hudson.zones.apache.org/hudson/job/CXF-Trunk-JDK15/org.apache.cxf$cxf-rt-bindings-http/ws/target/test-classes>
[INFO] ------------------------------------------------------------------------
[ERROR] BUILD FAILURE
[INFO] ------------------------------------------------------------------------
[INFO] Compilation failure

<http://hudson.zones.apache.org/hudson/job/CXF-Trunk-JDK15/org.apache.cxf$cxf-rt-bindings-http/ws/src/test/java/org/apache/cxf/binding/http/mtom/MtomTest.java>:[32,29]
package org.apache.cxf.person does not exist

<http://hudson.zones.apache.org/hudson/job/CXF-Trunk-JDK15/org.apache.cxf$cxf-rt-bindings-http/ws/src/test/java/org/apache/cxf/binding/http/mtom/PeopleServiceImpl.java>:[26,29]
package org.apache.cxf.person does not exist

<http://hudson.zones.apache.org/hudson/job/CXF-Trunk-JDK15/org.apache.cxf$cxf-rt-bindings-http/ws/src/test/java/org/apache/cxf/binding/http/mtom/PeopleServiceImpl.java>:[27,29]
package org.apache.cxf.person does not exist

<http://hudson.zones.apache.org/hudson/job/CXF-Trunk-JDK15/org.apache.cxf$cxf-rt-bindings-http/ws/src/test/java/org/apache/cxf/binding/http/mtom/PeopleService.java>:[25,29]
package org.apache.cxf.person does not exist

<http://hudson.zones.apache.org/hudson/job/CXF-Trunk-JDK15/org.apache.cxf$cxf-rt-bindings-http/ws/src/test/java/org/apache/cxf/binding/http/mtom/PeopleService.java>:[26,29]
package org.apache.cxf.person does not exist

<http://hudson.zones.apache.org/hudson/job/CXF-Trunk-JDK15/org.apache.cxf$cxf-rt-bindings-http/ws/src/test/java/org/apache/cxf/binding/http/mtom/PeopleServiceImpl.java>:[31,9]
cannot find symbol
symbol  : class Person
location: class org.apache.cxf.binding.http.mtom.PeopleServiceImpl

<http://hudson.zones.apache.org/hudson/job/CXF-Trunk-JDK15/org.apache.cxf$cxf-rt-bindings-http/ws/src/test/java/org/apache/cxf/binding/http/mtom/PeopleServiceImpl.java>:[37,26]
cannot find symbol
symbol  : class Person
location: class org.apache.cxf.binding.http.mtom.PeopleServiceImpl

<http://hudson.zones.apache.org/hudson/job/CXF-Trunk-JDK15/org.apache.cxf$cxf-rt-bindings-http/ws/src/test/java/org/apache/cxf/binding/http/mtom/PeopleServiceImpl.java>:[41,11]
cannot find symbol
symbol  : class People
location: class org.apache.cxf.binding.http.mtom.PeopleServiceImpl

<http://hudson.zones.apache.org/hudson/job/CXF-Trunk-JDK15/org.apache.cxf$cxf-rt-bindings-http/ws/src/test/java/org/apache/cxf/binding/http/mtom/PeopleServiceImpl.java>:[47,11]
cannot find symbol
symbol  : class Person
location: class org.apache.cxf.binding.http.mtom.PeopleServiceImpl

<http://hudson.zones.apache.org/hudson/job/CXF-Trunk-JDK15/org.apache.cxf$cxf-rt-bindings-http/ws/src/test/java/org/apache/cxf/binding/http/mtom/PeopleService.java>:[32,4]
cannot find symbol
symbol  : class People
location: interface org.apache.cxf.binding.http.mtom.PeopleService

<http://hudson.zones.apache.org/hudson/job/CXF-Trunk-JDK15/org.apache.cxf$cxf-rt-bindings-http/ws/src/test/java/org/apache/cxf/binding/http/mtom/PeopleService.java>:[36,29]
cannot find symbol
symbol  : class Person
location: interface org.apache.cxf.binding.http.mtom.PeopleService

<http://hudson.zones.apache.org/hudson/job/CXF-Trunk-JDK15/org.apache.cxf$cxf-rt-bindings-http/ws/src/test/java/org/apache/cxf/binding/http/mtom/PeopleService.java>:[40,4]
cannot find symbol
symbol  : class Person
location: interface org.apache.cxf.binding.http.mtom.PeopleService

<http://hudson.zones.apache.org/hudson/job/CXF-Trunk-JDK15/org.apache.cxf$cxf-rt-bindings-http/ws/src/test/java/org/apache/cxf/binding/http/mtom/MtomTest.java>:[63,8]
cannot find symbol
symbol  : class Person
location: class org.apache.cxf.binding.http.mtom.MtomTest

<http://hudson.zones.apache.org/hudson/job/CXF-Trunk-JDK15/org.apache.cxf$cxf-rt-bindings-http/ws/src/test/java/org/apache/cxf/binding/http/mtom/MtomTest.java>:[63,23]
cannot find symbol
symbol  : class Person
location: class org.apache.cxf.binding.http.mtom.MtomTest

<http://hudson.zones.apache.org/hudson/job/CXF-Trunk-JDK15/org.apache.cxf$cxf-rt-bindings-http/ws/src/test/java/org/apache/cxf/binding/http/mtom/PeopleServiceImpl.java>:[31,40]
cannot find symbol
symbol  : class Person
location: class org.apache.cxf.binding.http.mtom.PeopleServiceImpl

<http://hudson.zones.apache.org/hudson/job/CXF-Trunk-JDK15/org.apache.cxf$cxf-rt-bindings-http/ws/src/test/java/org/apache/cxf/binding/http/mtom/PeopleServiceImpl.java>:[42,8]
cannot find symbol
symbol  : class People
location: class org.apache.cxf.binding.http.mtom.PeopleServiceImpl

<http://hudson.zones.apache.org/hudson/job/CXF-Trunk-JDK15/org.apache.cxf$cxf-rt-bindings-http/ws/src/test/java/org/apache/cxf/binding/http/mtom/PeopleServiceImpl.java>:[42,23]
cannot find symbol
symbol  : class People
location: class org.apache.cxf.binding.http.mtom.PeopleServiceImpl


[INFO] ------------------------------------------------------------------------
[INFO] Trace
org.apache.maven.BuildFailureException: Compilation failure
	at org.apache.maven.lifecycle.DefaultLifecycleExecutor.executeGoals(DefaultLifecycleExecutor.java:715)
	at org.apache.maven.lifecycle.DefaultLifecycleExecutor.executeGoalWithLifecycle(DefaultLifecycleExecutor.java:556)
	at org.apache.maven.lifecycle.DefaultLifecycleExecutor.executeGoal(DefaultLifecycleExecutor.java:535)
	at org.apache.maven.lifecycle.DefaultLifecycleExecutor.executeGoalAndHandleFailures(DefaultLifecycleExecutor.java:387)
	at org.apache.maven.lifecycle.DefaultLifecycleExecutor.executeTaskSegments(DefaultLifecycleExecutor.java:348)
	at org.apache.maven.lifecycle.DefaultLifecycleExecutor.execute(DefaultLifecycleExecutor.java:180)
	at org.apache.maven.lifecycle.LifecycleExecutorInterceptor.execute(LifecycleExecutorInterceptor.java:65)
	at org.apache.maven.DefaultMaven.doExecute(DefaultMaven.java:328)
	at org.apache.maven.DefaultMaven.execute(DefaultMaven.java:138)
	at org.apache.maven.cli.MavenCli.main(MavenCli.java:362)
	at sun.reflect.NativeMethodAccessorImpl.invoke0(Native Method)
	at sun.reflect.NativeMethodAccessorImpl.invoke(NativeMethodAccessorImpl.java:39)
	at sun.reflect.DelegatingMethodAccessorImpl.invoke(DelegatingMethodAccessorImpl.java:25)
	at java.lang.reflect.Method.invoke(Method.java:592)
	at org.codehaus.classworlds.Launcher.launchEnhanced(Launcher.java:315)
	at org.codehaus.classworlds.Launcher.launch(Launcher.java:255)
	at hudson.maven.agent.Main.launch(Main.java:165)
	at hudson.maven.MavenBuilder.call(MavenBuilder.java:159)
	at hudson.maven.MavenModuleSetBuild$Builder.call(MavenModuleSetBuild.java:688)
	at hudson.maven.MavenModuleSetBuild$Builder.call(MavenModuleSetBuild.java:632)
	at hudson.remoting.UserRequest.perform(UserRequest.java:104)
	at hudson.remoting.UserRequest.perform(UserRequest.java:48)
	at hudson.remoting.Request$2.run(Request.java:236)
	at java.util.concurrent.Executors$RunnableAdapter.call(Executors.java:417)
	at java.util.concurrent.FutureTask$Sync.innerRun(FutureTask.java:269)
	at java.util.concurrent.FutureTask.run(FutureTask.java:123)
	at java.util.concurrent.ThreadPoolExecutor$Worker.runTask(ThreadPoolExecutor.java:651)
	at java.util.concurrent.ThreadPoolExecutor$Worker.run(ThreadPoolExecutor.java:676)
	at java.lang.Thread.run(Thread.java:595)
Caused by: org.apache.maven.plugin.CompilationFailureException: Compilation failure
	at org.apache.maven.plugin.AbstractCompilerMojo.execute(AbstractCompilerMojo.java:516)
	at org.apache.maven.plugin.TestCompilerMojo.execute(TestCompilerMojo.java:102)
	at org.apache.maven.plugin.DefaultPluginManager.executeMojo(DefaultPluginManager.java:490)
	at hudson.maven.agent.PluginManagerInterceptor.executeMojo(PluginManagerInterceptor.java:182)
	at org.apache.maven.lifecycle.DefaultLifecycleExecutor.executeGoals(DefaultLifecycleExecutor.java:694)
	... 28 more
[INFO] ------------------------------------------------------------------------
[INFO] Total time: 16 minutes 11 seconds
[INFO] Finished at: Fri Feb 05 20:54:44 UTC 2010
[INFO] Final Memory: 100M/173M
[INFO] ------------------------------------------------------------------------


Mime
View raw message