cxf-notifications mailing list archives

Site index · List index
Message view « Date » · « Thread »
Top « Date » · « Thread »
From Apache Hudson Server <hud...@hudson.zones.apache.org>
Subject Build failed in Hudson: CXF-2.1.x-JDK15 » Apache CXF Runtime JAXB DataBinding #289
Date Fri, 11 Dec 2009 21:17:47 GMT
See <http://hudson.zones.apache.org/hudson/job/CXF-2.1.x-JDK15/org.apache.cxf$cxf-rt-databinding-jaxb/289/changes>

Changes:

[dkulp] Merged revisions 889805 via svnmerge from 
https://svn.apache.org/repos/asf/cxf/branches/2.2.x-fixes

................
  r889805 | dkulp | 2009-12-11 15:37:24 -0500 (Fri, 11 Dec 2009) | 13 lines
  
  Merged revisions 889790,889796 via svnmerge from 
  https://svn.apache.org/repos/asf/cxf/trunk
  
  ........
    r889790 | dkulp | 2009-12-11 14:55:59 -0500 (Fri, 11 Dec 2009) | 1 line
    
    [CXF-1510] Support for anonymous root types
  ........
    r889796 | dkulp | 2009-12-11 15:24:14 -0500 (Fri, 11 Dec 2009) | 1 line
    
    [CXF-1510] Only if it's not in a wrapper element
  ........
................

------------------------------------------
[INFO] ------------------------------------------------------------------------
[INFO] Building Apache CXF Runtime JAXB DataBinding
[INFO]    task-segment: [clean, install]
[INFO] ------------------------------------------------------------------------
[INFO] [clean:clean]
[INFO] Deleting directory <http://hudson.zones.apache.org/hudson/job/CXF-2.1.x-JDK15/org.apache.cxf$cxf-rt-databinding-jaxb/ws/target>
[INFO] [checkstyle:checkstyle {execution: validate}]
[INFO] Starting audit...
<http://hudson.zones.apache.org/hudson/job/CXF-2.1.x-JDK15/org.apache.cxf$cxf-rt-databinding-jaxb/ws/src/main/java/org/apache/cxf/jaxb/JAXBDataBinding.java>:70:
Wrong order for 'org.apache.cxf.common.classloader.ClassLoaderUtils' import.
Audit done.

[HUDSON] Archiving <http://hudson.zones.apache.org/hudson/job/CXF-2.1.x-JDK15/org.apache.cxf$cxf-rt-databinding-jaxb/ws/pom.xml>
to /export/home/hudson/hudson/jobs/CXF-2.1.x-JDK15/modules/org.apache.cxf$cxf-rt-databinding-jaxb/builds/2009-12-11_21-11-22/archive/org.apache.cxf/cxf-rt-databinding-jaxb/2.1.9-SNAPSHOT/pom.xml
[INFO] ------------------------------------------------------------------------
[ERROR] BUILD ERROR
[INFO] ------------------------------------------------------------------------
[INFO] An error has occurred in Checkstyle report generation.

Embedded error: There are 1 checkstyle errors.
[INFO] ------------------------------------------------------------------------
[INFO] Trace
org.apache.maven.lifecycle.LifecycleExecutionException: An error has occurred in Checkstyle
report generation.
	at org.apache.maven.lifecycle.DefaultLifecycleExecutor.executeGoals(DefaultLifecycleExecutor.java:583)
	at org.apache.maven.lifecycle.DefaultLifecycleExecutor.executeGoalWithLifecycle(DefaultLifecycleExecutor.java:499)
	at org.apache.maven.lifecycle.DefaultLifecycleExecutor.executeGoal(DefaultLifecycleExecutor.java:478)
	at org.apache.maven.lifecycle.DefaultLifecycleExecutor.executeGoalAndHandleFailures(DefaultLifecycleExecutor.java:330)
	at org.apache.maven.lifecycle.DefaultLifecycleExecutor.executeTaskSegments(DefaultLifecycleExecutor.java:291)
	at org.apache.maven.lifecycle.DefaultLifecycleExecutor.execute(DefaultLifecycleExecutor.java:142)
	at org.apache.maven.lifecycle.LifecycleExecutorInterceptor.execute(LifecycleExecutorInterceptor.java:65)
	at org.apache.maven.DefaultMaven.doExecute(DefaultMaven.java:336)
	at org.apache.maven.DefaultMaven.execute(DefaultMaven.java:129)
	at org.apache.maven.cli.MavenCli.main(MavenCli.java:287)
	at sun.reflect.NativeMethodAccessorImpl.invoke0(Native Method)
	at sun.reflect.NativeMethodAccessorImpl.invoke(NativeMethodAccessorImpl.java:39)
	at sun.reflect.DelegatingMethodAccessorImpl.invoke(DelegatingMethodAccessorImpl.java:25)
	at java.lang.reflect.Method.invoke(Method.java:585)
	at org.codehaus.classworlds.Launcher.launchEnhanced(Launcher.java:315)
	at org.codehaus.classworlds.Launcher.launch(Launcher.java:255)
	at hudson.maven.agent.Main.launch(Main.java:165)
	at hudson.maven.MavenBuilder.call(MavenBuilder.java:159)
	at hudson.maven.MavenModuleSetBuild$Builder.call(MavenModuleSetBuild.java:687)
	at hudson.maven.MavenModuleSetBuild$Builder.call(MavenModuleSetBuild.java:633)
	at hudson.remoting.UserRequest.perform(UserRequest.java:104)
	at hudson.remoting.UserRequest.perform(UserRequest.java:48)
	at hudson.remoting.Request$2.run(Request.java:236)
	at java.util.concurrent.Executors$RunnableAdapter.call(Executors.java:417)
	at java.util.concurrent.FutureTask$Sync.innerRun(FutureTask.java:269)
	at java.util.concurrent.FutureTask.run(FutureTask.java:123)
	at java.util.concurrent.ThreadPoolExecutor$Worker.runTask(ThreadPoolExecutor.java:650)
	at java.util.concurrent.ThreadPoolExecutor$Worker.run(ThreadPoolExecutor.java:675)
	at java.lang.Thread.run(Thread.java:595)
Caused by: org.apache.maven.plugin.MojoExecutionException: An error has occurred in Checkstyle
report generation.
	at org.apache.maven.reporting.AbstractMavenReport.execute(AbstractMavenReport.java:79)
	at org.apache.maven.plugin.DefaultPluginManager.executeMojo(DefaultPluginManager.java:451)
	at hudson.maven.agent.PluginManagerInterceptor.executeMojo(PluginManagerInterceptor.java:182)
	at org.apache.maven.lifecycle.DefaultLifecycleExecutor.executeGoals(DefaultLifecycleExecutor.java:558)
	... 28 more
Caused by: org.apache.maven.reporting.MavenReportException: There are 1 checkstyle errors.
	at org.apache.maven.plugin.checkstyle.CheckstyleReport.executeCheckstyle(CheckstyleReport.java:984)
	at org.apache.maven.plugin.checkstyle.CheckstyleReport.executeReport(CheckstyleReport.java:652)
	at org.apache.maven.reporting.AbstractMavenReport.generate(AbstractMavenReport.java:98)
	at org.apache.maven.reporting.AbstractMavenReport.execute(AbstractMavenReport.java:73)
	... 31 more
[INFO] ------------------------------------------------------------------------
[INFO] Total time: 6 minutes 
[INFO] Finished at: Fri Dec 11 21:20:38 UTC 2009
[INFO] Final Memory: 79M/161M
[INFO] ------------------------------------------------------------------------
Waiting for Hudson to finish collecting data


Mime
View raw message