cxf-notifications mailing list archives

Site index · List index
Message view « Date » · « Thread »
Top « Date » · « Thread »
From Apache Hudson Server <hud...@hudson.zones.apache.org>
Subject Build failed in Hudson: CXF-2.1.x-JDK15 #289
Date Fri, 11 Dec 2009 21:17:52 GMT
See <http://hudson.zones.apache.org/hudson/job/CXF-2.1.x-JDK15/289/changes>

Changes:

[dkulp] Merged revisions 889805 via svnmerge from 
https://svn.apache.org/repos/asf/cxf/branches/2.2.x-fixes

................
  r889805 | dkulp | 2009-12-11 15:37:24 -0500 (Fri, 11 Dec 2009) | 13 lines
  
  Merged revisions 889790,889796 via svnmerge from 
  https://svn.apache.org/repos/asf/cxf/trunk
  
  ........
    r889790 | dkulp | 2009-12-11 14:55:59 -0500 (Fri, 11 Dec 2009) | 1 line
    
    [CXF-1510] Support for anonymous root types
  ........
    r889796 | dkulp | 2009-12-11 15:24:14 -0500 (Fri, 11 Dec 2009) | 1 line
    
    [CXF-1510] Only if it's not in a wrapper element
  ........
................

------------------------------------------
[...truncated 1286 lines...]
[INFO] Surefire report directory: <http://hudson.zones.apache.org/hudson/job/CXF-2.1.x-JDK15/ws/cxf-2.1.x-fixes/tools/wsdlto/databinding/jaxb/target/surefire-reports>

-------------------------------------------------------
 T E S T S
-------------------------------------------------------
There are no tests to run.

Results :

Tests run: 0, Failures: 0, Errors: 0, Skipped: 0

[HUDSON] Recording test results
[INFO] [jar:jar]
[INFO] Building jar: <http://hudson.zones.apache.org/hudson/job/CXF-2.1.x-JDK15/ws/cxf-2.1.x-fixes/tools/wsdlto/databinding/jaxb/target/cxf-tools-wsdlto-databinding-jaxb-2.1.9-SNAPSHOT.jar>
[INFO] [install:install]
[INFO] Installing <http://hudson.zones.apache.org/hudson/job/CXF-2.1.x-JDK15/ws/cxf-2.1.x-fixes/tools/wsdlto/databinding/jaxb/target/cxf-tools-wsdlto-databinding-jaxb-2.1.9-SNAPSHOT.jar>
to <http://hudson.zones.apache.org/hudson/job/CXF-2.1.x-JDK15/ws/.repository/org/apache/cxf/cxf-tools-wsdlto-databinding-jaxb/2.1.9-SNAPSHOT/cxf-tools-wsdlto-databinding-jaxb-2.1.9-SNAPSHOT.jar>
[HUDSON] Archiving <http://hudson.zones.apache.org/hudson/job/CXF-2.1.x-JDK15/ws/cxf-2.1.x-fixes/tools/wsdlto/databinding/jaxb/target/cxf-tools-wsdlto-databinding-jaxb-2.1.9-SNAPSHOT.jar>
to /export/home/hudson/hudson/jobs/CXF-2.1.x-JDK15/modules/org.apache.cxf$cxf-tools-wsdlto-databinding-jaxb/builds/2009-12-11_21-11-22/archive/org.apache.cxf/cxf-tools-wsdlto-databinding-jaxb/2.1.9-SNAPSHOT/cxf-tools-wsdlto-databinding-jaxb-2.1.9-SNAPSHOT.jar
[INFO] ------------------------------------------------------------------------
[INFO] Building Apache CXF Code Generation Maven2 Plugins
[INFO]    task-segment: [clean, install]
[INFO] ------------------------------------------------------------------------
[INFO] [clean:clean]
[INFO] Deleting directory <http://hudson.zones.apache.org/hudson/job/CXF-2.1.x-JDK15/ws/cxf-2.1.x-fixes/maven-plugins/codegen-plugin/target>
[INFO] [checkstyle:checkstyle {execution: validate}]
[INFO] Starting audit...
Audit done.

[INFO] Preparing pmd:check
[HUDSON] Archiving <http://hudson.zones.apache.org/hudson/job/CXF-2.1.x-JDK15/ws/cxf-2.1.x-fixes/maven-plugins/codegen-plugin/pom.xml>
to /export/home/hudson/hudson/jobs/CXF-2.1.x-JDK15/modules/org.apache.cxf$cxf-codegen-plugin/builds/2009-12-11_21-11-22/archive/org.apache.cxf/cxf-codegen-plugin/2.1.9-SNAPSHOT/pom.xml
[INFO] [pmd:pmd]
[INFO] [pmd:check {execution: validate}]
[INFO] 
[INFO] [cxf-xml2fastinfoset:xml2fastinfoset {execution: xml2fastinfoset}]
[INFO] [plugin:descriptor]
[WARNING] Using platform encoding (UTF-8 actually) to read mojo metadata, i.e. build is platform
dependent!
[INFO] Applying mojo extractor for language: java
[INFO] Mojo extractor for language: java found 1 mojo descriptors.
[INFO] Applying mojo extractor for language: bsh
[INFO] Mojo extractor for language: bsh found 0 mojo descriptors.
[INFO] [remote-resources:process {execution: default}]
[INFO] [resources:resources]
[INFO] Using 'UTF-8' encoding to copy filtered resources.
[INFO] Copying 0 resource
[INFO] skip non existing resourceDirectory <http://hudson.zones.apache.org/hudson/job/CXF-2.1.x-JDK15/ws/cxf-2.1.x-fixes/maven-plugins/codegen-plugin/src/main/resources>
[INFO] skip non existing resourceDirectory <http://hudson.zones.apache.org/hudson/job/CXF-2.1.x-JDK15/ws/cxf-2.1.x-fixes/maven-plugins/codegen-plugin/src/main/resources-filtered>
[INFO] skip non existing resourceDirectory <http://hudson.zones.apache.org/hudson/job/CXF-2.1.x-JDK15/ws/cxf-2.1.x-fixes/maven-plugins/codegen-plugin/target/generated/src/main/resources>
[INFO] Copying 3 resources
[INFO] [compiler:compile]
[INFO] Compiling 5 source files to <http://hudson.zones.apache.org/hudson/job/CXF-2.1.x-JDK15/ws/cxf-2.1.x-fixes/maven-plugins/codegen-plugin/target/classes>
[INFO] [resources:testResources]
[INFO] Using 'UTF-8' encoding to copy filtered resources.
[INFO] skip non existing resourceDirectory <http://hudson.zones.apache.org/hudson/job/CXF-2.1.x-JDK15/ws/cxf-2.1.x-fixes/maven-plugins/codegen-plugin/src/test/java>
[INFO] skip non existing resourceDirectory <http://hudson.zones.apache.org/hudson/job/CXF-2.1.x-JDK15/ws/cxf-2.1.x-fixes/maven-plugins/codegen-plugin/src/test/resources>
[INFO] skip non existing resourceDirectory <http://hudson.zones.apache.org/hudson/job/CXF-2.1.x-JDK15/ws/cxf-2.1.x-fixes/maven-plugins/codegen-plugin/target/generated/src/test/resources>
[INFO] Copying 3 resources
[INFO] [compiler:testCompile]
[INFO] No sources to compile
[INFO] [surefire:test]
[INFO] Surefire report directory: <http://hudson.zones.apache.org/hudson/job/CXF-2.1.x-JDK15/ws/cxf-2.1.x-fixes/maven-plugins/codegen-plugin/target/surefire-reports>

-------------------------------------------------------
 T E S T S
-------------------------------------------------------
There are no tests to run.

Results :

Tests run: 0, Failures: 0, Errors: 0, Skipped: 0

[HUDSON] Recording test results
[INFO] [jar:jar]
[INFO] Building jar: <http://hudson.zones.apache.org/hudson/job/CXF-2.1.x-JDK15/ws/cxf-2.1.x-fixes/maven-plugins/codegen-plugin/target/cxf-codegen-plugin-2.1.9-SNAPSHOT.jar>
[INFO] [plugin:addPluginArtifactMetadata]
[INFO] [install:install]
[INFO] Installing <http://hudson.zones.apache.org/hudson/job/CXF-2.1.x-JDK15/ws/cxf-2.1.x-fixes/maven-plugins/codegen-plugin/target/cxf-codegen-plugin-2.1.9-SNAPSHOT.jar>
to <http://hudson.zones.apache.org/hudson/job/CXF-2.1.x-JDK15/ws/.repository/org/apache/cxf/cxf-codegen-plugin/2.1.9-SNAPSHOT/cxf-codegen-plugin-2.1.9-SNAPSHOT.jar>
[INFO] [plugin:updateRegistry]
[HUDSON] Archiving <http://hudson.zones.apache.org/hudson/job/CXF-2.1.x-JDK15/ws/cxf-2.1.x-fixes/maven-plugins/codegen-plugin/target/cxf-codegen-plugin-2.1.9-SNAPSHOT.jar>
to /export/home/hudson/hudson/jobs/CXF-2.1.x-JDK15/modules/org.apache.cxf$cxf-codegen-plugin/builds/2009-12-11_21-11-22/archive/org.apache.cxf/cxf-codegen-plugin/2.1.9-SNAPSHOT/cxf-codegen-plugin-2.1.9-SNAPSHOT.jar
[INFO] ------------------------------------------------------------------------
[INFO] Building Apache CXF Test Utilities
[INFO]    task-segment: [clean, install]
[INFO] ------------------------------------------------------------------------
[INFO] [clean:clean]
[INFO] Deleting directory <http://hudson.zones.apache.org/hudson/job/CXF-2.1.x-JDK15/ws/cxf-2.1.x-fixes/testutils/target>
Downloading: http://repo1.maven.org/maven2/org/apache/activemq/activeio-core/3.0.0-incubator/activeio-core-3.0.0-incubator.pom
[INFO] [checkstyle:checkstyle {execution: validate}]
[INFO] Starting audit...
Audit done.

[INFO] Preparing pmd:check
[HUDSON] Archiving <http://hudson.zones.apache.org/hudson/job/CXF-2.1.x-JDK15/ws/cxf-2.1.x-fixes/testutils/pom.xml>
to /export/home/hudson/hudson/jobs/CXF-2.1.x-JDK15/modules/org.apache.cxf$cxf-testutils/builds/2009-12-11_21-11-22/archive/org.apache.cxf/cxf-testutils/2.1.9-SNAPSHOT/pom.xml
[INFO] [pmd:pmd]
[INFO] [pmd:check {execution: validate}]
[INFO] 
[INFO] [antrun:run {execution: validate}]
[INFO] Executing tasks
    [mkdir] Created dir: <http://hudson.zones.apache.org/hudson/job/CXF-2.1.x-JDK15/ws/cxf-2.1.x-fixes/testutils/target/generated/src/main/resources/wsdl/type_test>
     [xslt] Processing <http://hudson.zones.apache.org/hudson/job/CXF-2.1.x-JDK15/ws/cxf-2.1.x-fixes/testutils/src/main/resources/wsdl/type_test/type_test.xsd>
to <http://hudson.zones.apache.org/hudson/job/CXF-2.1.x-JDK15/ws/cxf-2.1.x-fixes/testutils/target/generated/src/main/resources/wsdl/type_test/type_test_1.xsd>
     [xslt] Loading stylesheet <http://hudson.zones.apache.org/hudson/job/CXF-2.1.x-JDK15/ws/cxf-2.1.x-fixes/testutils/src/main/resources/wsdl/type_test/type_test_ID_xsd.xsl>
     [xslt] Processing <http://hudson.zones.apache.org/hudson/job/CXF-2.1.x-JDK15/ws/cxf-2.1.x-fixes/testutils/src/main/resources/wsdl/type_test/type_test.xsd>
to <http://hudson.zones.apache.org/hudson/job/CXF-2.1.x-JDK15/ws/cxf-2.1.x-fixes/testutils/target/generated/src/main/resources/wsdl/type_test/type_test_2.xsd>
     [xslt] Loading stylesheet <http://hudson.zones.apache.org/hudson/job/CXF-2.1.x-JDK15/ws/cxf-2.1.x-fixes/testutils/src/main/resources/wsdl/type_test/type_test_ID_xsd.xsl>
     [xslt] Processing <http://hudson.zones.apache.org/hudson/job/CXF-2.1.x-JDK15/ws/cxf-2.1.x-fixes/testutils/src/main/resources/wsdl/type_test/type_test.xsd>
to <http://hudson.zones.apache.org/hudson/job/CXF-2.1.x-JDK15/ws/cxf-2.1.x-fixes/testutils/target/generated/src/main/resources/wsdl/type_test/type_test_3.xsd>
     [xslt] Loading stylesheet <http://hudson.zones.apache.org/hudson/job/CXF-2.1.x-JDK15/ws/cxf-2.1.x-fixes/testutils/src/main/resources/wsdl/type_test/type_test_ID_xsd.xsl>
     [xslt] Processing <http://hudson.zones.apache.org/hudson/job/CXF-2.1.x-JDK15/ws/cxf-2.1.x-fixes/testutils/src/main/resources/wsdl/type_test/type_test.xsd>
to <http://hudson.zones.apache.org/hudson/job/CXF-2.1.x-JDK15/ws/cxf-2.1.x-fixes/testutils/target/generated/src/main/resources/wsdl/type_test/type_test_doclit.wsdl>
     [xslt] Loading stylesheet <http://hudson.zones.apache.org/hudson/job/CXF-2.1.x-JDK15/ws/cxf-2.1.x-fixes/testutils/src/main/resources/wsdl/type_test/type_test_wsdl.xsl>
     [xslt] Processing <http://hudson.zones.apache.org/hudson/job/CXF-2.1.x-JDK15/ws/cxf-2.1.x-fixes/testutils/src/main/resources/wsdl/type_test/type_test.xsd>
to <http://hudson.zones.apache.org/hudson/job/CXF-2.1.x-JDK15/ws/cxf-2.1.x-fixes/testutils/target/generated/src/main/resources/wsdl/type_test/type_test_rpclit.wsdl>
     [xslt] Loading stylesheet <http://hudson.zones.apache.org/hudson/job/CXF-2.1.x-JDK15/ws/cxf-2.1.x-fixes/testutils/src/main/resources/wsdl/type_test/type_test_wsdl.xsl>
     [xslt] Processing <http://hudson.zones.apache.org/hudson/job/CXF-2.1.x-JDK15/ws/cxf-2.1.x-fixes/testutils/src/main/resources/wsdl/type_test/type_test.xsd>
to <http://hudson.zones.apache.org/hudson/job/CXF-2.1.x-JDK15/ws/cxf-2.1.x-fixes/testutils/target/generated/src/main/resources/wsdl/type_test/type_test_xml_inc.wsdl>
     [xslt] Loading stylesheet <http://hudson.zones.apache.org/hudson/job/CXF-2.1.x-JDK15/ws/cxf-2.1.x-fixes/testutils/src/main/resources/wsdl/type_test/type_test_wsdl.xsl>
     [xslt] Processing <http://hudson.zones.apache.org/hudson/job/CXF-2.1.x-JDK15/ws/cxf-2.1.x-fixes/testutils/src/main/resources/wsdl/type_test/type_test.xsd>
to <http://hudson.zones.apache.org/hudson/job/CXF-2.1.x-JDK15/ws/cxf-2.1.x-fixes/testutils/target/generated/src/main/resources/wsdl/type_test/type_test_xml.wsdl>
     [xslt] Loading stylesheet <http://hudson.zones.apache.org/hudson/job/CXF-2.1.x-JDK15/ws/cxf-2.1.x-fixes/testutils/src/main/resources/wsdl/type_test/type_test_xml_wsdl.xsl>
     [xslt] Processing <http://hudson.zones.apache.org/hudson/job/CXF-2.1.x-JDK15/ws/cxf-2.1.x-fixes/testutils/src/main/resources/wsdl/type_test/type_test.xsd>
to <http://hudson.zones.apache.org/hudson/job/CXF-2.1.x-JDK15/ws/cxf-2.1.x-fixes/testutils/target/generated/src/main/resources/wsdl/type_test/type_test_doclit_soap.wsdl>
     [xslt] Loading stylesheet <http://hudson.zones.apache.org/hudson/job/CXF-2.1.x-JDK15/ws/cxf-2.1.x-fixes/testutils/src/main/resources/wsdl/type_test/type_test_soap_wsdl.xsl>
     [xslt] Processing <http://hudson.zones.apache.org/hudson/job/CXF-2.1.x-JDK15/ws/cxf-2.1.x-fixes/testutils/src/main/resources/wsdl/type_test/type_test.xsd>
to <http://hudson.zones.apache.org/hudson/job/CXF-2.1.x-JDK15/ws/cxf-2.1.x-fixes/testutils/target/generated/src/main/resources/wsdl/type_test/type_test_rpclit_soap.wsdl>
     [xslt] Loading stylesheet <http://hudson.zones.apache.org/hudson/job/CXF-2.1.x-JDK15/ws/cxf-2.1.x-fixes/testutils/src/main/resources/wsdl/type_test/type_test_soap_wsdl.xsl>
    [mkdir] Created dir: <http://hudson.zones.apache.org/hudson/job/CXF-2.1.x-JDK15/ws/cxf-2.1.x-fixes/testutils/target/generated/src/main/java/org/apache/cxf/systest/type_test>
     [xslt] Processing <http://hudson.zones.apache.org/hudson/job/CXF-2.1.x-JDK15/ws/cxf-2.1.x-fixes/testutils/src/main/resources/wsdl/type_test/type_test.xsd>
to <http://hudson.zones.apache.org/hudson/job/CXF-2.1.x-JDK15/ws/cxf-2.1.x-fixes/testutils/target/generated/src/main/java/org/apache/cxf/systest/type_test/TypeTestImpl.java>
     [xslt] Loading stylesheet <http://hudson.zones.apache.org/hudson/job/CXF-2.1.x-JDK15/ws/cxf-2.1.x-fixes/testutils/src/main/resources/wsdl/type_test/type_test_impl_java.xsl>
     [xslt] Processing <http://hudson.zones.apache.org/hudson/job/CXF-2.1.x-JDK15/ws/cxf-2.1.x-fixes/testutils/src/main/resources/wsdl/type_test/type_test.xsd>
to <http://hudson.zones.apache.org/hudson/job/CXF-2.1.x-JDK15/ws/cxf-2.1.x-fixes/testutils/target/generated/src/main/java/org/apache/cxf/systest/type_test/TypeTestTester.java>
     [xslt] Loading stylesheet <http://hudson.zones.apache.org/hudson/job/CXF-2.1.x-JDK15/ws/cxf-2.1.x-fixes/testutils/src/main/resources/wsdl/type_test/type_test_tester_java.xsl>
[INFO] Executed tasks
[INFO] Registering compile source root <http://hudson.zones.apache.org/hudson/job/CXF-2.1.x-JDK15/ws/cxf-2.1.x-fixes/testutils/target/generated/src/main/java>
[INFO] [cxf-xml2fastinfoset:xml2fastinfoset {execution: xml2fastinfoset}]
[INFO] [cxf-codegen:wsdl2java {execution: generate-sources}]
Dec 11, 2009 9:19:59 PM org.springframework.context.support.AbstractApplicationContext prepareRefresh
INFO: Refreshing org.apache.cxf.bus.spring.BusApplicationContext@1346fbb: display name [org.apache.cxf.bus.spring.BusApplicationContext@1346fbb];
startup date [Fri Dec 11 21:19:59 UTC 2009]; root of context hierarchy
Dec 11, 2009 9:19:59 PM org.apache.cxf.bus.spring.BusApplicationContext getConfigResources
INFO: No cxf.xml configuration file detected, relying on defaults.
Dec 11, 2009 9:19:59 PM org.springframework.beans.factory.xml.XmlBeanDefinitionReader loadBeanDefinitions
INFO: Loading XML bean definitions from class path resource [META-INF/cxf/cxf.xml]
Dec 11, 2009 9:20:01 PM org.springframework.context.support.AbstractApplicationContext obtainFreshBeanFactory
INFO: Bean factory for application context [org.apache.cxf.bus.spring.BusApplicationContext@1346fbb]:
org.springframework.beans.factory.support.DefaultListableBeanFactory@8eef17
Dec 11, 2009 9:20:01 PM org.springframework.context.support.AbstractApplicationContext$BeanPostProcessorChecker
postProcessAfterInitialization
INFO: Bean 'org.apache.cxf.bus.spring.Jsr250BeanPostProcessor' is not eligible for getting
processed by all BeanPostProcessors (for example: not eligible for auto-proxying)
Dec 11, 2009 9:20:01 PM org.springframework.context.support.AbstractApplicationContext$BeanPostProcessorChecker
postProcessAfterInitialization
INFO: Bean 'org.apache.cxf.bus.spring.BusExtensionPostProcessor' is not eligible for getting
processed by all BeanPostProcessors (for example: not eligible for auto-proxying)
Dec 11, 2009 9:20:01 PM org.springframework.beans.factory.support.DefaultListableBeanFactory
preInstantiateSingletons
INFO: Pre-instantiating singletons in org.springframework.beans.factory.support.DefaultListableBeanFactory@8eef17:
defining beans [cxf,org.apache.cxf.bus.spring.BusApplicationListener,org.apache.cxf.bus.spring.BusWiringBeanFactoryPostProcessor,org.apache.cxf.bus.spring.Jsr250BeanPostProcessor,org.apache.cxf.bus.spring.BusExtensionPostProcessor,org.apache.cxf.resource.ResourceManager,org.apache.cxf.configuration.Configurer,org.apache.cxf.binding.BindingFactoryManager,org.apache.cxf.transport.DestinationFactoryManager,org.apache.cxf.transport.ConduitInitiatorManager,org.apache.cxf.wsdl.WSDLManager,org.apache.cxf.phase.PhaseManager,org.apache.cxf.workqueue.WorkQueueManager,org.apache.cxf.buslifecycle.BusLifeCycleManager,org.apache.cxf.endpoint.ServerRegistry,org.apache.cxf.endpoint.ServerLifeCycleManager,org.apache.cxf.endpoint.ClientLifeCycleManager,org.apache.cxf.transports.http.QueryHandlerRegistry,org.apache.cxf.endpoint.EndpointResolverRegistry,org.apache.cxf.headers.HeaderManager,org.apache.cxf.catalog.OASISCatalogManager,org.apache.cxf.endpoint.ServiceContractResolverRegistry];
root of factory hierarchy
Dec 11, 2009 9:20:22 PM org.springframework.context.support.AbstractApplicationContext doClose
INFO: Closing org.apache.cxf.bus.spring.BusApplicationContext@1346fbb: display name [org.apache.cxf.bus.spring.BusApplicationContext@1346fbb];
startup date [Fri Dec 11 21:19:59 UTC 2009]; root of context hierarchy
Dec 11, 2009 9:20:22 PM org.springframework.beans.factory.support.DefaultSingletonBeanRegistry
destroySingletons
INFO: Destroying singletons in org.springframework.beans.factory.support.DefaultListableBeanFactory@8eef17:
defining beans [cxf,org.apache.cxf.bus.spring.BusApplicationListener,org.apache.cxf.bus.spring.BusWiringBeanFactoryPostProcessor,org.apache.cxf.bus.spring.Jsr250BeanPostProcessor,org.apache.cxf.bus.spring.BusExtensionPostProcessor,org.apache.cxf.resource.ResourceManager,org.apache.cxf.configuration.Configurer,org.apache.cxf.binding.BindingFactoryManager,org.apache.cxf.transport.DestinationFactoryManager,org.apache.cxf.transport.ConduitInitiatorManager,org.apache.cxf.wsdl.WSDLManager,org.apache.cxf.phase.PhaseManager,org.apache.cxf.workqueue.WorkQueueManager,org.apache.cxf.buslifecycle.BusLifeCycleManager,org.apache.cxf.endpoint.ServerRegistry,org.apache.cxf.endpoint.ServerLifeCycleManager,org.apache.cxf.endpoint.ClientLifeCycleManager,org.apache.cxf.transports.http.QueryHandlerRegistry,org.apache.cxf.endpoint.EndpointResolverRegistry,org.apache.cxf.headers.HeaderManager,org.apache.cxf.catalog.OASISCatalogManager,org.apache.cxf.endpoint.ServiceContractResolverRegistry];
root of factory hierarchy
[INFO] [cxf-common-xsd:xsdtojava {execution: generate-sources}]
[INFO] [remote-resources:process {execution: default}]
[INFO] [resources:resources]
[INFO] Using 'UTF-8' encoding to copy filtered resources.
[INFO] Copying 1 resource
[INFO] Copying 85 resources
[INFO] skip non existing resourceDirectory <http://hudson.zones.apache.org/hudson/job/CXF-2.1.x-JDK15/ws/cxf-2.1.x-fixes/testutils/src/main/resources-filtered>
[INFO] Copying 9 resources
[INFO] Copying 3 resources
[INFO] [compiler:compile]
[INFO] Compiling 1392 source files to <http://hudson.zones.apache.org/hudson/job/CXF-2.1.x-JDK15/ws/cxf-2.1.x-fixes/testutils/target/classes>
[INFO] [resources:testResources]
[INFO] Using 'UTF-8' encoding to copy filtered resources.
[INFO] Copying 0 resource
[INFO] skip non existing resourceDirectory <http://hudson.zones.apache.org/hudson/job/CXF-2.1.x-JDK15/ws/cxf-2.1.x-fixes/testutils/src/test/resources>
[INFO] skip non existing resourceDirectory <http://hudson.zones.apache.org/hudson/job/CXF-2.1.x-JDK15/ws/cxf-2.1.x-fixes/testutils/target/generated/src/test/resources>
[INFO] Copying 3 resources
[INFO] [compiler:testCompile]
[INFO] Compiling 1 source file to <http://hudson.zones.apache.org/hudson/job/CXF-2.1.x-JDK15/ws/cxf-2.1.x-fixes/testutils/target/test-classes>
[INFO] [surefire:test]
[INFO] Surefire report directory: <http://hudson.zones.apache.org/hudson/job/CXF-2.1.x-JDK15/ws/cxf-2.1.x-fixes/testutils/target/surefire-reports>

-------------------------------------------------------
 T E S T S
-------------------------------------------------------
Running org.apache.cxf.testutils.header_test.rpc.TestRPCHeaderTest
Tests run: 2, Failures: 0, Errors: 0, Skipped: 0, Time elapsed: 0.038 sec

Results :

Tests run: 2, Failures: 0, Errors: 0, Skipped: 0

[HUDSON] Recording test results
[INFO] [jar:jar]
[INFO] Building jar: <http://hudson.zones.apache.org/hudson/job/CXF-2.1.x-JDK15/ws/cxf-2.1.x-fixes/testutils/target/cxf-testutils-2.1.9-SNAPSHOT.jar>
[INFO] [install:install]
[INFO] Installing <http://hudson.zones.apache.org/hudson/job/CXF-2.1.x-JDK15/ws/cxf-2.1.x-fixes/testutils/target/cxf-testutils-2.1.9-SNAPSHOT.jar>
to <http://hudson.zones.apache.org/hudson/job/CXF-2.1.x-JDK15/ws/.repository/org/apache/cxf/cxf-testutils/2.1.9-SNAPSHOT/cxf-testutils-2.1.9-SNAPSHOT.jar>
[HUDSON] Archiving <http://hudson.zones.apache.org/hudson/job/CXF-2.1.x-JDK15/ws/cxf-2.1.x-fixes/testutils/target/cxf-testutils-2.1.9-SNAPSHOT.jar>
to /export/home/hudson/hudson/jobs/CXF-2.1.x-JDK15/modules/org.apache.cxf$cxf-testutils/builds/2009-12-11_21-11-22/archive/org.apache.cxf/cxf-testutils/2.1.9-SNAPSHOT/cxf-testutils-2.1.9-SNAPSHOT.jar
[INFO] ------------------------------------------------------------------------
[INFO] Building Apache CXF Runtime JAXB DataBinding
[INFO]    task-segment: [clean, install]
[INFO] ------------------------------------------------------------------------
[INFO] [clean:clean]
[INFO] Deleting directory <http://hudson.zones.apache.org/hudson/job/CXF-2.1.x-JDK15/ws/cxf-2.1.x-fixes/rt/databinding/jaxb/target>
[INFO] [checkstyle:checkstyle {execution: validate}]
[INFO] Starting audit...
<http://hudson.zones.apache.org/hudson/job/CXF-2.1.x-JDK15/ws/cxf-2.1.x-fixes/rt/databinding/jaxb/src/main/java/org/apache/cxf/jaxb/JAXBDataBinding.java>:70:
Wrong order for 'org.apache.cxf.common.classloader.ClassLoaderUtils' import.
Audit done.

[HUDSON] Archiving <http://hudson.zones.apache.org/hudson/job/CXF-2.1.x-JDK15/ws/cxf-2.1.x-fixes/rt/databinding/jaxb/pom.xml>
to /export/home/hudson/hudson/jobs/CXF-2.1.x-JDK15/modules/org.apache.cxf$cxf-rt-databinding-jaxb/builds/2009-12-11_21-11-22/archive/org.apache.cxf/cxf-rt-databinding-jaxb/2.1.9-SNAPSHOT/pom.xml
[INFO] ------------------------------------------------------------------------
[ERROR] BUILD ERROR
[INFO] ------------------------------------------------------------------------
[INFO] An error has occurred in Checkstyle report generation.

Embedded error: There are 1 checkstyle errors.
[INFO] ------------------------------------------------------------------------
[INFO] Trace
org.apache.maven.lifecycle.LifecycleExecutionException: An error has occurred in Checkstyle
report generation.
	at org.apache.maven.lifecycle.DefaultLifecycleExecutor.executeGoals(DefaultLifecycleExecutor.java:583)
	at org.apache.maven.lifecycle.DefaultLifecycleExecutor.executeGoalWithLifecycle(DefaultLifecycleExecutor.java:499)
	at org.apache.maven.lifecycle.DefaultLifecycleExecutor.executeGoal(DefaultLifecycleExecutor.java:478)
	at org.apache.maven.lifecycle.DefaultLifecycleExecutor.executeGoalAndHandleFailures(DefaultLifecycleExecutor.java:330)
	at org.apache.maven.lifecycle.DefaultLifecycleExecutor.executeTaskSegments(DefaultLifecycleExecutor.java:291)
	at org.apache.maven.lifecycle.DefaultLifecycleExecutor.execute(DefaultLifecycleExecutor.java:142)
	at org.apache.maven.lifecycle.LifecycleExecutorInterceptor.execute(LifecycleExecutorInterceptor.java:65)
	at org.apache.maven.DefaultMaven.doExecute(DefaultMaven.java:336)
	at org.apache.maven.DefaultMaven.execute(DefaultMaven.java:129)
	at org.apache.maven.cli.MavenCli.main(MavenCli.java:287)
	at sun.reflect.NativeMethodAccessorImpl.invoke0(Native Method)
	at sun.reflect.NativeMethodAccessorImpl.invoke(NativeMethodAccessorImpl.java:39)
	at sun.reflect.DelegatingMethodAccessorImpl.invoke(DelegatingMethodAccessorImpl.java:25)
	at java.lang.reflect.Method.invoke(Method.java:585)
	at org.codehaus.classworlds.Launcher.launchEnhanced(Launcher.java:315)
	at org.codehaus.classworlds.Launcher.launch(Launcher.java:255)
	at hudson.maven.agent.Main.launch(Main.java:165)
	at hudson.maven.MavenBuilder.call(MavenBuilder.java:159)
	at hudson.maven.MavenModuleSetBuild$Builder.call(MavenModuleSetBuild.java:687)
	at hudson.maven.MavenModuleSetBuild$Builder.call(MavenModuleSetBuild.java:633)
	at hudson.remoting.UserRequest.perform(UserRequest.java:104)
	at hudson.remoting.UserRequest.perform(UserRequest.java:48)
	at hudson.remoting.Request$2.run(Request.java:236)
	at java.util.concurrent.Executors$RunnableAdapter.call(Executors.java:417)
	at java.util.concurrent.FutureTask$Sync.innerRun(FutureTask.java:269)
	at java.util.concurrent.FutureTask.run(FutureTask.java:123)
	at java.util.concurrent.ThreadPoolExecutor$Worker.runTask(ThreadPoolExecutor.java:650)
	at java.util.concurrent.ThreadPoolExecutor$Worker.run(ThreadPoolExecutor.java:675)
	at java.lang.Thread.run(Thread.java:595)
Caused by: org.apache.maven.plugin.MojoExecutionException: An error has occurred in Checkstyle
report generation.
	at org.apache.maven.reporting.AbstractMavenReport.execute(AbstractMavenReport.java:79)
	at org.apache.maven.plugin.DefaultPluginManager.executeMojo(DefaultPluginManager.java:451)
	at hudson.maven.agent.PluginManagerInterceptor.executeMojo(PluginManagerInterceptor.java:182)
	at org.apache.maven.lifecycle.DefaultLifecycleExecutor.executeGoals(DefaultLifecycleExecutor.java:558)
	... 28 more
Caused by: org.apache.maven.reporting.MavenReportException: There are 1 checkstyle errors.
	at org.apache.maven.plugin.checkstyle.CheckstyleReport.executeCheckstyle(CheckstyleReport.java:984)
	at org.apache.maven.plugin.checkstyle.CheckstyleReport.executeReport(CheckstyleReport.java:652)
	at org.apache.maven.reporting.AbstractMavenReport.generate(AbstractMavenReport.java:98)
	at org.apache.maven.reporting.AbstractMavenReport.execute(AbstractMavenReport.java:73)
	... 31 more
[INFO] ------------------------------------------------------------------------
[INFO] Total time: 6 minutes 
[INFO] Finished at: Fri Dec 11 21:20:38 UTC 2009
[INFO] Final Memory: 79M/161M
[INFO] ------------------------------------------------------------------------
Waiting for Hudson to finish collecting data
Sending e-mails to: notifications@cxf.apache.org dkulp@apache.org
channel stopped


Mime
View raw message