cxf-notifications mailing list archives

Site index · List index
Message view « Date » · « Thread »
Top « Date » · « Thread »
From Apache Hudson Server <hud...@hudson.zones.apache.org>
Subject Build failed in Hudson: CXF-Trunk-JDK15 #975
Date Wed, 16 Dec 2009 19:22:55 GMT
See <http://hudson.zones.apache.org/hudson/job/CXF-Trunk-JDK15/975/changes>

Changes:

[dkulp] [CXF-2583] Make slf4j-jdk14 a test scope dep

[dkulp] Remove print from test

------------------------------------------
[...truncated 4629 lines...]
[INFO] ------------------------------------------------------------------------
[INFO] [clean:clean {execution: default-clean}]
[INFO] Deleting file set: <http://hudson.zones.apache.org/hudson/job/CXF-Trunk-JDK15/ws/trunk/rt/ws/security/target>
(included: [**], excluded: [])
[INFO] [checkstyle:checkstyle {execution: validate}]
[INFO] Starting audit...
Audit done.

[INFO] Preparing pmd:check
[HUDSON] Archiving <http://hudson.zones.apache.org/hudson/job/CXF-Trunk-JDK15/ws/trunk/rt/ws/security/pom.xml>
to /export/home/hudson/hudson/jobs/CXF-Trunk-JDK15/modules/org.apache.cxf$cxf-rt-ws-security/builds/2009-12-16_19-01-29/archive/org.apache.cxf/cxf-rt-ws-security/2.3.0-SNAPSHOT/pom.xml
[INFO] [pmd:pmd {execution: pmd}]
[INFO] [pmd:check {execution: validate}]
[INFO] 
[INFO] [cxf-xml2fastinfoset:xml2fastinfoset {execution: xml2fastinfoset}]
[INFO] [remote-resources:process {execution: default}]
[INFO] [resources:resources {execution: default-resources}]
[INFO] Using 'UTF-8' encoding to copy filtered resources.
[INFO] Copying 4 resources
[INFO] Copying 2 resources
[INFO] skip non existing resourceDirectory <http://hudson.zones.apache.org/hudson/job/CXF-Trunk-JDK15/ws/trunk/rt/ws/security/src/main/resources-filtered>
[INFO] Copying 1 resource
[INFO] Copying 3 resources
[INFO] [compiler:compile {execution: default-compile}]
[INFO] Compiling 93 source files to <http://hudson.zones.apache.org/hudson/job/CXF-Trunk-JDK15/ws/trunk/rt/ws/security/target/classes>
[INFO] [resources:testResources {execution: default-testResources}]
[INFO] Using 'UTF-8' encoding to copy filtered resources.
[INFO] Copying 14 resources
[INFO] Copying 2 resources
[INFO] skip non existing resourceDirectory <http://hudson.zones.apache.org/hudson/job/CXF-Trunk-JDK15/ws/trunk/rt/ws/security/target/generated/src/test/resources>
[INFO] Copying 3 resources
[INFO] [compiler:testCompile {execution: default-testCompile}]
[INFO] Compiling 10 source files to <http://hudson.zones.apache.org/hudson/job/CXF-Trunk-JDK15/ws/trunk/rt/ws/security/target/test-classes>
[INFO] [surefire:test {execution: default-test}]
[INFO] Surefire report directory: <http://hudson.zones.apache.org/hudson/job/CXF-Trunk-JDK15/ws/trunk/rt/ws/security/target/surefire-reports>

-------------------------------------------------------
 T E S T S
-------------------------------------------------------
Running org.apache.cxf.ws.security.wss4j.SignatureConfirmationTest
Tests run: 1, Failures: 0, Errors: 0, Skipped: 0, Time elapsed: 1.442 sec
Running org.apache.cxf.ws.security.wss4j.WSS4JFaultCodeTest
Tests run: 3, Failures: 0, Errors: 0, Skipped: 0, Time elapsed: 1.245 sec
Running org.apache.cxf.ws.security.wss4j.RoundTripTest
Tests run: 3, Failures: 0, Errors: 0, Skipped: 1, Time elapsed: 2.318 sec
Running org.apache.cxf.ws.security.wss4j.WSS4JInOutTest
Tests run: 7, Failures: 0, Errors: 0, Skipped: 0, Time elapsed: 0.748 sec
Running org.apache.cxf.ws.security.wss4j.WSS4JOutInterceptorTest
Tests run: 5, Failures: 0, Errors: 0, Skipped: 0, Time elapsed: 0.334 sec

Results :

Tests run: 19, Failures: 0, Errors: 0, Skipped: 1

[HUDSON] Recording test results
[INFO] [jar:jar {execution: default-jar}]
[INFO] Building jar: <http://hudson.zones.apache.org/hudson/job/CXF-Trunk-JDK15/ws/trunk/rt/ws/security/target/cxf-rt-ws-security-2.3.0-SNAPSHOT.jar>
[INFO] [install:install {execution: default-install}]
[INFO] Installing <http://hudson.zones.apache.org/hudson/job/CXF-Trunk-JDK15/ws/trunk/rt/ws/security/target/cxf-rt-ws-security-2.3.0-SNAPSHOT.jar>
to <http://hudson.zones.apache.org/hudson/job/CXF-Trunk-JDK15/ws/.repository/org/apache/cxf/cxf-rt-ws-security/2.3.0-SNAPSHOT/cxf-rt-ws-security-2.3.0-SNAPSHOT.jar>
[HUDSON] Archiving <http://hudson.zones.apache.org/hudson/job/CXF-Trunk-JDK15/ws/trunk/rt/ws/security/target/cxf-rt-ws-security-2.3.0-SNAPSHOT.jar>
to /export/home/hudson/hudson/jobs/CXF-Trunk-JDK15/modules/org.apache.cxf$cxf-rt-ws-security/builds/2009-12-16_19-01-29/archive/org.apache.cxf/cxf-rt-ws-security/2.3.0-SNAPSHOT/cxf-rt-ws-security-2.3.0-SNAPSHOT.jar
[INFO] ------------------------------------------------------------------------
[INFO] Building Apache CXF JBI Integration
[INFO]    task-segment: [clean, install]
[INFO] ------------------------------------------------------------------------
[INFO] [clean:clean {execution: default-clean}]
[INFO] Deleting file set: <http://hudson.zones.apache.org/hudson/job/CXF-Trunk-JDK15/ws/trunk/integration/jbi/target>
(included: [**], excluded: [])
[INFO] [checkstyle:checkstyle {execution: validate}]
[INFO] Starting audit...
Audit done.

[INFO] Preparing pmd:check
[HUDSON] Archiving <http://hudson.zones.apache.org/hudson/job/CXF-Trunk-JDK15/ws/trunk/integration/jbi/pom.xml>
to /export/home/hudson/hudson/jobs/CXF-Trunk-JDK15/modules/org.apache.cxf$cxf-integration-jbi/builds/2009-12-16_19-01-29/archive/org.apache.cxf/cxf-integration-jbi/2.3.0-SNAPSHOT/pom.xml
[INFO] [pmd:pmd {execution: pmd}]
[INFO] [pmd:check {execution: validate}]
[INFO] 
[INFO] [cxf-xml2fastinfoset:xml2fastinfoset {execution: xml2fastinfoset}]
[INFO] [remote-resources:process {execution: default}]
[INFO] [resources:resources {execution: default-resources}]
[INFO] Using 'UTF-8' encoding to copy filtered resources.
[INFO] Copying 4 resources
[INFO] Copying 0 resource
[INFO] skip non existing resourceDirectory <http://hudson.zones.apache.org/hudson/job/CXF-Trunk-JDK15/ws/trunk/integration/jbi/src/main/resources-filtered>
[INFO] skip non existing resourceDirectory <http://hudson.zones.apache.org/hudson/job/CXF-Trunk-JDK15/ws/trunk/integration/jbi/target/generated/src/main/resources>
[INFO] Copying 3 resources
[INFO] [compiler:compile {execution: default-compile}]
[INFO] Compiling 16 source files to <http://hudson.zones.apache.org/hudson/job/CXF-Trunk-JDK15/ws/trunk/integration/jbi/target/classes>
[INFO] [resources:testResources {execution: default-testResources}]
[INFO] Using 'UTF-8' encoding to copy filtered resources.
[INFO] Copying 0 resource
[INFO] Copying 11 resources
[INFO] skip non existing resourceDirectory <http://hudson.zones.apache.org/hudson/job/CXF-Trunk-JDK15/ws/trunk/integration/jbi/target/generated/src/test/resources>
[INFO] Copying 3 resources
[INFO] [compiler:testCompile {execution: default-testCompile}]
[INFO] Compiling 6 source files to <http://hudson.zones.apache.org/hudson/job/CXF-Trunk-JDK15/ws/trunk/integration/jbi/target/test-classes>
[INFO] [surefire:test {execution: default-test}]
[INFO] Surefire report directory: <http://hudson.zones.apache.org/hudson/job/CXF-Trunk-JDK15/ws/trunk/integration/jbi/target/surefire-reports>

-------------------------------------------------------
 T E S T S
-------------------------------------------------------
Running org.apache.cxf.jbi.se.CXFServiceUnitManagerTest
Tests run: 20, Failures: 0, Errors: 0, Skipped: 0, Time elapsed: 1.369 sec
Running org.apache.cxf.jbi.se.CXFServiceUnitTest
Tests run: 6, Failures: 0, Errors: 0, Skipped: 0, Time elapsed: 0.56 sec
Running org.apache.cxf.jbi.se.state.ServiceEngineShutdownTest
Tests run: 4, Failures: 0, Errors: 0, Skipped: 0, Time elapsed: 0.015 sec
Running org.apache.cxf.jbi.se.state.ServiceEngineStartTest
Tests run: 4, Failures: 0, Errors: 0, Skipped: 0, Time elapsed: 0.01 sec
Running org.apache.cxf.jbi.se.state.ServiceEngineStateFactoryTest
Tests run: 2, Failures: 0, Errors: 0, Skipped: 0, Time elapsed: 0.007 sec
Running org.apache.cxf.jbi.se.state.ServiceEngineStopTest
Tests run: 4, Failures: 0, Errors: 0, Skipped: 0, Time elapsed: 0.01 sec

Results :

Tests run: 40, Failures: 0, Errors: 0, Skipped: 0

[HUDSON] Recording test results
[INFO] [jar:jar {execution: default-jar}]
[INFO] Building jar: <http://hudson.zones.apache.org/hudson/job/CXF-Trunk-JDK15/ws/trunk/integration/jbi/target/cxf-integration-jbi-2.3.0-SNAPSHOT.jar>
[INFO] [install:install {execution: default-install}]
[INFO] Installing <http://hudson.zones.apache.org/hudson/job/CXF-Trunk-JDK15/ws/trunk/integration/jbi/target/cxf-integration-jbi-2.3.0-SNAPSHOT.jar>
to <http://hudson.zones.apache.org/hudson/job/CXF-Trunk-JDK15/ws/.repository/org/apache/cxf/cxf-integration-jbi/2.3.0-SNAPSHOT/cxf-integration-jbi-2.3.0-SNAPSHOT.jar>
[HUDSON] Archiving <http://hudson.zones.apache.org/hudson/job/CXF-Trunk-JDK15/ws/trunk/integration/jbi/target/cxf-integration-jbi-2.3.0-SNAPSHOT.jar>
to /export/home/hudson/hudson/jobs/CXF-Trunk-JDK15/modules/org.apache.cxf$cxf-integration-jbi/builds/2009-12-16_19-01-29/archive/org.apache.cxf/cxf-integration-jbi/2.3.0-SNAPSHOT/cxf-integration-jbi-2.3.0-SNAPSHOT.jar
[INFO] ------------------------------------------------------------------------
[INFO] Building Apache CXF JCA Connection
[INFO]    task-segment: [clean, install]
[INFO] ------------------------------------------------------------------------
[INFO] [clean:clean {execution: default-clean}]
[INFO] Deleting file set: <http://hudson.zones.apache.org/hudson/job/CXF-Trunk-JDK15/ws/trunk/integration/jca/target>
(included: [**], excluded: [])
[INFO] [checkstyle:checkstyle {execution: validate}]
[INFO] Starting audit...
Audit done.

[INFO] Preparing pmd:check
[HUDSON] Archiving <http://hudson.zones.apache.org/hudson/job/CXF-Trunk-JDK15/ws/trunk/integration/jca/pom.xml>
to /export/home/hudson/hudson/jobs/CXF-Trunk-JDK15/modules/org.apache.cxf$cxf-integration-jca/builds/2009-12-16_19-01-29/archive/org.apache.cxf/cxf-integration-jca/2.3.0-SNAPSHOT/pom.xml
[INFO] [pmd:pmd {execution: pmd}]
[INFO] [pmd:check {execution: validate}]
[INFO] 
[INFO] [cxf-xml2fastinfoset:xml2fastinfoset {execution: xml2fastinfoset}]
[INFO] [remote-resources:process {execution: default}]
[INFO] [resources:resources {execution: default-resources}]
[INFO] Using 'UTF-8' encoding to copy filtered resources.
[INFO] Copying 2 resources
[INFO] Copying 1 resource
[INFO] skip non existing resourceDirectory <http://hudson.zones.apache.org/hudson/job/CXF-Trunk-JDK15/ws/trunk/integration/jca/src/main/resources-filtered>
[INFO] skip non existing resourceDirectory <http://hudson.zones.apache.org/hudson/job/CXF-Trunk-JDK15/ws/trunk/integration/jca/target/generated/src/main/resources>
[INFO] Copying 3 resources
[INFO] [compiler:compile {execution: default-compile}]
[INFO] Compiling 52 source files to <http://hudson.zones.apache.org/hudson/job/CXF-Trunk-JDK15/ws/trunk/integration/jca/target/classes>
[INFO] ------------------------------------------------------------------------
[ERROR] BUILD FAILURE
[INFO] ------------------------------------------------------------------------
[INFO] Compilation failure

<http://hudson.zones.apache.org/hudson/job/CXF-Trunk-JDK15/ws/trunk/integration/jca/src/main/java/org/apache/cxf/jca/servant/EJBEndpoint.java>:[42,43]
package org.apache.cxf.transport.http_jetty does not exist

<http://hudson.zones.apache.org/hudson/job/CXF-Trunk-JDK15/ws/trunk/integration/jca/src/main/java/org/apache/cxf/jca/servant/EJBEndpoint.java>:[43,43]
package org.apache.cxf.transport.http_jetty does not exist

<http://hudson.zones.apache.org/hudson/job/CXF-Trunk-JDK15/ws/trunk/integration/jca/src/main/java/org/apache/cxf/jca/servant/EJBEndpoint.java>:[44,25]
package org.mortbay.jetty does not exist

<http://hudson.zones.apache.org/hudson/job/CXF-Trunk-JDK15/ws/trunk/integration/jca/src/main/java/org/apache/cxf/jca/servant/EJBEndpoint.java>:[45,29]
package org.mortbay.jetty.nio does not exist

<http://hudson.zones.apache.org/hudson/job/CXF-Trunk-JDK15/ws/trunk/integration/jca/src/main/java/org/apache/cxf/jca/cxf/WorkManagerThreadPool.java>:[27,26]
package org.mortbay.thread does not exist

<http://hudson.zones.apache.org/hudson/job/CXF-Trunk-JDK15/ws/trunk/integration/jca/src/main/java/org/apache/cxf/jca/cxf/WorkManagerThreadPool.java>:[33,69]
cannot find symbol
symbol: class ThreadPool
public class WorkManagerThreadPool extends CXFWorkAdapter implements ThreadPool {

<http://hudson.zones.apache.org/hudson/job/CXF-Trunk-JDK15/ws/trunk/integration/jca/src/main/java/org/apache/cxf/jca/core/resourceadapter/ResourceAdapterInternalException.java>:[75,21]
[deprecation] getLinkedException() in javax.resource.ResourceException has been deprecated

<http://hudson.zones.apache.org/hudson/job/CXF-Trunk-JDK15/ws/trunk/integration/jca/src/main/java/org/apache/cxf/jca/servant/EJBEndpoint.java>:[107,8]
cannot find symbol
symbol  : class JettyHTTPServerEngineFactory
location: class org.apache.cxf.jca.servant.EJBEndpoint

<http://hudson.zones.apache.org/hudson/job/CXF-Trunk-JDK15/ws/trunk/integration/jca/src/main/java/org/apache/cxf/jca/servant/EJBEndpoint.java>:[107,70]
cannot find symbol
symbol  : class JettyHTTPServerEngineFactory
location: class org.apache.cxf.jca.servant.EJBEndpoint

<http://hudson.zones.apache.org/hudson/job/CXF-Trunk-JDK15/ws/trunk/integration/jca/src/main/java/org/apache/cxf/jca/servant/EJBEndpoint.java>:[112,8]
cannot find symbol
symbol  : class JettyHTTPServerEngine
location: class org.apache.cxf.jca.servant.EJBEndpoint

<http://hudson.zones.apache.org/hudson/job/CXF-Trunk-JDK15/ws/trunk/integration/jca/src/main/java/org/apache/cxf/jca/servant/EJBEndpoint.java>:[112,43]
cannot find symbol
symbol  : class JettyHTTPServerEngine
location: class org.apache.cxf.jca.servant.EJBEndpoint

<http://hudson.zones.apache.org/hudson/job/CXF-Trunk-JDK15/ws/trunk/integration/jca/src/main/java/org/apache/cxf/jca/servant/EJBEndpoint.java>:[113,8]
cannot find symbol
symbol  : class AbstractConnector
location: class org.apache.cxf.jca.servant.EJBEndpoint

<http://hudson.zones.apache.org/hudson/job/CXF-Trunk-JDK15/ws/trunk/integration/jca/src/main/java/org/apache/cxf/jca/servant/EJBEndpoint.java>:[113,42]
cannot find symbol
symbol  : class SelectChannelConnector
location: class org.apache.cxf.jca.servant.EJBEndpoint

<http://hudson.zones.apache.org/hudson/job/CXF-Trunk-JDK15/ws/trunk/integration/jca/src/main/java/org/apache/cxf/jca/servant/EJBEndpoint.java>:[119,13]
cannot find symbol
symbol  : class JettyHTTPServerEngine
location: class org.apache.cxf.jca.servant.EJBEndpoint

<http://hudson.zones.apache.org/hudson/job/CXF-Trunk-JDK15/ws/trunk/integration/jca/src/main/java/org/apache/cxf/jca/servant/EJBEndpoint.java>:[119,63]
cannot find symbol
symbol  : class JettyHTTPServerEngine
location: class org.apache.cxf.jca.servant.EJBEndpoint


[INFO] ------------------------------------------------------------------------
[INFO] Trace
org.apache.maven.BuildFailureException: Compilation failure
	at org.apache.maven.lifecycle.DefaultLifecycleExecutor.executeGoals(DefaultLifecycleExecutor.java:715)
	at org.apache.maven.lifecycle.DefaultLifecycleExecutor.executeGoalWithLifecycle(DefaultLifecycleExecutor.java:556)
	at org.apache.maven.lifecycle.DefaultLifecycleExecutor.executeGoal(DefaultLifecycleExecutor.java:535)
	at org.apache.maven.lifecycle.DefaultLifecycleExecutor.executeGoalAndHandleFailures(DefaultLifecycleExecutor.java:387)
	at org.apache.maven.lifecycle.DefaultLifecycleExecutor.executeTaskSegments(DefaultLifecycleExecutor.java:348)
	at org.apache.maven.lifecycle.DefaultLifecycleExecutor.execute(DefaultLifecycleExecutor.java:180)
	at org.apache.maven.lifecycle.LifecycleExecutorInterceptor.execute(LifecycleExecutorInterceptor.java:65)
	at org.apache.maven.DefaultMaven.doExecute(DefaultMaven.java:328)
	at org.apache.maven.DefaultMaven.execute(DefaultMaven.java:138)
	at org.apache.maven.cli.MavenCli.main(MavenCli.java:362)
	at sun.reflect.NativeMethodAccessorImpl.invoke0(Native Method)
	at sun.reflect.NativeMethodAccessorImpl.invoke(NativeMethodAccessorImpl.java:39)
	at sun.reflect.DelegatingMethodAccessorImpl.invoke(DelegatingMethodAccessorImpl.java:25)
	at java.lang.reflect.Method.invoke(Method.java:592)
	at org.codehaus.classworlds.Launcher.launchEnhanced(Launcher.java:315)
	at org.codehaus.classworlds.Launcher.launch(Launcher.java:255)
	at hudson.maven.agent.Main.launch(Main.java:165)
	at hudson.maven.MavenBuilder.call(MavenBuilder.java:159)
	at hudson.maven.MavenModuleSetBuild$Builder.call(MavenModuleSetBuild.java:687)
	at hudson.maven.MavenModuleSetBuild$Builder.call(MavenModuleSetBuild.java:633)
	at hudson.remoting.UserRequest.perform(UserRequest.java:104)
	at hudson.remoting.UserRequest.perform(UserRequest.java:48)
	at hudson.remoting.Request$2.run(Request.java:236)
	at java.util.concurrent.Executors$RunnableAdapter.call(Executors.java:417)
	at java.util.concurrent.FutureTask$Sync.innerRun(FutureTask.java:269)
	at java.util.concurrent.FutureTask.run(FutureTask.java:123)
	at java.util.concurrent.ThreadPoolExecutor$Worker.runTask(ThreadPoolExecutor.java:651)
	at java.util.concurrent.ThreadPoolExecutor$Worker.run(ThreadPoolExecutor.java:676)
	at java.lang.Thread.run(Thread.java:595)
Caused by: org.apache.maven.plugin.CompilationFailureException: Compilation failure
	at org.apache.maven.plugin.AbstractCompilerMojo.execute(AbstractCompilerMojo.java:516)
	at org.apache.maven.plugin.CompilerMojo.execute(CompilerMojo.java:114)
	at org.apache.maven.plugin.DefaultPluginManager.executeMojo(DefaultPluginManager.java:490)
	at hudson.maven.agent.PluginManagerInterceptor.executeMojo(PluginManagerInterceptor.java:182)
	at org.apache.maven.lifecycle.DefaultLifecycleExecutor.executeGoals(DefaultLifecycleExecutor.java:694)
	... 28 more
[INFO] ------------------------------------------------------------------------
[INFO] Total time: 21 minutes 14 seconds
[INFO] Finished at: Wed Dec 16 19:26:44 UTC 2009
[INFO] Final Memory: 118M/193M
[INFO] ------------------------------------------------------------------------
Sending e-mails to: notifications@cxf.apache.org dkulp@apache.org
channel stopped
[locks-and-latches] Releasing all the locks
[locks-and-latches] All the locks released


Mime
View raw message