cxf-notifications mailing list archives

Site index · List index
Message view « Date » · « Thread »
Top « Date » · « Thread »
From Apache Hudson Server <hud...@hudson.zones.apache.org>
Subject Build failed in Hudson: CXF-Trunk-JDK16 #228
Date Tue, 15 Dec 2009 05:09:14 GMT
See <http://hudson.zones.apache.org/hudson/job/CXF-Trunk-JDK16/228/changes>

Changes:

[dkulp] [CXF-1758] Add test case in simple frontend as well

[dkulp] Fix pmd error

[dkulp] [CXF-1758] Allow some more advanced usages of Generics with JAX-WS

[dkulp] [CXF-2035] Make sure the element name matches the operation defined by
the Actions

[dkulp] [CXF-2223] Try to install a JRE Authenticator to handle proxy CONNECT
requests.   Not sure if this will work or not.

[dkulp] [CXF-2582] Fix issues with holders for the first response part

[sergeyb] Minor update to WADLGenerator to ensure no duplicate forward slashes get concatenated
by some tools

[bharath] Bug: CXF-2581
Desc: During logging, we invoke toString on an array, which will generate junk result. Fixed
this by invoking Arrays.toString to convert the array into a readable String that gives the
contents of the array.
Test: Units Tests

[bharath] @Bug: CXF-2581
@Desc During logging, we invoke toString on an array, which will generate junk result. Fixed
this by invoking Arrays.toString to convert the array into a readable String that gives the
contents of the array.
@Test Units Tests

------------------------------------------
[...truncated 1900 lines...]
[INFO] Copying 1 resource
[INFO] Copying 8 resources
[INFO] skip non existing resourceDirectory <http://hudson.zones.apache.org/hudson/job/CXF-Trunk-JDK16/ws/trunk/rt/bindings/xml/src/main/resources-filtered>
[INFO] Copying 1 resource
[INFO] Copying 3 resources
[INFO] [compiler:compile]
[INFO] Compiling 17 source files to <http://hudson.zones.apache.org/hudson/job/CXF-Trunk-JDK16/ws/trunk/rt/bindings/xml/target/classes>
[INFO] [resources:testResources]
[INFO] Using 'UTF-8' encoding to copy filtered resources.
[INFO] Copying 0 resource
[INFO] Copying 4 resources
[INFO] skip non existing resourceDirectory <http://hudson.zones.apache.org/hudson/job/CXF-Trunk-JDK16/ws/trunk/rt/bindings/xml/target/generated/src/test/resources>
[INFO] Copying 3 resources
[INFO] [compiler:testCompile]
[INFO] Compiling 6 source files to <http://hudson.zones.apache.org/hudson/job/CXF-Trunk-JDK16/ws/trunk/rt/bindings/xml/target/test-classes>
[INFO] [surefire:test]
[INFO] Surefire report directory: <http://hudson.zones.apache.org/hudson/job/CXF-Trunk-JDK16/ws/trunk/rt/bindings/xml/target/surefire-reports>

-------------------------------------------------------
 T E S T S
-------------------------------------------------------
Running org.apache.cxf.binding.xml.XMLBindingFactoryTest
Tests run: 1, Failures: 0, Errors: 0, Skipped: 0, Time elapsed: 0.074 sec
Running org.apache.cxf.binding.xml.interceptor.XMLMessageInInterceptorTest
Tests run: 3, Failures: 0, Errors: 0, Skipped: 0, Time elapsed: 0.87 sec
Running org.apache.cxf.binding.xml.interceptor.XMLFaultInterceptorsTest
Tests run: 1, Failures: 0, Errors: 0, Skipped: 0, Time elapsed: 0.073 sec
Running org.apache.cxf.binding.xml.interceptor.XMLMessageOutInterceptorTest
Tests run: 3, Failures: 0, Errors: 0, Skipped: 0, Time elapsed: 0.126 sec
Running org.apache.cxf.binding.xml.interceptor.XMLFaultOutInterceptorTest
Tests run: 1, Failures: 0, Errors: 0, Skipped: 0, Time elapsed: 0.012 sec

Results :

Tests run: 9, Failures: 0, Errors: 0, Skipped: 0

[HUDSON] Recording test results
[INFO] [jar:jar]
[INFO] Building jar: <http://hudson.zones.apache.org/hudson/job/CXF-Trunk-JDK16/ws/trunk/rt/bindings/xml/target/cxf-rt-bindings-xml-2.3.0-SNAPSHOT.jar>
[INFO] [install:install]
[INFO] Installing <http://hudson.zones.apache.org/hudson/job/CXF-Trunk-JDK16/ws/trunk/rt/bindings/xml/target/cxf-rt-bindings-xml-2.3.0-SNAPSHOT.jar>
to <http://hudson.zones.apache.org/hudson/job/CXF-Trunk-JDK16/ws/.repository/org/apache/cxf/cxf-rt-bindings-xml/2.3.0-SNAPSHOT/cxf-rt-bindings-xml-2.3.0-SNAPSHOT.jar>
[HUDSON] Archiving <http://hudson.zones.apache.org/hudson/job/CXF-Trunk-JDK16/ws/trunk/rt/bindings/xml/target/cxf-rt-bindings-xml-2.3.0-SNAPSHOT.jar>
to /export/home/hudson/hudson/jobs/CXF-Trunk-JDK16/modules/org.apache.cxf$cxf-rt-bindings-xml/builds/2009-12-15_05-01-49/archive/org.apache.cxf/cxf-rt-bindings-xml/2.3.0-SNAPSHOT/cxf-rt-bindings-xml-2.3.0-SNAPSHOT.jar
[INFO] ------------------------------------------------------------------------
[INFO] Building Apache CXF Runtime SOAP Binding
[INFO]    task-segment: [clean, install]
[INFO] ------------------------------------------------------------------------
[INFO] [clean:clean]
[INFO] Deleting file set: <http://hudson.zones.apache.org/hudson/job/CXF-Trunk-JDK16/ws/trunk/rt/bindings/soap/target>
(included: [**], excluded: [])
[INFO] [checkstyle:checkstyle {execution: validate}]
[INFO] Starting audit...
Audit done.

[INFO] Preparing pmd:check
[HUDSON] Archiving <http://hudson.zones.apache.org/hudson/job/CXF-Trunk-JDK16/ws/trunk/rt/bindings/soap/pom.xml>
to /export/home/hudson/hudson/jobs/CXF-Trunk-JDK16/modules/org.apache.cxf$cxf-rt-bindings-soap/builds/2009-12-15_05-01-49/archive/org.apache.cxf/cxf-rt-bindings-soap/2.3.0-SNAPSHOT/pom.xml
[INFO] [pmd:pmd]
[INFO] [pmd:check {execution: validate}]
[INFO] 
[INFO] [cxf-xml2fastinfoset:xml2fastinfoset {execution: xml2fastinfoset}]
[INFO] [remote-resources:process {execution: default}]
[INFO] [resources:resources]
[INFO] Using 'UTF-8' encoding to copy filtered resources.
[INFO] Copying 3 resources
[INFO] Copying 7 resources
[INFO] skip non existing resourceDirectory <http://hudson.zones.apache.org/hudson/job/CXF-Trunk-JDK16/ws/trunk/rt/bindings/soap/src/main/resources-filtered>
[INFO] Copying 1 resource
[INFO] Copying 3 resources
[INFO] [compiler:compile]
[INFO] Compiling 67 source files to <http://hudson.zones.apache.org/hudson/job/CXF-Trunk-JDK16/ws/trunk/rt/bindings/soap/target/classes>
[WARNING] <http://hudson.zones.apache.org/hudson/job/CXF-Trunk-JDK16/ws/trunk/rt/bindings/soap/src/main/java/org/apache/cxf/binding/soap/Soap11.java>:[161,18]
[deprecation] getPrefix() in org.apache.cxf.binding.soap.SoapVersion has been deprecated

[WARNING] <http://hudson.zones.apache.org/hudson/job/CXF-Trunk-JDK16/ws/trunk/rt/bindings/soap/src/main/java/org/apache/cxf/binding/soap/Soap12.java>:[141,18]
[deprecation] getPrefix() in org.apache.cxf.binding.soap.SoapVersion has been deprecated

[INFO] [resources:testResources]
[INFO] Using 'UTF-8' encoding to copy filtered resources.
[INFO] Copying 4 resources
[INFO] Copying 12 resources
[INFO] skip non existing resourceDirectory <http://hudson.zones.apache.org/hudson/job/CXF-Trunk-JDK16/ws/trunk/rt/bindings/soap/target/generated/src/test/resources>
[INFO] Copying 3 resources
[INFO] [compiler:testCompile]
[INFO] Compiling 16 source files to <http://hudson.zones.apache.org/hudson/job/CXF-Trunk-JDK16/ws/trunk/rt/bindings/soap/target/test-classes>
[INFO] [surefire:test]
[INFO] Surefire report directory: <http://hudson.zones.apache.org/hudson/job/CXF-Trunk-JDK16/ws/trunk/rt/bindings/soap/target/surefire-reports>

-------------------------------------------------------
 T E S T S
-------------------------------------------------------
Running org.apache.cxf.binding.soap.RPCInInterceptorTest
Tests run: 2, Failures: 0, Errors: 0, Skipped: 0, Time elapsed: 0.636 sec
Running org.apache.cxf.binding.soap.SoapDestinationFactoryTest
Tests run: 1, Failures: 0, Errors: 0, Skipped: 0, Time elapsed: 0.013 sec
Running org.apache.cxf.binding.soap.ReadHeaderInterceptorTest
Tests run: 3, Failures: 0, Errors: 0, Skipped: 0, Time elapsed: 0.305 sec
Running org.apache.cxf.binding.soap.saaj.SAAJInInterceptorTest
Tests run: 2, Failures: 0, Errors: 0, Skipped: 0, Time elapsed: 0.072 sec
Running org.apache.cxf.binding.soap.SoapBindingFactoryTest
Tests run: 3, Failures: 0, Errors: 0, Skipped: 0, Time elapsed: 0.076 sec
Running org.apache.cxf.binding.soap.SoapActionInterceptorTest
Tests run: 1, Failures: 0, Errors: 0, Skipped: 0, Time elapsed: 0.006 sec
Running org.apache.cxf.binding.soap.SoapBindingTest
Tests run: 1, Failures: 0, Errors: 0, Skipped: 0, Time elapsed: 0.004 sec
Running org.apache.cxf.binding.soap.jms.interceptor.SoapFaultFactoryTest
Tests run: 2, Failures: 0, Errors: 0, Skipped: 0, Time elapsed: 0.153 sec
Running org.apache.cxf.binding.soap.ServiceModelUtilTest
Tests run: 1, Failures: 0, Errors: 0, Skipped: 0, Time elapsed: 0.012 sec
Running org.apache.cxf.binding.soap.MustUnderstandInterceptorTest
Tests run: 4, Failures: 0, Errors: 0, Skipped: 0, Time elapsed: 0.038 sec
Running org.apache.cxf.binding.soap.tcp.TCPConduitTest
Tests run: 1, Failures: 0, Errors: 0, Skipped: 1, Time elapsed: 0.003 sec
Running org.apache.cxf.binding.soap.RPCOutInterceptorTest
Tests run: 2, Failures: 0, Errors: 0, Skipped: 0, Time elapsed: 0.094 sec
Running org.apache.cxf.binding.soap.SoapOutInterceptorTest
Tests run: 2, Failures: 0, Errors: 0, Skipped: 0, Time elapsed: 0.013 sec
Running org.apache.cxf.binding.soap.interceptor.SoapFaultSerializerTest
Tests run: 4, Failures: 0, Errors: 0, Skipped: 0, Time elapsed: 0.133 sec

Results :

Tests run: 29, Failures: 0, Errors: 0, Skipped: 1

[HUDSON] Recording test results
[INFO] [jar:jar]
[INFO] Building jar: <http://hudson.zones.apache.org/hudson/job/CXF-Trunk-JDK16/ws/trunk/rt/bindings/soap/target/cxf-rt-bindings-soap-2.3.0-SNAPSHOT.jar>
[INFO] [install:install]
[INFO] Installing <http://hudson.zones.apache.org/hudson/job/CXF-Trunk-JDK16/ws/trunk/rt/bindings/soap/target/cxf-rt-bindings-soap-2.3.0-SNAPSHOT.jar>
to <http://hudson.zones.apache.org/hudson/job/CXF-Trunk-JDK16/ws/.repository/org/apache/cxf/cxf-rt-bindings-soap/2.3.0-SNAPSHOT/cxf-rt-bindings-soap-2.3.0-SNAPSHOT.jar>
[HUDSON] Archiving <http://hudson.zones.apache.org/hudson/job/CXF-Trunk-JDK16/ws/trunk/rt/bindings/soap/target/cxf-rt-bindings-soap-2.3.0-SNAPSHOT.jar>
to /export/home/hudson/hudson/jobs/CXF-Trunk-JDK16/modules/org.apache.cxf$cxf-rt-bindings-soap/builds/2009-12-15_05-01-49/archive/org.apache.cxf/cxf-rt-bindings-soap/2.3.0-SNAPSHOT/cxf-rt-bindings-soap-2.3.0-SNAPSHOT.jar
[INFO] ------------------------------------------------------------------------
[INFO] Building Apache CXF Runtime Local Transport
[INFO]    task-segment: [clean, install]
[INFO] ------------------------------------------------------------------------
[INFO] [clean:clean]
[INFO] Deleting file set: <http://hudson.zones.apache.org/hudson/job/CXF-Trunk-JDK16/ws/trunk/rt/transports/local/target>
(included: [**], excluded: [])
[INFO] [checkstyle:checkstyle {execution: validate}]
[INFO] Starting audit...
Audit done.

[INFO] Preparing pmd:check
[HUDSON] Archiving <http://hudson.zones.apache.org/hudson/job/CXF-Trunk-JDK16/ws/trunk/rt/transports/local/pom.xml>
to /export/home/hudson/hudson/jobs/CXF-Trunk-JDK16/modules/org.apache.cxf$cxf-rt-transports-local/builds/2009-12-15_05-01-49/archive/org.apache.cxf/cxf-rt-transports-local/2.3.0-SNAPSHOT/pom.xml
[INFO] [pmd:pmd]
[INFO] [pmd:check {execution: validate}]
[INFO] 
[INFO] [cxf-xml2fastinfoset:xml2fastinfoset {execution: xml2fastinfoset}]
[INFO] [remote-resources:process {execution: default}]
[INFO] [resources:resources]
[INFO] Using 'UTF-8' encoding to copy filtered resources.
[INFO] Copying 1 resource
[INFO] Copying 2 resources
[INFO] skip non existing resourceDirectory <http://hudson.zones.apache.org/hudson/job/CXF-Trunk-JDK16/ws/trunk/rt/transports/local/src/main/resources-filtered>
[INFO] Copying 1 resource
[INFO] Copying 3 resources
[INFO] [compiler:compile]
[INFO] Compiling 3 source files to <http://hudson.zones.apache.org/hudson/job/CXF-Trunk-JDK16/ws/trunk/rt/transports/local/target/classes>
[INFO] [resources:testResources]
[INFO] Using 'UTF-8' encoding to copy filtered resources.
[INFO] Copying 0 resource
[INFO] skip non existing resourceDirectory <http://hudson.zones.apache.org/hudson/job/CXF-Trunk-JDK16/ws/trunk/rt/transports/local/src/test/resources>
[INFO] skip non existing resourceDirectory <http://hudson.zones.apache.org/hudson/job/CXF-Trunk-JDK16/ws/trunk/rt/transports/local/target/generated/src/test/resources>
[INFO] Copying 3 resources
[INFO] [compiler:testCompile]
[INFO] Compiling 1 source file to <http://hudson.zones.apache.org/hudson/job/CXF-Trunk-JDK16/ws/trunk/rt/transports/local/target/test-classes>
[INFO] [surefire:test]
[INFO] Surefire report directory: <http://hudson.zones.apache.org/hudson/job/CXF-Trunk-JDK16/ws/trunk/rt/transports/local/target/surefire-reports>

-------------------------------------------------------
 T E S T S
-------------------------------------------------------
Running org.apache.cxf.transport.local.LocalTransportFactoryTest
Tests run: 2, Failures: 0, Errors: 0, Skipped: 0, Time elapsed: 0.069 sec

Results :

Tests run: 2, Failures: 0, Errors: 0, Skipped: 0

[HUDSON] Recording test results
[INFO] [jar:jar]
[INFO] Building jar: <http://hudson.zones.apache.org/hudson/job/CXF-Trunk-JDK16/ws/trunk/rt/transports/local/target/cxf-rt-transports-local-2.3.0-SNAPSHOT.jar>
[INFO] [install:install]
[INFO] Installing <http://hudson.zones.apache.org/hudson/job/CXF-Trunk-JDK16/ws/trunk/rt/transports/local/target/cxf-rt-transports-local-2.3.0-SNAPSHOT.jar>
to <http://hudson.zones.apache.org/hudson/job/CXF-Trunk-JDK16/ws/.repository/org/apache/cxf/cxf-rt-transports-local/2.3.0-SNAPSHOT/cxf-rt-transports-local-2.3.0-SNAPSHOT.jar>
[HUDSON] Archiving <http://hudson.zones.apache.org/hudson/job/CXF-Trunk-JDK16/ws/trunk/rt/transports/local/target/cxf-rt-transports-local-2.3.0-SNAPSHOT.jar>
to /export/home/hudson/hudson/jobs/CXF-Trunk-JDK16/modules/org.apache.cxf$cxf-rt-transports-local/builds/2009-12-15_05-01-49/archive/org.apache.cxf/cxf-rt-transports-local/2.3.0-SNAPSHOT/cxf-rt-transports-local-2.3.0-SNAPSHOT.jar
[INFO] ------------------------------------------------------------------------
[INFO] Building Apache CXF Runtime Simple Frontend
[INFO]    task-segment: [clean, install]
[INFO] ------------------------------------------------------------------------
[INFO] [clean:clean]
[INFO] Deleting file set: <http://hudson.zones.apache.org/hudson/job/CXF-Trunk-JDK16/ws/trunk/rt/frontend/simple/target>
(included: [**], excluded: [])
[INFO] [checkstyle:checkstyle {execution: validate}]
[INFO] Starting audit...
<http://hudson.zones.apache.org/hudson/job/CXF-Trunk-JDK16/ws/trunk/rt/frontend/simple/src/test/java/org/apache/cxf/service/factory/ServerFactoryTest.java>:30:8:
Unused import - org.apache.cxf.helpers.XMLUtils.
Audit done.

[HUDSON] Archiving <http://hudson.zones.apache.org/hudson/job/CXF-Trunk-JDK16/ws/trunk/rt/frontend/simple/pom.xml>
to /export/home/hudson/hudson/jobs/CXF-Trunk-JDK16/modules/org.apache.cxf$cxf-rt-frontend-simple/builds/2009-12-15_05-01-49/archive/org.apache.cxf/cxf-rt-frontend-simple/2.3.0-SNAPSHOT/pom.xml
[INFO] ------------------------------------------------------------------------
[ERROR] BUILD ERROR
[INFO] ------------------------------------------------------------------------
[INFO] An error has occurred in Checkstyle report generation.

Embedded error: There are 1 checkstyle errors.
[INFO] ------------------------------------------------------------------------
[INFO] Trace
org.apache.maven.lifecycle.LifecycleExecutionException: An error has occurred in Checkstyle
report generation.
	at org.apache.maven.lifecycle.DefaultLifecycleExecutor.executeGoals(DefaultLifecycleExecutor.java:584)
	at org.apache.maven.lifecycle.DefaultLifecycleExecutor.executeGoalWithLifecycle(DefaultLifecycleExecutor.java:500)
	at org.apache.maven.lifecycle.DefaultLifecycleExecutor.executeGoal(DefaultLifecycleExecutor.java:479)
	at org.apache.maven.lifecycle.DefaultLifecycleExecutor.executeGoalAndHandleFailures(DefaultLifecycleExecutor.java:331)
	at org.apache.maven.lifecycle.DefaultLifecycleExecutor.executeTaskSegments(DefaultLifecycleExecutor.java:292)
	at org.apache.maven.lifecycle.DefaultLifecycleExecutor.execute(DefaultLifecycleExecutor.java:142)
	at org.apache.maven.lifecycle.LifecycleExecutorInterceptor.execute(LifecycleExecutorInterceptor.java:65)
	at org.apache.maven.DefaultMaven.doExecute(DefaultMaven.java:336)
	at org.apache.maven.DefaultMaven.execute(DefaultMaven.java:129)
	at org.apache.maven.cli.MavenCli.main(MavenCli.java:301)
	at sun.reflect.NativeMethodAccessorImpl.invoke0(Native Method)
	at sun.reflect.NativeMethodAccessorImpl.invoke(NativeMethodAccessorImpl.java:39)
	at sun.reflect.DelegatingMethodAccessorImpl.invoke(DelegatingMethodAccessorImpl.java:25)
	at java.lang.reflect.Method.invoke(Method.java:597)
	at org.codehaus.classworlds.Launcher.launchEnhanced(Launcher.java:315)
	at org.codehaus.classworlds.Launcher.launch(Launcher.java:255)
	at hudson.maven.agent.Main.launch(Main.java:165)
	at hudson.maven.MavenBuilder.call(MavenBuilder.java:159)
	at hudson.maven.MavenModuleSetBuild$Builder.call(MavenModuleSetBuild.java:687)
	at hudson.maven.MavenModuleSetBuild$Builder.call(MavenModuleSetBuild.java:633)
	at hudson.remoting.UserRequest.perform(UserRequest.java:104)
	at hudson.remoting.UserRequest.perform(UserRequest.java:48)
	at hudson.remoting.Request$2.run(Request.java:236)
	at java.util.concurrent.Executors$RunnableAdapter.call(Executors.java:441)
	at java.util.concurrent.FutureTask$Sync.innerRun(FutureTask.java:303)
	at java.util.concurrent.FutureTask.run(FutureTask.java:138)
	at java.util.concurrent.ThreadPoolExecutor$Worker.runTask(ThreadPoolExecutor.java:886)
	at java.util.concurrent.ThreadPoolExecutor$Worker.run(ThreadPoolExecutor.java:908)
	at java.lang.Thread.run(Thread.java:619)
Caused by: org.apache.maven.plugin.MojoExecutionException: An error has occurred in Checkstyle
report generation.
	at org.apache.maven.reporting.AbstractMavenReport.execute(AbstractMavenReport.java:79)
	at org.apache.maven.plugin.DefaultPluginManager.executeMojo(DefaultPluginManager.java:453)
	at hudson.maven.agent.PluginManagerInterceptor.executeMojo(PluginManagerInterceptor.java:182)
	at org.apache.maven.lifecycle.DefaultLifecycleExecutor.executeGoals(DefaultLifecycleExecutor.java:559)
	... 28 more
Caused by: org.apache.maven.reporting.MavenReportException: There are 1 checkstyle errors.
	at org.apache.maven.plugin.checkstyle.CheckstyleReport.executeCheckstyle(CheckstyleReport.java:984)
	at org.apache.maven.plugin.checkstyle.CheckstyleReport.executeReport(CheckstyleReport.java:652)
	at org.apache.maven.reporting.AbstractMavenReport.generate(AbstractMavenReport.java:98)
	at org.apache.maven.reporting.AbstractMavenReport.execute(AbstractMavenReport.java:73)
	... 31 more
[INFO] ------------------------------------------------------------------------
[INFO] Total time: 7 minutes 10 seconds
[INFO] Finished at: Tue Dec 15 05:12:47 UTC 2009
[INFO] Final Memory: 240M/318M
[INFO] ------------------------------------------------------------------------
Sending e-mails to: notifications@cxf.apache.org dkulp@apache.org
channel stopped
[locks-and-latches] Releasing all the locks
[locks-and-latches] All the locks released


Mime
View raw message