cxf-notifications mailing list archives

Site index · List index
Message view « Date » · « Thread »
Top « Date » · « Thread »
From Apache Hudson Server <hud...@hudson.zones.apache.org>
Subject Build failed in Hudson: CXF-2.2.x-JDK15 #261
Date Wed, 16 Dec 2009 20:18:03 GMT
See <http://hudson.zones.apache.org/hudson/job/CXF-2.2.x-JDK15/261/changes>

Changes:

[dkulp] Merged revisions 891375,891393 via svnmerge from 
https://svn.apache.org/repos/asf/cxf/trunk

........
  r891375 | dkulp | 2009-12-16 13:46:56 -0500 (Wed, 16 Dec 2009) | 1 line
  
  [CXF-2583] Make slf4j-jdk14 a test scope dep
........
  r891393 | dkulp | 2009-12-16 14:29:44 -0500 (Wed, 16 Dec 2009) | 1 line
  
  Re-add jetty as runtime scope.
........

[dkulp] Merged revisions 891374 via svnmerge from 
https://svn.apache.org/repos/asf/cxf/trunk

........
  r891374 | dkulp | 2009-12-16 13:46:21 -0500 (Wed, 16 Dec 2009) | 1 line
  
  Remove print from test
........

------------------------------------------
[...truncated 1692 lines...]
Running org.apache.cxf.jaxb.BareOutInterceptorTest
Tests run: 2, Failures: 0, Errors: 0, Skipped: 0, Time elapsed: 0.107 sec
Running org.apache.cxf.jaxb.JAXBDataBindingTest
Tests run: 7, Failures: 0, Errors: 0, Skipped: 0, Time elapsed: 0.27 sec
Running org.apache.cxf.jaxb.JAXBWrapperHelperTest
Tests run: 1, Failures: 0, Errors: 0, Skipped: 0, Time elapsed: 0.022 sec

Results :

Tests run: 39, Failures: 0, Errors: 0, Skipped: 0

[HUDSON] Recording test results
[INFO] [jar:jar {execution: default-jar}]
[INFO] Building jar: <http://hudson.zones.apache.org/hudson/job/CXF-2.2.x-JDK15/ws/2.2.x-fixes/rt/databinding/jaxb/target/cxf-rt-databinding-jaxb-2.2.6-SNAPSHOT.jar>
[INFO] [install:install {execution: default-install}]
[INFO] Installing <http://hudson.zones.apache.org/hudson/job/CXF-2.2.x-JDK15/ws/2.2.x-fixes/rt/databinding/jaxb/target/cxf-rt-databinding-jaxb-2.2.6-SNAPSHOT.jar>
to <http://hudson.zones.apache.org/hudson/job/CXF-2.2.x-JDK15/ws/.repository/org/apache/cxf/cxf-rt-databinding-jaxb/2.2.6-SNAPSHOT/cxf-rt-databinding-jaxb-2.2.6-SNAPSHOT.jar>
[HUDSON] Archiving <http://hudson.zones.apache.org/hudson/job/CXF-2.2.x-JDK15/ws/2.2.x-fixes/rt/databinding/jaxb/target/cxf-rt-databinding-jaxb-2.2.6-SNAPSHOT.jar>
to /export/home/hudson/hudson/jobs/CXF-2.2.x-JDK15/modules/org.apache.cxf$cxf-rt-databinding-jaxb/builds/2009-12-16_20-11-19/archive/org.apache.cxf/cxf-rt-databinding-jaxb/2.2.6-SNAPSHOT/cxf-rt-databinding-jaxb-2.2.6-SNAPSHOT.jar
[INFO] ------------------------------------------------------------------------
[INFO] Building Apache CXF Runtime XML Binding
[INFO]    task-segment: [clean, install]
[INFO] ------------------------------------------------------------------------
[INFO] [clean:clean {execution: default-clean}]
[INFO] Deleting file set: <http://hudson.zones.apache.org/hudson/job/CXF-2.2.x-JDK15/ws/2.2.x-fixes/rt/bindings/xml/target>
(included: [**], excluded: [])
[INFO] [checkstyle:checkstyle {execution: validate}]
[INFO] Starting audit...
Audit done.

[INFO] Preparing pmd:check
[HUDSON] Archiving <http://hudson.zones.apache.org/hudson/job/CXF-2.2.x-JDK15/ws/2.2.x-fixes/rt/bindings/xml/pom.xml>
to /export/home/hudson/hudson/jobs/CXF-2.2.x-JDK15/modules/org.apache.cxf$cxf-rt-bindings-xml/builds/2009-12-16_20-11-19/archive/org.apache.cxf/cxf-rt-bindings-xml/2.2.6-SNAPSHOT/pom.xml
[INFO] [pmd:pmd {execution: pmd}]
[INFO] [pmd:check {execution: validate}]
[INFO] 
[INFO] [cxf-xml2fastinfoset:xml2fastinfoset {execution: xml2fastinfoset}]
[INFO] [cxf-common-xsd:xsdtojava {execution: generate-sources}]
[INFO] [remote-resources:process {execution: default}]
[INFO] [resources:resources {execution: default-resources}]
[INFO] Using 'UTF-8' encoding to copy filtered resources.
[INFO] Copying 1 resource
[INFO] Copying 8 resources
[INFO] skip non existing resourceDirectory <http://hudson.zones.apache.org/hudson/job/CXF-2.2.x-JDK15/ws/2.2.x-fixes/rt/bindings/xml/src/main/resources-filtered>
[INFO] Copying 1 resource
[INFO] Copying 3 resources
[INFO] [compiler:compile {execution: default-compile}]
[INFO] Compiling 17 source files to <http://hudson.zones.apache.org/hudson/job/CXF-2.2.x-JDK15/ws/2.2.x-fixes/rt/bindings/xml/target/classes>
[INFO] [resources:testResources {execution: default-testResources}]
[INFO] Using 'UTF-8' encoding to copy filtered resources.
[INFO] Copying 0 resource
[INFO] Copying 4 resources
[INFO] skip non existing resourceDirectory <http://hudson.zones.apache.org/hudson/job/CXF-2.2.x-JDK15/ws/2.2.x-fixes/rt/bindings/xml/target/generated/src/test/resources>
[INFO] Copying 3 resources
[INFO] [compiler:testCompile {execution: default-testCompile}]
[INFO] Compiling 6 source files to <http://hudson.zones.apache.org/hudson/job/CXF-2.2.x-JDK15/ws/2.2.x-fixes/rt/bindings/xml/target/test-classes>
[INFO] [surefire:test {execution: default-test}]
[INFO] Surefire report directory: <http://hudson.zones.apache.org/hudson/job/CXF-2.2.x-JDK15/ws/2.2.x-fixes/rt/bindings/xml/target/surefire-reports>

-------------------------------------------------------
 T E S T S
-------------------------------------------------------
Running org.apache.cxf.binding.xml.interceptor.XMLMessageOutInterceptorTest
Tests run: 3, Failures: 0, Errors: 0, Skipped: 0, Time elapsed: 1.063 sec
Running org.apache.cxf.binding.xml.interceptor.XMLMessageInInterceptorTest
Tests run: 3, Failures: 0, Errors: 0, Skipped: 0, Time elapsed: 0.134 sec
Running org.apache.cxf.binding.xml.interceptor.XMLFaultInterceptorsTest
Tests run: 1, Failures: 0, Errors: 0, Skipped: 0, Time elapsed: 0.04 sec
Running org.apache.cxf.binding.xml.interceptor.XMLFaultOutInterceptorTest
Tests run: 1, Failures: 0, Errors: 0, Skipped: 0, Time elapsed: 0.013 sec
Running org.apache.cxf.binding.xml.XMLBindingFactoryTest
Tests run: 1, Failures: 0, Errors: 0, Skipped: 0, Time elapsed: 0.005 sec

Results :

Tests run: 9, Failures: 0, Errors: 0, Skipped: 0

[HUDSON] Recording test results
[INFO] [jar:jar {execution: default-jar}]
[INFO] Building jar: <http://hudson.zones.apache.org/hudson/job/CXF-2.2.x-JDK15/ws/2.2.x-fixes/rt/bindings/xml/target/cxf-rt-bindings-xml-2.2.6-SNAPSHOT.jar>
[INFO] [install:install {execution: default-install}]
[INFO] Installing <http://hudson.zones.apache.org/hudson/job/CXF-2.2.x-JDK15/ws/2.2.x-fixes/rt/bindings/xml/target/cxf-rt-bindings-xml-2.2.6-SNAPSHOT.jar>
to <http://hudson.zones.apache.org/hudson/job/CXF-2.2.x-JDK15/ws/.repository/org/apache/cxf/cxf-rt-bindings-xml/2.2.6-SNAPSHOT/cxf-rt-bindings-xml-2.2.6-SNAPSHOT.jar>
[HUDSON] Archiving <http://hudson.zones.apache.org/hudson/job/CXF-2.2.x-JDK15/ws/2.2.x-fixes/rt/bindings/xml/target/cxf-rt-bindings-xml-2.2.6-SNAPSHOT.jar>
to /export/home/hudson/hudson/jobs/CXF-2.2.x-JDK15/modules/org.apache.cxf$cxf-rt-bindings-xml/builds/2009-12-16_20-11-19/archive/org.apache.cxf/cxf-rt-bindings-xml/2.2.6-SNAPSHOT/cxf-rt-bindings-xml-2.2.6-SNAPSHOT.jar
[INFO] ------------------------------------------------------------------------
[INFO] Building Apache CXF Runtime SOAP Binding
[INFO]    task-segment: [clean, install]
[INFO] ------------------------------------------------------------------------
[INFO] [clean:clean {execution: default-clean}]
[INFO] Deleting file set: <http://hudson.zones.apache.org/hudson/job/CXF-2.2.x-JDK15/ws/2.2.x-fixes/rt/bindings/soap/target>
(included: [**], excluded: [])
[INFO] [checkstyle:checkstyle {execution: validate}]
[INFO] Starting audit...
Audit done.

[INFO] Preparing pmd:check
[HUDSON] Archiving <http://hudson.zones.apache.org/hudson/job/CXF-2.2.x-JDK15/ws/2.2.x-fixes/rt/bindings/soap/pom.xml>
to /export/home/hudson/hudson/jobs/CXF-2.2.x-JDK15/modules/org.apache.cxf$cxf-rt-bindings-soap/builds/2009-12-16_20-11-19/archive/org.apache.cxf/cxf-rt-bindings-soap/2.2.6-SNAPSHOT/pom.xml
[INFO] [pmd:pmd {execution: pmd}]
[INFO] [pmd:check {execution: validate}]
[INFO] 
[INFO] [cxf-xml2fastinfoset:xml2fastinfoset {execution: xml2fastinfoset}]
[INFO] [remote-resources:process {execution: default}]
[INFO] [resources:resources {execution: default-resources}]
[INFO] Using 'UTF-8' encoding to copy filtered resources.
[INFO] Copying 2 resources
[INFO] Copying 7 resources
[INFO] skip non existing resourceDirectory <http://hudson.zones.apache.org/hudson/job/CXF-2.2.x-JDK15/ws/2.2.x-fixes/rt/bindings/soap/src/main/resources-filtered>
[INFO] Copying 1 resource
[INFO] Copying 3 resources
[INFO] [compiler:compile {execution: default-compile}]
[INFO] Compiling 42 source files to <http://hudson.zones.apache.org/hudson/job/CXF-2.2.x-JDK15/ws/2.2.x-fixes/rt/bindings/soap/target/classes>
[WARNING] <http://hudson.zones.apache.org/hudson/job/CXF-2.2.x-JDK15/ws/2.2.x-fixes/rt/bindings/soap/src/main/java/org/apache/cxf/binding/soap/Soap12.java>:[141,18]
[deprecation] getPrefix() in org.apache.cxf.binding.soap.SoapVersion has been deprecated

[WARNING] <http://hudson.zones.apache.org/hudson/job/CXF-2.2.x-JDK15/ws/2.2.x-fixes/rt/bindings/soap/src/main/java/org/apache/cxf/binding/soap/Soap11.java>:[161,18]
[deprecation] getPrefix() in org.apache.cxf.binding.soap.SoapVersion has been deprecated

[INFO] [resources:testResources {execution: default-testResources}]
[INFO] Using 'UTF-8' encoding to copy filtered resources.
[INFO] Copying 4 resources
[INFO] Copying 12 resources
[INFO] skip non existing resourceDirectory <http://hudson.zones.apache.org/hudson/job/CXF-2.2.x-JDK15/ws/2.2.x-fixes/rt/bindings/soap/target/generated/src/test/resources>
[INFO] Copying 3 resources
[INFO] [compiler:testCompile {execution: default-testCompile}]
[INFO] Compiling 14 source files to <http://hudson.zones.apache.org/hudson/job/CXF-2.2.x-JDK15/ws/2.2.x-fixes/rt/bindings/soap/target/test-classes>
[INFO] [surefire:test {execution: default-test}]
[INFO] Surefire report directory: <http://hudson.zones.apache.org/hudson/job/CXF-2.2.x-JDK15/ws/2.2.x-fixes/rt/bindings/soap/target/surefire-reports>

-------------------------------------------------------
 T E S T S
-------------------------------------------------------
Running org.apache.cxf.binding.soap.SoapDestinationFactoryTest
Tests run: 1, Failures: 0, Errors: 0, Skipped: 0, Time elapsed: 0.096 sec
Running org.apache.cxf.binding.soap.RPCOutInterceptorTest
Tests run: 2, Failures: 0, Errors: 0, Skipped: 0, Time elapsed: 0.603 sec
Running org.apache.cxf.binding.soap.SoapBindingTest
Tests run: 1, Failures: 0, Errors: 0, Skipped: 0, Time elapsed: 0.006 sec
Running org.apache.cxf.binding.soap.saaj.SAAJInInterceptorTest
Tests run: 2, Failures: 0, Errors: 0, Skipped: 0, Time elapsed: 0.446 sec
Running org.apache.cxf.binding.soap.MustUnderstandInterceptorTest
Tests run: 4, Failures: 0, Errors: 0, Skipped: 0, Time elapsed: 0.062 sec
Running org.apache.cxf.binding.soap.interceptor.SoapFaultSerializerTest
Tests run: 4, Failures: 0, Errors: 0, Skipped: 0, Time elapsed: 0.254 sec
Running org.apache.cxf.binding.soap.SoapActionInterceptorTest
Tests run: 1, Failures: 0, Errors: 0, Skipped: 0, Time elapsed: 0.006 sec
Running org.apache.cxf.binding.soap.ServiceModelUtilTest
Tests run: 1, Failures: 0, Errors: 0, Skipped: 0, Time elapsed: 0.015 sec
Running org.apache.cxf.binding.soap.SoapBindingFactoryTest
Tests run: 3, Failures: 0, Errors: 0, Skipped: 0, Time elapsed: 0.075 sec
Running org.apache.cxf.binding.soap.RPCInInterceptorTest
Tests run: 2, Failures: 0, Errors: 0, Skipped: 0, Time elapsed: 0.064 sec
Running org.apache.cxf.binding.soap.SoapOutInterceptorTest
Tests run: 2, Failures: 0, Errors: 0, Skipped: 0, Time elapsed: 0.05 sec
Running org.apache.cxf.binding.soap.ReadHeaderInterceptorTest
Tests run: 3, Failures: 0, Errors: 0, Skipped: 0, Time elapsed: 0.01 sec

Results :

Tests run: 26, Failures: 0, Errors: 0, Skipped: 0

[HUDSON] Recording test results
[INFO] [jar:jar {execution: default-jar}]
[INFO] Building jar: <http://hudson.zones.apache.org/hudson/job/CXF-2.2.x-JDK15/ws/2.2.x-fixes/rt/bindings/soap/target/cxf-rt-bindings-soap-2.2.6-SNAPSHOT.jar>
[INFO] [install:install {execution: default-install}]
[INFO] Installing <http://hudson.zones.apache.org/hudson/job/CXF-2.2.x-JDK15/ws/2.2.x-fixes/rt/bindings/soap/target/cxf-rt-bindings-soap-2.2.6-SNAPSHOT.jar>
to <http://hudson.zones.apache.org/hudson/job/CXF-2.2.x-JDK15/ws/.repository/org/apache/cxf/cxf-rt-bindings-soap/2.2.6-SNAPSHOT/cxf-rt-bindings-soap-2.2.6-SNAPSHOT.jar>
[HUDSON] Archiving <http://hudson.zones.apache.org/hudson/job/CXF-2.2.x-JDK15/ws/2.2.x-fixes/rt/bindings/soap/target/cxf-rt-bindings-soap-2.2.6-SNAPSHOT.jar>
to /export/home/hudson/hudson/jobs/CXF-2.2.x-JDK15/modules/org.apache.cxf$cxf-rt-bindings-soap/builds/2009-12-16_20-11-19/archive/org.apache.cxf/cxf-rt-bindings-soap/2.2.6-SNAPSHOT/cxf-rt-bindings-soap-2.2.6-SNAPSHOT.jar
[INFO] ------------------------------------------------------------------------
[INFO] Building Apache CXF Runtime Local Transport
[INFO]    task-segment: [clean, install]
[INFO] ------------------------------------------------------------------------
[INFO] [clean:clean {execution: default-clean}]
[INFO] Deleting file set: <http://hudson.zones.apache.org/hudson/job/CXF-2.2.x-JDK15/ws/2.2.x-fixes/rt/transports/local/target>
(included: [**], excluded: [])
[INFO] [checkstyle:checkstyle {execution: validate}]
[INFO] Starting audit...
Audit done.

[INFO] Preparing pmd:check
[HUDSON] Archiving <http://hudson.zones.apache.org/hudson/job/CXF-2.2.x-JDK15/ws/2.2.x-fixes/rt/transports/local/pom.xml>
to /export/home/hudson/hudson/jobs/CXF-2.2.x-JDK15/modules/org.apache.cxf$cxf-rt-transports-local/builds/2009-12-16_20-11-19/archive/org.apache.cxf/cxf-rt-transports-local/2.2.6-SNAPSHOT/pom.xml
[INFO] [pmd:pmd {execution: pmd}]
[INFO] [pmd:check {execution: validate}]
[INFO] 
[INFO] [cxf-xml2fastinfoset:xml2fastinfoset {execution: xml2fastinfoset}]
[INFO] [remote-resources:process {execution: default}]
[INFO] [resources:resources {execution: default-resources}]
[INFO] Using 'UTF-8' encoding to copy filtered resources.
[INFO] Copying 1 resource
[INFO] Copying 2 resources
[INFO] skip non existing resourceDirectory <http://hudson.zones.apache.org/hudson/job/CXF-2.2.x-JDK15/ws/2.2.x-fixes/rt/transports/local/src/main/resources-filtered>
[INFO] Copying 1 resource
[INFO] Copying 3 resources
[INFO] [compiler:compile {execution: default-compile}]
[INFO] Compiling 3 source files to <http://hudson.zones.apache.org/hudson/job/CXF-2.2.x-JDK15/ws/2.2.x-fixes/rt/transports/local/target/classes>
[INFO] ------------------------------------------------------------------------
[ERROR] BUILD FAILURE
[INFO] ------------------------------------------------------------------------
[INFO] Compilation failure
<http://hudson.zones.apache.org/hudson/job/CXF-2.2.x-JDK15/ws/2.2.x-fixes/rt/transports/local/src/main/java/org/apache/cxf/transport/local/LocalTransportFactory.java>:[87,13]
cannot find symbol
symbol  : method setBus(org.apache.cxf.Bus)
location: class org.apache.cxf.transport.AbstractTransportFactory


[INFO] ------------------------------------------------------------------------
[INFO] Trace
org.apache.maven.BuildFailureException: Compilation failure
<http://hudson.zones.apache.org/hudson/job/CXF-2.2.x-JDK15/ws/2.2.x-fixes/rt/transports/local/src/main/java/org/apache/cxf/transport/local/LocalTransportFactory.java>:[87,13]
cannot find symbol
symbol  : method setBus(org.apache.cxf.Bus)
location: class org.apache.cxf.transport.AbstractTransportFactory


	at org.apache.maven.lifecycle.DefaultLifecycleExecutor.executeGoals(DefaultLifecycleExecutor.java:715)
	at org.apache.maven.lifecycle.DefaultLifecycleExecutor.executeGoalWithLifecycle(DefaultLifecycleExecutor.java:556)
	at org.apache.maven.lifecycle.DefaultLifecycleExecutor.executeGoal(DefaultLifecycleExecutor.java:535)
	at org.apache.maven.lifecycle.DefaultLifecycleExecutor.executeGoalAndHandleFailures(DefaultLifecycleExecutor.java:387)
	at org.apache.maven.lifecycle.DefaultLifecycleExecutor.executeTaskSegments(DefaultLifecycleExecutor.java:348)
	at org.apache.maven.lifecycle.DefaultLifecycleExecutor.execute(DefaultLifecycleExecutor.java:180)
	at org.apache.maven.lifecycle.LifecycleExecutorInterceptor.execute(LifecycleExecutorInterceptor.java:65)
	at org.apache.maven.DefaultMaven.doExecute(DefaultMaven.java:328)
	at org.apache.maven.DefaultMaven.execute(DefaultMaven.java:138)
	at org.apache.maven.cli.MavenCli.main(MavenCli.java:362)
	at sun.reflect.NativeMethodAccessorImpl.invoke0(Native Method)
	at sun.reflect.NativeMethodAccessorImpl.invoke(NativeMethodAccessorImpl.java:39)
	at sun.reflect.DelegatingMethodAccessorImpl.invoke(DelegatingMethodAccessorImpl.java:25)
	at java.lang.reflect.Method.invoke(Method.java:585)
	at org.codehaus.classworlds.Launcher.launchEnhanced(Launcher.java:315)
	at org.codehaus.classworlds.Launcher.launch(Launcher.java:255)
	at hudson.maven.agent.Main.launch(Main.java:165)
	at hudson.maven.MavenBuilder.call(MavenBuilder.java:159)
	at hudson.maven.MavenModuleSetBuild$Builder.call(MavenModuleSetBuild.java:687)
	at hudson.maven.MavenModuleSetBuild$Builder.call(MavenModuleSetBuild.java:633)
	at hudson.remoting.UserRequest.perform(UserRequest.java:104)
	at hudson.remoting.UserRequest.perform(UserRequest.java:48)
	at hudson.remoting.Request$2.run(Request.java:236)
	at java.util.concurrent.Executors$RunnableAdapter.call(Executors.java:417)
	at java.util.concurrent.FutureTask$Sync.innerRun(FutureTask.java:269)
	at java.util.concurrent.FutureTask.run(FutureTask.java:123)
	at java.util.concurrent.ThreadPoolExecutor$Worker.runTask(ThreadPoolExecutor.java:650)
	at java.util.concurrent.ThreadPoolExecutor$Worker.run(ThreadPoolExecutor.java:675)
	at java.lang.Thread.run(Thread.java:595)
Caused by: org.apache.maven.plugin.CompilationFailureException: Compilation failure
<http://hudson.zones.apache.org/hudson/job/CXF-2.2.x-JDK15/ws/2.2.x-fixes/rt/transports/local/src/main/java/org/apache/cxf/transport/local/LocalTransportFactory.java>:[87,13]
cannot find symbol
symbol  : method setBus(org.apache.cxf.Bus)
location: class org.apache.cxf.transport.AbstractTransportFactory


	at org.apache.maven.plugin.AbstractCompilerMojo.execute(AbstractCompilerMojo.java:516)
	at org.apache.maven.plugin.CompilerMojo.execute(CompilerMojo.java:114)
	at org.apache.maven.plugin.DefaultPluginManager.executeMojo(DefaultPluginManager.java:490)
	at hudson.maven.agent.PluginManagerInterceptor.executeMojo(PluginManagerInterceptor.java:182)
	at org.apache.maven.lifecycle.DefaultLifecycleExecutor.executeGoals(DefaultLifecycleExecutor.java:694)
	... 28 more
[INFO] ------------------------------------------------------------------------
[INFO] Total time: 6 minutes 27 seconds
[INFO] Finished at: Wed Dec 16 20:21:25 UTC 2009
[INFO] Final Memory: 92M/185M
[INFO] ------------------------------------------------------------------------
Sending e-mails to: notifications@cxf.apache.org dkulp@apache.org
channel stopped


Mime
View raw message