cxf-notifications mailing list archives

Site index · List index
Message view « Date » · « Thread »
Top « Date » · « Thread »
From Apache Hudson Server <hud...@hudson.zones.apache.org>
Subject Build failed in Hudson: CXF-Trunk-JDK15 #905
Date Sat, 14 Nov 2009 02:38:48 GMT
See <http://hudson.zones.apache.org/hudson/job/CXF-Trunk-JDK15/905/changes>

Changes:

[dkulp] Another tck regression

------------------------------------------
[...truncated 1563 lines...]
[INFO] [install:install]
[INFO] Installing <http://hudson.zones.apache.org/hudson/job/CXF-Trunk-JDK15/ws/trunk/maven-plugins/wsdl-validator-plugin/target/cxf-wsdl-validator-plugin-2.3.0-SNAPSHOT.jar>
to <http://hudson.zones.apache.org/hudson/job/CXF-Trunk-JDK15/ws/.repository/org/apache/cxf/cxf-wsdl-validator-plugin/2.3.0-SNAPSHOT/cxf-wsdl-validator-plugin-2.3.0-SNAPSHOT.jar>
[INFO] [plugin:updateRegistry]
[HUDSON] Archiving <http://hudson.zones.apache.org/hudson/job/CXF-Trunk-JDK15/ws/trunk/maven-plugins/wsdl-validator-plugin/target/cxf-wsdl-validator-plugin-2.3.0-SNAPSHOT.jar>
to /export/home/hudson/hudson/jobs/CXF-Trunk-JDK15/modules/org.apache.cxf$cxf-wsdl-validator-plugin/builds/2009-11-14_02-31-17/archive/org.apache.cxf/cxf-wsdl-validator-plugin/2.3.0-SNAPSHOT/cxf-wsdl-validator-plugin-2.3.0-SNAPSHOT.jar
[INFO] ------------------------------------------------------------------------
[INFO] Building Apache CXF Command Line Tools WSDLTo JAXB Databinding
[INFO]    task-segment: [clean, install]
[INFO] ------------------------------------------------------------------------
[INFO] [clean:clean]
[INFO] Deleting file set: <http://hudson.zones.apache.org/hudson/job/CXF-Trunk-JDK15/ws/trunk/tools/wsdlto/databinding/jaxb/target>
(included: [**], excluded: [])
[INFO] [checkstyle:checkstyle {execution: validate}]
[INFO] Starting audit...
Audit done.

[INFO] Preparing pmd:check
[HUDSON] Archiving <http://hudson.zones.apache.org/hudson/job/CXF-Trunk-JDK15/ws/trunk/tools/wsdlto/databinding/jaxb/pom.xml>
to /export/home/hudson/hudson/jobs/CXF-Trunk-JDK15/modules/org.apache.cxf$cxf-tools-wsdlto-databinding-jaxb/builds/2009-11-14_02-31-16/archive/org.apache.cxf/cxf-tools-wsdlto-databinding-jaxb/2.3.0-SNAPSHOT/pom.xml
[INFO] [pmd:pmd]
[INFO] [pmd:check {execution: validate}]
[INFO] 
[INFO] [cxf-xml2fastinfoset:xml2fastinfoset {execution: xml2fastinfoset}]
[INFO] [remote-resources:process {execution: default}]
[INFO] [resources:resources]
[INFO] Using 'UTF-8' encoding to copy filtered resources.
[INFO] Copying 2 resources
[INFO] Copying 1 resource
[INFO] skip non existing resourceDirectory <http://hudson.zones.apache.org/hudson/job/CXF-Trunk-JDK15/ws/trunk/tools/wsdlto/databinding/jaxb/src/main/resources-filtered>
[INFO] skip non existing resourceDirectory <http://hudson.zones.apache.org/hudson/job/CXF-Trunk-JDK15/ws/trunk/tools/wsdlto/databinding/jaxb/target/generated/src/main/resources>
[INFO] Copying 3 resources
[INFO] [compiler:compile]
[INFO] Compiling 5 source files to <http://hudson.zones.apache.org/hudson/job/CXF-Trunk-JDK15/ws/trunk/tools/wsdlto/databinding/jaxb/target/classes>
[INFO] [resources:testResources]
[INFO] Using 'UTF-8' encoding to copy filtered resources.
[INFO] Copying 0 resource
[INFO] skip non existing resourceDirectory <http://hudson.zones.apache.org/hudson/job/CXF-Trunk-JDK15/ws/trunk/tools/wsdlto/databinding/jaxb/src/test/resources>
[INFO] skip non existing resourceDirectory <http://hudson.zones.apache.org/hudson/job/CXF-Trunk-JDK15/ws/trunk/tools/wsdlto/databinding/jaxb/target/generated/src/test/resources>
[INFO] Copying 3 resources
[INFO] [compiler:testCompile]
[INFO] Nothing to compile - all classes are up to date
[INFO] [surefire:test]
[INFO] Surefire report directory: <http://hudson.zones.apache.org/hudson/job/CXF-Trunk-JDK15/ws/trunk/tools/wsdlto/databinding/jaxb/target/surefire-reports>

-------------------------------------------------------
 T E S T S
-------------------------------------------------------
There are no tests to run.

Results :

Tests run: 0, Failures: 0, Errors: 0, Skipped: 0

[HUDSON] Recording test results
[INFO] [jar:jar]
[INFO] Building jar: <http://hudson.zones.apache.org/hudson/job/CXF-Trunk-JDK15/ws/trunk/tools/wsdlto/databinding/jaxb/target/cxf-tools-wsdlto-databinding-jaxb-2.3.0-SNAPSHOT.jar>
[INFO] [install:install]
[INFO] Installing <http://hudson.zones.apache.org/hudson/job/CXF-Trunk-JDK15/ws/trunk/tools/wsdlto/databinding/jaxb/target/cxf-tools-wsdlto-databinding-jaxb-2.3.0-SNAPSHOT.jar>
to <http://hudson.zones.apache.org/hudson/job/CXF-Trunk-JDK15/ws/.repository/org/apache/cxf/cxf-tools-wsdlto-databinding-jaxb/2.3.0-SNAPSHOT/cxf-tools-wsdlto-databinding-jaxb-2.3.0-SNAPSHOT.jar>
[HUDSON] Archiving <http://hudson.zones.apache.org/hudson/job/CXF-Trunk-JDK15/ws/trunk/tools/wsdlto/databinding/jaxb/target/cxf-tools-wsdlto-databinding-jaxb-2.3.0-SNAPSHOT.jar>
to /export/home/hudson/hudson/jobs/CXF-Trunk-JDK15/modules/org.apache.cxf$cxf-tools-wsdlto-databinding-jaxb/builds/2009-11-14_02-31-16/archive/org.apache.cxf/cxf-tools-wsdlto-databinding-jaxb/2.3.0-SNAPSHOT/cxf-tools-wsdlto-databinding-jaxb-2.3.0-SNAPSHOT.jar
[INFO] ------------------------------------------------------------------------
[INFO] Building Apache CXF Code Generation Maven2 Plugins
[INFO]    task-segment: [clean, install]
[INFO] ------------------------------------------------------------------------
[INFO] [clean:clean]
[INFO] Deleting file set: <http://hudson.zones.apache.org/hudson/job/CXF-Trunk-JDK15/ws/trunk/maven-plugins/codegen-plugin/target>
(included: [**], excluded: [])
[INFO] [checkstyle:checkstyle {execution: validate}]
[INFO] Starting audit...
Audit done.

[INFO] Preparing pmd:check
[HUDSON] Archiving <http://hudson.zones.apache.org/hudson/job/CXF-Trunk-JDK15/ws/trunk/maven-plugins/codegen-plugin/pom.xml>
to /export/home/hudson/hudson/jobs/CXF-Trunk-JDK15/modules/org.apache.cxf$cxf-codegen-plugin/builds/2009-11-14_02-31-17/archive/org.apache.cxf/cxf-codegen-plugin/2.3.0-SNAPSHOT/pom.xml
[INFO] [pmd:pmd]
[INFO] [pmd:check {execution: validate}]
[INFO] 
[INFO] [cxf-xml2fastinfoset:xml2fastinfoset {execution: xml2fastinfoset}]
[INFO] [plugin:descriptor]
[WARNING] Using platform encoding (UTF-8 actually) to read mojo metadata, i.e. build is platform
dependent!
[INFO] Applying mojo extractor for language: java
[INFO] Mojo extractor for language: java found 1 mojo descriptors.
[INFO] Applying mojo extractor for language: bsh
[INFO] Mojo extractor for language: bsh found 0 mojo descriptors.
[INFO] [remote-resources:process {execution: default}]
[INFO] [resources:resources]
[INFO] Using 'UTF-8' encoding to copy filtered resources.
[INFO] Copying 0 resource
[INFO] skip non existing resourceDirectory <http://hudson.zones.apache.org/hudson/job/CXF-Trunk-JDK15/ws/trunk/maven-plugins/codegen-plugin/src/main/resources>
[INFO] skip non existing resourceDirectory <http://hudson.zones.apache.org/hudson/job/CXF-Trunk-JDK15/ws/trunk/maven-plugins/codegen-plugin/src/main/resources-filtered>
[INFO] skip non existing resourceDirectory <http://hudson.zones.apache.org/hudson/job/CXF-Trunk-JDK15/ws/trunk/maven-plugins/codegen-plugin/target/generated/src/main/resources>
[INFO] Copying 3 resources
[INFO] [compiler:compile]
[INFO] Compiling 6 source files to <http://hudson.zones.apache.org/hudson/job/CXF-Trunk-JDK15/ws/trunk/maven-plugins/codegen-plugin/target/classes>
[INFO] [resources:testResources]
[INFO] Using 'UTF-8' encoding to copy filtered resources.
[INFO] skip non existing resourceDirectory <http://hudson.zones.apache.org/hudson/job/CXF-Trunk-JDK15/ws/trunk/maven-plugins/codegen-plugin/src/test/java>
[INFO] skip non existing resourceDirectory <http://hudson.zones.apache.org/hudson/job/CXF-Trunk-JDK15/ws/trunk/maven-plugins/codegen-plugin/src/test/resources>
[INFO] skip non existing resourceDirectory <http://hudson.zones.apache.org/hudson/job/CXF-Trunk-JDK15/ws/trunk/maven-plugins/codegen-plugin/target/generated/src/test/resources>
[INFO] Copying 3 resources
[INFO] [compiler:testCompile]
[INFO] No sources to compile
[INFO] [surefire:test]
[INFO] Surefire report directory: <http://hudson.zones.apache.org/hudson/job/CXF-Trunk-JDK15/ws/trunk/maven-plugins/codegen-plugin/target/surefire-reports>

-------------------------------------------------------
 T E S T S
-------------------------------------------------------
There are no tests to run.

Results :

Tests run: 0, Failures: 0, Errors: 0, Skipped: 0

[HUDSON] Recording test results
[INFO] [jar:jar]
[INFO] Building jar: <http://hudson.zones.apache.org/hudson/job/CXF-Trunk-JDK15/ws/trunk/maven-plugins/codegen-plugin/target/cxf-codegen-plugin-2.3.0-SNAPSHOT.jar>
[INFO] [plugin:addPluginArtifactMetadata]
[INFO] [install:install]
[INFO] Installing <http://hudson.zones.apache.org/hudson/job/CXF-Trunk-JDK15/ws/trunk/maven-plugins/codegen-plugin/target/cxf-codegen-plugin-2.3.0-SNAPSHOT.jar>
to <http://hudson.zones.apache.org/hudson/job/CXF-Trunk-JDK15/ws/.repository/org/apache/cxf/cxf-codegen-plugin/2.3.0-SNAPSHOT/cxf-codegen-plugin-2.3.0-SNAPSHOT.jar>
[INFO] [plugin:updateRegistry]
[HUDSON] Archiving <http://hudson.zones.apache.org/hudson/job/CXF-Trunk-JDK15/ws/trunk/maven-plugins/codegen-plugin/target/cxf-codegen-plugin-2.3.0-SNAPSHOT.jar>
to /export/home/hudson/hudson/jobs/CXF-Trunk-JDK15/modules/org.apache.cxf$cxf-codegen-plugin/builds/2009-11-14_02-31-17/archive/org.apache.cxf/cxf-codegen-plugin/2.3.0-SNAPSHOT/cxf-codegen-plugin-2.3.0-SNAPSHOT.jar
[INFO] ------------------------------------------------------------------------
[INFO] Building Apache CXF Test Utilities
[INFO]    task-segment: [clean, install]
[INFO] ------------------------------------------------------------------------
[INFO] [clean:clean]
[INFO] Deleting file set: <http://hudson.zones.apache.org/hudson/job/CXF-Trunk-JDK15/ws/trunk/testutils/target>
(included: [**], excluded: [])
[INFO] [checkstyle:checkstyle {execution: validate}]
[INFO] Starting audit...
Audit done.

[INFO] Preparing pmd:check
[HUDSON] Archiving <http://hudson.zones.apache.org/hudson/job/CXF-Trunk-JDK15/ws/trunk/testutils/pom.xml>
to /export/home/hudson/hudson/jobs/CXF-Trunk-JDK15/modules/org.apache.cxf$cxf-testutils/builds/2009-11-14_02-31-16/archive/org.apache.cxf/cxf-testutils/2.3.0-SNAPSHOT/pom.xml
[INFO] [pmd:pmd]
[INFO] [pmd:check {execution: validate}]
[INFO] 
[INFO] [antrun:run {execution: validate}]
[INFO] Executing tasks
    [mkdir] Created dir: <http://hudson.zones.apache.org/hudson/job/CXF-Trunk-JDK15/ws/trunk/testutils/target/generated/src/main/resources/wsdl/type_test>
     [xslt] Processing <http://hudson.zones.apache.org/hudson/job/CXF-Trunk-JDK15/ws/trunk/testutils/src/main/resources/wsdl/type_test/type_test.xsd>
to <http://hudson.zones.apache.org/hudson/job/CXF-Trunk-JDK15/ws/trunk/testutils/target/generated/src/main/resources/wsdl/type_test/type_test_1.xsd>
     [xslt] Loading stylesheet <http://hudson.zones.apache.org/hudson/job/CXF-Trunk-JDK15/ws/trunk/testutils/src/main/resources/wsdl/type_test/type_test_ID_xsd.xsl>
     [xslt] Processing <http://hudson.zones.apache.org/hudson/job/CXF-Trunk-JDK15/ws/trunk/testutils/src/main/resources/wsdl/type_test/type_test.xsd>
to <http://hudson.zones.apache.org/hudson/job/CXF-Trunk-JDK15/ws/trunk/testutils/target/generated/src/main/resources/wsdl/type_test/type_test_2.xsd>
     [xslt] Loading stylesheet <http://hudson.zones.apache.org/hudson/job/CXF-Trunk-JDK15/ws/trunk/testutils/src/main/resources/wsdl/type_test/type_test_ID_xsd.xsl>
     [xslt] Processing <http://hudson.zones.apache.org/hudson/job/CXF-Trunk-JDK15/ws/trunk/testutils/src/main/resources/wsdl/type_test/type_test.xsd>
to <http://hudson.zones.apache.org/hudson/job/CXF-Trunk-JDK15/ws/trunk/testutils/target/generated/src/main/resources/wsdl/type_test/type_test_3.xsd>
     [xslt] Loading stylesheet <http://hudson.zones.apache.org/hudson/job/CXF-Trunk-JDK15/ws/trunk/testutils/src/main/resources/wsdl/type_test/type_test_ID_xsd.xsl>
     [xslt] Processing <http://hudson.zones.apache.org/hudson/job/CXF-Trunk-JDK15/ws/trunk/testutils/src/main/resources/wsdl/type_test/type_test.xsd>
to <http://hudson.zones.apache.org/hudson/job/CXF-Trunk-JDK15/ws/trunk/testutils/target/generated/src/main/resources/wsdl/type_test/type_test_doclit.wsdl>
     [xslt] Loading stylesheet <http://hudson.zones.apache.org/hudson/job/CXF-Trunk-JDK15/ws/trunk/testutils/src/main/resources/wsdl/type_test/type_test_wsdl.xsl>
     [xslt] Processing <http://hudson.zones.apache.org/hudson/job/CXF-Trunk-JDK15/ws/trunk/testutils/src/main/resources/wsdl/type_test/type_test.xsd>
to <http://hudson.zones.apache.org/hudson/job/CXF-Trunk-JDK15/ws/trunk/testutils/target/generated/src/main/resources/wsdl/type_test/type_test_rpclit.wsdl>
     [xslt] Loading stylesheet <http://hudson.zones.apache.org/hudson/job/CXF-Trunk-JDK15/ws/trunk/testutils/src/main/resources/wsdl/type_test/type_test_wsdl.xsl>
     [xslt] Processing <http://hudson.zones.apache.org/hudson/job/CXF-Trunk-JDK15/ws/trunk/testutils/src/main/resources/wsdl/type_test/type_test.xsd>
to <http://hudson.zones.apache.org/hudson/job/CXF-Trunk-JDK15/ws/trunk/testutils/target/generated/src/main/resources/wsdl/type_test/type_test_xml_inc.wsdl>
     [xslt] Loading stylesheet <http://hudson.zones.apache.org/hudson/job/CXF-Trunk-JDK15/ws/trunk/testutils/src/main/resources/wsdl/type_test/type_test_wsdl.xsl>
     [xslt] Processing <http://hudson.zones.apache.org/hudson/job/CXF-Trunk-JDK15/ws/trunk/testutils/src/main/resources/wsdl/type_test/type_test.xsd>
to <http://hudson.zones.apache.org/hudson/job/CXF-Trunk-JDK15/ws/trunk/testutils/target/generated/src/main/resources/wsdl/type_test/type_test_xml.wsdl>
     [xslt] Loading stylesheet <http://hudson.zones.apache.org/hudson/job/CXF-Trunk-JDK15/ws/trunk/testutils/src/main/resources/wsdl/type_test/type_test_xml_wsdl.xsl>
     [xslt] Processing <http://hudson.zones.apache.org/hudson/job/CXF-Trunk-JDK15/ws/trunk/testutils/src/main/resources/wsdl/type_test/type_test.xsd>
to <http://hudson.zones.apache.org/hudson/job/CXF-Trunk-JDK15/ws/trunk/testutils/target/generated/src/main/resources/wsdl/type_test/type_test_doclit_soap.wsdl>
     [xslt] Loading stylesheet <http://hudson.zones.apache.org/hudson/job/CXF-Trunk-JDK15/ws/trunk/testutils/src/main/resources/wsdl/type_test/type_test_soap_wsdl.xsl>
     [xslt] Processing <http://hudson.zones.apache.org/hudson/job/CXF-Trunk-JDK15/ws/trunk/testutils/src/main/resources/wsdl/type_test/type_test.xsd>
to <http://hudson.zones.apache.org/hudson/job/CXF-Trunk-JDK15/ws/trunk/testutils/target/generated/src/main/resources/wsdl/type_test/type_test_rpclit_soap.wsdl>
     [xslt] Loading stylesheet <http://hudson.zones.apache.org/hudson/job/CXF-Trunk-JDK15/ws/trunk/testutils/src/main/resources/wsdl/type_test/type_test_soap_wsdl.xsl>
    [mkdir] Created dir: <http://hudson.zones.apache.org/hudson/job/CXF-Trunk-JDK15/ws/trunk/testutils/target/generated/src/main/java/org/apache/cxf/systest/type_test>
     [xslt] Processing <http://hudson.zones.apache.org/hudson/job/CXF-Trunk-JDK15/ws/trunk/testutils/src/main/resources/wsdl/type_test/type_test.xsd>
to <http://hudson.zones.apache.org/hudson/job/CXF-Trunk-JDK15/ws/trunk/testutils/target/generated/src/main/java/org/apache/cxf/systest/type_test/TypeTestImpl.java>
     [xslt] Loading stylesheet <http://hudson.zones.apache.org/hudson/job/CXF-Trunk-JDK15/ws/trunk/testutils/src/main/resources/wsdl/type_test/type_test_impl_java.xsl>
     [xslt] Processing <http://hudson.zones.apache.org/hudson/job/CXF-Trunk-JDK15/ws/trunk/testutils/src/main/resources/wsdl/type_test/type_test.xsd>
to <http://hudson.zones.apache.org/hudson/job/CXF-Trunk-JDK15/ws/trunk/testutils/target/generated/src/main/java/org/apache/cxf/systest/type_test/TypeTestTester.java>
     [xslt] Loading stylesheet <http://hudson.zones.apache.org/hudson/job/CXF-Trunk-JDK15/ws/trunk/testutils/src/main/resources/wsdl/type_test/type_test_tester_java.xsl>
[INFO] Executed tasks
[INFO] Registering compile source root <http://hudson.zones.apache.org/hudson/job/CXF-Trunk-JDK15/ws/trunk/testutils/target/generated/src/main/java>
[INFO] [cxf-xml2fastinfoset:xml2fastinfoset {execution: xml2fastinfoset}]
[INFO] [cxf-codegen:wsdl2java {execution: generate-sources}]
Nov 14, 2009 2:37:38 AM org.springframework.context.support.AbstractApplicationContext prepareRefresh
INFO: Refreshing org.apache.cxf.bus.spring.BusApplicationContext@1bc2c93: display name [org.apache.cxf.bus.spring.BusApplicationContext@1bc2c93];
startup date [Sat Nov 14 02:37:38 UTC 2009]; root of context hierarchy
Nov 14, 2009 2:37:38 AM org.springframework.beans.factory.xml.XmlBeanDefinitionReader loadBeanDefinitions
INFO: Loading XML bean definitions from class path resource [META-INF/cxf/cxf.xml]
Nov 14, 2009 2:37:42 AM org.springframework.context.support.AbstractApplicationContext obtainFreshBeanFactory
INFO: Bean factory for application context [org.apache.cxf.bus.spring.BusApplicationContext@1bc2c93]:
org.springframework.beans.factory.support.DefaultListableBeanFactory@c3492f
Nov 14, 2009 2:37:42 AM org.springframework.beans.factory.support.DefaultListableBeanFactory
preInstantiateSingletons
INFO: Pre-instantiating singletons in org.springframework.beans.factory.support.DefaultListableBeanFactory@c3492f:
defining beans [cxf,org.apache.cxf.bus.spring.BusApplicationListener,org.apache.cxf.bus.spring.BusWiringBeanFactoryPostProcessor,org.apache.cxf.bus.spring.Jsr250BeanPostProcessor,org.apache.cxf.bus.spring.BusExtensionPostProcessor,org.apache.cxf.resource.ResourceManager,org.apache.cxf.configuration.Configurer,org.apache.cxf.binding.BindingFactoryManager,org.apache.cxf.transport.DestinationFactoryManager,org.apache.cxf.transport.ConduitInitiatorManager,org.apache.cxf.wsdl.WSDLManager,org.apache.cxf.phase.PhaseManager,org.apache.cxf.workqueue.WorkQueueManager,org.apache.cxf.buslifecycle.BusLifeCycleManager,org.apache.cxf.endpoint.ServerRegistry,org.apache.cxf.endpoint.ServerLifeCycleManager,org.apache.cxf.endpoint.ClientLifeCycleManager,org.apache.cxf.transports.http.QueryHandlerRegistry,org.apache.cxf.endpoint.EndpointResolverRegistry,org.apache.cxf.headers.HeaderManager,org.apache.cxf.catalog.OASISCatalogManager,org.apache.cxf.service.factory.FactoryBeanListenerManager,org.apache.cxf.endpoint.ServiceContractResolverRegistry];
root of factory hierarchy
Nov 14, 2009 2:38:06 AM org.springframework.context.support.AbstractApplicationContext doClose
INFO: Closing org.apache.cxf.bus.spring.BusApplicationContext@1bc2c93: display name [org.apache.cxf.bus.spring.BusApplicationContext@1bc2c93];
startup date [Sat Nov 14 02:37:38 UTC 2009]; root of context hierarchy
Nov 14, 2009 2:38:06 AM org.springframework.beans.factory.support.DefaultSingletonBeanRegistry
destroySingletons
INFO: Destroying singletons in org.springframework.beans.factory.support.DefaultListableBeanFactory@c3492f:
defining beans [cxf,org.apache.cxf.bus.spring.BusApplicationListener,org.apache.cxf.bus.spring.BusWiringBeanFactoryPostProcessor,org.apache.cxf.bus.spring.Jsr250BeanPostProcessor,org.apache.cxf.bus.spring.BusExtensionPostProcessor,org.apache.cxf.resource.ResourceManager,org.apache.cxf.configuration.Configurer,org.apache.cxf.binding.BindingFactoryManager,org.apache.cxf.transport.DestinationFactoryManager,org.apache.cxf.transport.ConduitInitiatorManager,org.apache.cxf.wsdl.WSDLManager,org.apache.cxf.phase.PhaseManager,org.apache.cxf.workqueue.WorkQueueManager,org.apache.cxf.buslifecycle.BusLifeCycleManager,org.apache.cxf.endpoint.ServerRegistry,org.apache.cxf.endpoint.ServerLifeCycleManager,org.apache.cxf.endpoint.ClientLifeCycleManager,org.apache.cxf.transports.http.QueryHandlerRegistry,org.apache.cxf.endpoint.EndpointResolverRegistry,org.apache.cxf.headers.HeaderManager,org.apache.cxf.catalog.OASISCatalogManager,org.apache.cxf.service.factory.FactoryBeanListenerManager,org.apache.cxf.endpoint.ServiceContractResolverRegistry];
root of factory hierarchy
[INFO] [cxf-common-xsd:xsdtojava {execution: generate-sources}]
[INFO] [remote-resources:process {execution: default}]
[INFO] [resources:resources]
[INFO] Using 'UTF-8' encoding to copy filtered resources.
[INFO] Copying 1 resource
[INFO] Copying 88 resources
[INFO] skip non existing resourceDirectory <http://hudson.zones.apache.org/hudson/job/CXF-Trunk-JDK15/ws/trunk/testutils/src/main/resources-filtered>
[INFO] Copying 9 resources
[INFO] Copying 3 resources
[INFO] [compiler:compile]
[INFO] Compiling 1419 source files to <http://hudson.zones.apache.org/hudson/job/CXF-Trunk-JDK15/ws/trunk/testutils/target/classes>
[INFO] ------------------------------------------------------------------------
[ERROR] BUILD FAILURE
[INFO] ------------------------------------------------------------------------
[INFO] Compilation failure
<http://hudson.zones.apache.org/hudson/job/CXF-Trunk-JDK15/ws/trunk/testutils/src/main/java/org/apache/header_test/TestHeaderImpl.java>:[46,7]
org.apache.header_test.TestHeaderImpl is not abstract and does not override abstract method
testHeader3(javax.xml.ws.Holder<org.apache.header_test.types.TestHeader3>,javax.xml.ws.Holder<org.apache.header_test.types.TestHeader3>)
in org.apache.header_test.TestHeader



<http://hudson.zones.apache.org/hudson/job/CXF-Trunk-JDK15/ws/trunk/testutils/src/main/java/org/apache/header_test/TestHeaderImpl.java>:[46,7]
org.apache.header_test.TestHeaderImpl is not abstract and does not override abstract method
testHeader3(javax.xml.ws.Holder<org.apache.header_test.types.TestHeader3>,javax.xml.ws.Holder<org.apache.header_test.types.TestHeader3>)
in org.apache.header_test.TestHeader


[INFO] ------------------------------------------------------------------------
[INFO] Trace
org.apache.maven.BuildFailureException: Compilation failure
<http://hudson.zones.apache.org/hudson/job/CXF-Trunk-JDK15/ws/trunk/testutils/src/main/java/org/apache/header_test/TestHeaderImpl.java>:[46,7]
org.apache.header_test.TestHeaderImpl is not abstract and does not override abstract method
testHeader3(javax.xml.ws.Holder<org.apache.header_test.types.TestHeader3>,javax.xml.ws.Holder<org.apache.header_test.types.TestHeader3>)
in org.apache.header_test.TestHeader


	at org.apache.maven.lifecycle.DefaultLifecycleExecutor.executeGoals(DefaultLifecycleExecutor.java:580)
	at org.apache.maven.lifecycle.DefaultLifecycleExecutor.executeGoalWithLifecycle(DefaultLifecycleExecutor.java:500)
	at org.apache.maven.lifecycle.DefaultLifecycleExecutor.executeGoal(DefaultLifecycleExecutor.java:479)
	at org.apache.maven.lifecycle.DefaultLifecycleExecutor.executeGoalAndHandleFailures(DefaultLifecycleExecutor.java:331)
	at org.apache.maven.lifecycle.DefaultLifecycleExecutor.executeTaskSegments(DefaultLifecycleExecutor.java:292)
	at org.apache.maven.lifecycle.DefaultLifecycleExecutor.execute(DefaultLifecycleExecutor.java:142)
	at org.apache.maven.lifecycle.LifecycleExecutorInterceptor.execute(LifecycleExecutorInterceptor.java:65)
	at org.apache.maven.DefaultMaven.doExecute(DefaultMaven.java:336)
	at org.apache.maven.DefaultMaven.execute(DefaultMaven.java:129)
	at org.apache.maven.cli.MavenCli.main(MavenCli.java:301)
	at sun.reflect.NativeMethodAccessorImpl.invoke0(Native Method)
	at sun.reflect.NativeMethodAccessorImpl.invoke(NativeMethodAccessorImpl.java:39)
	at sun.reflect.DelegatingMethodAccessorImpl.invoke(DelegatingMethodAccessorImpl.java:25)
	at java.lang.reflect.Method.invoke(Method.java:592)
	at org.codehaus.classworlds.Launcher.launchEnhanced(Launcher.java:315)
	at org.codehaus.classworlds.Launcher.launch(Launcher.java:255)
	at hudson.maven.agent.Main.launch(Main.java:165)
	at hudson.maven.MavenBuilder.call(MavenBuilder.java:159)
	at hudson.maven.MavenModuleSetBuild$Builder.call(MavenModuleSetBuild.java:687)
	at hudson.maven.MavenModuleSetBuild$Builder.call(MavenModuleSetBuild.java:633)
	at hudson.remoting.UserRequest.perform(UserRequest.java:104)
	at hudson.remoting.UserRequest.perform(UserRequest.java:48)
	at hudson.remoting.Request$2.run(Request.java:236)
	at java.util.concurrent.Executors$RunnableAdapter.call(Executors.java:417)
	at java.util.concurrent.FutureTask$Sync.innerRun(FutureTask.java:269)
	at java.util.concurrent.FutureTask.run(FutureTask.java:123)
	at java.util.concurrent.ThreadPoolExecutor$Worker.runTask(ThreadPoolExecutor.java:651)
	at java.util.concurrent.ThreadPoolExecutor$Worker.run(ThreadPoolExecutor.java:676)
	at java.lang.Thread.run(Thread.java:595)
Caused by: org.apache.maven.plugin.CompilationFailureException: Compilation failure
<http://hudson.zones.apache.org/hudson/job/CXF-Trunk-JDK15/ws/trunk/testutils/src/main/java/org/apache/header_test/TestHeaderImpl.java>:[46,7]
org.apache.header_test.TestHeaderImpl is not abstract and does not override abstract method
testHeader3(javax.xml.ws.Holder<org.apache.header_test.types.TestHeader3>,javax.xml.ws.Holder<org.apache.header_test.types.TestHeader3>)
in org.apache.header_test.TestHeader


	at org.apache.maven.plugin.AbstractCompilerMojo.execute(AbstractCompilerMojo.java:516)
	at org.apache.maven.plugin.CompilerMojo.execute(CompilerMojo.java:114)
	at org.apache.maven.plugin.DefaultPluginManager.executeMojo(DefaultPluginManager.java:453)
	at hudson.maven.agent.PluginManagerInterceptor.executeMojo(PluginManagerInterceptor.java:182)
	at org.apache.maven.lifecycle.DefaultLifecycleExecutor.executeGoals(DefaultLifecycleExecutor.java:559)
	... 28 more
[INFO] ------------------------------------------------------------------------
[INFO] Total time: 6 minutes 31 seconds
[INFO] Finished at: Sat Nov 14 02:38:13 UTC 2009
[INFO] Final Memory: 86M/185M
[INFO] ------------------------------------------------------------------------
Sending e-mails to: notifications@cxf.apache.org
channel stopped
[locks-and-latches] Releasing all the locks
[locks-and-latches] All the locks released


Mime
View raw message