cxf-notifications mailing list archives

Site index · List index
Message view « Date » · « Thread »
Top « Date » · « Thread »
From Apache Hudson Server <hud...@hudson.zones.apache.org>
Subject Build failed in Hudson: CXF-2.2.x-JDK15 » Apache CXF HTTP Transport for OSGi #149
Date Tue, 29 Sep 2009 17:29:10 GMT
See <http://hudson.zones.apache.org/hudson/job/CXF-2.2.x-JDK15/org.apache.cxf$cxf-rt-transports-http-osgi/149/changes>

Changes:

[dkulp] Set the correct version  number

------------------------------------------
[INFO] ------------------------------------------------------------------------
[INFO] Building Apache CXF HTTP Transport for OSGi
[INFO]    task-segment: [clean, install]
[INFO] ------------------------------------------------------------------------
[INFO] [clean:clean {execution: default-clean}]
Downloading: http://repo1.maven.org/maven2/org/apache/felix/org.osgi.compendium/1.2.0/org.osgi.compendium-1.2.0.pom
3K downloaded  (org.osgi.compendium-1.2.0.pom)
Downloading: http://repo1.maven.org/maven2/org/apache/felix/org.osgi.core/1.2.0/org.osgi.core-1.2.0.pom
2K downloaded  (org.osgi.core-1.2.0.pom)
Downloading: http://repo1.maven.org/maven2/org/apache/felix/org.osgi.compendium/1.2.0/org.osgi.compendium-1.2.0.jar
151K downloaded  (org.osgi.compendium-1.2.0.jar)
Downloading: http://repo1.maven.org/maven2/org/apache/felix/org.osgi.core/1.2.0/org.osgi.core-1.2.0.jar
59K downloaded  (org.osgi.core-1.2.0.jar)
[INFO] [checkstyle:checkstyle {execution: validate}]
[INFO] Starting audit...
Audit done.

[INFO] Preparing pmd:check
[HUDSON] Archiving <http://hudson.zones.apache.org/hudson/job/CXF-2.2.x-JDK15/org.apache.cxf$cxf-rt-transports-http-osgi/ws/pom.xml>
to /export/home/hudson/hudson/jobs/CXF-2.2.x-JDK15/modules/org.apache.cxf$cxf-rt-transports-http-osgi/builds/2009-09-29_17-11-37/archive/org.apache.cxf/cxf-rt-transports-http-osgi/2.2.4-SNAPSHOT/pom.xml
[INFO] [pmd:pmd {execution: pmd}]
[INFO] [pmd:check {execution: validate}]
[INFO] 
[INFO] [cxf-xml2fastinfoset:xml2fastinfoset {execution: xml2fastinfoset}]
[INFO] [remote-resources:process {execution: default}]
[INFO] [resources:resources {execution: default-resources}]
[INFO] Using 'UTF-8' encoding to copy filtered resources.
[INFO] Copying 0 resource
[INFO] Copying 2 resources
[INFO] skip non existing resourceDirectory <http://hudson.zones.apache.org/hudson/job/CXF-2.2.x-JDK15/org.apache.cxf$cxf-rt-transports-http-osgi/ws/src/main/resources-filtered>
[INFO] skip non existing resourceDirectory <http://hudson.zones.apache.org/hudson/job/CXF-2.2.x-JDK15/org.apache.cxf$cxf-rt-transports-http-osgi/ws/target/generated/src/main/resources>
[INFO] Copying 3 resources
[INFO] [compiler:compile {execution: default-compile}]
[INFO] Compiling 6 source files to <http://hudson.zones.apache.org/hudson/job/CXF-2.2.x-JDK15/org.apache.cxf$cxf-rt-transports-http-osgi/ws/target/classes>
[INFO] ------------------------------------------------------------------------
[ERROR] BUILD FAILURE
[INFO] ------------------------------------------------------------------------
[INFO] Compilation failure
<http://hudson.zones.apache.org/hudson/job/CXF-2.2.x-JDK15/org.apache.cxf$cxf-rt-transports-http-osgi/ws/src/main/java/org/apache/cxf/transport/http_osgi/OsgiDestination.java>:[59,8]
cannot find symbol
symbol  : constructor AbstractHTTPDestination(org.apache.cxf.Bus,org.apache.cxf.service.model.EndpointInfo,boolean)
location: class org.apache.cxf.transport.http.AbstractHTTPDestination


[INFO] ------------------------------------------------------------------------
[INFO] Trace
org.apache.maven.BuildFailureException: Compilation failure
<http://hudson.zones.apache.org/hudson/job/CXF-2.2.x-JDK15/org.apache.cxf$cxf-rt-transports-http-osgi/ws/src/main/java/org/apache/cxf/transport/http_osgi/OsgiDestination.java>:[59,8]
cannot find symbol
symbol  : constructor AbstractHTTPDestination(org.apache.cxf.Bus,org.apache.cxf.service.model.EndpointInfo,boolean)
location: class org.apache.cxf.transport.http.AbstractHTTPDestination


	at org.apache.maven.lifecycle.DefaultLifecycleExecutor.executeGoals(DefaultLifecycleExecutor.java:715)
	at org.apache.maven.lifecycle.DefaultLifecycleExecutor.executeGoalWithLifecycle(DefaultLifecycleExecutor.java:556)
	at org.apache.maven.lifecycle.DefaultLifecycleExecutor.executeGoal(DefaultLifecycleExecutor.java:535)
	at org.apache.maven.lifecycle.DefaultLifecycleExecutor.executeGoalAndHandleFailures(DefaultLifecycleExecutor.java:387)
	at org.apache.maven.lifecycle.DefaultLifecycleExecutor.executeTaskSegments(DefaultLifecycleExecutor.java:348)
	at org.apache.maven.lifecycle.DefaultLifecycleExecutor.execute(DefaultLifecycleExecutor.java:180)
	at org.apache.maven.lifecycle.LifecycleExecutorInterceptor.execute(LifecycleExecutorInterceptor.java:65)
	at org.apache.maven.DefaultMaven.doExecute(DefaultMaven.java:328)
	at org.apache.maven.DefaultMaven.execute(DefaultMaven.java:138)
	at org.apache.maven.cli.MavenCli.main(MavenCli.java:362)
	at sun.reflect.NativeMethodAccessorImpl.invoke0(Native Method)
	at sun.reflect.NativeMethodAccessorImpl.invoke(NativeMethodAccessorImpl.java:39)
	at sun.reflect.DelegatingMethodAccessorImpl.invoke(DelegatingMethodAccessorImpl.java:25)
	at java.lang.reflect.Method.invoke(Method.java:585)
	at org.codehaus.classworlds.Launcher.launchEnhanced(Launcher.java:315)
	at org.codehaus.classworlds.Launcher.launch(Launcher.java:255)
	at hudson.maven.agent.Main.launch(Main.java:165)
	at hudson.maven.MavenBuilder.call(MavenBuilder.java:159)
	at hudson.maven.MavenModuleSetBuild$Builder.call(MavenModuleSetBuild.java:677)
	at hudson.maven.MavenModuleSetBuild$Builder.call(MavenModuleSetBuild.java:623)
	at hudson.remoting.UserRequest.perform(UserRequest.java:104)
	at hudson.remoting.UserRequest.perform(UserRequest.java:48)
	at hudson.remoting.Request$2.run(Request.java:236)
	at java.util.concurrent.Executors$RunnableAdapter.call(Executors.java:417)
	at java.util.concurrent.FutureTask$Sync.innerRun(FutureTask.java:269)
	at java.util.concurrent.FutureTask.run(FutureTask.java:123)
	at java.util.concurrent.ThreadPoolExecutor$Worker.runTask(ThreadPoolExecutor.java:650)
	at java.util.concurrent.ThreadPoolExecutor$Worker.run(ThreadPoolExecutor.java:675)
	at java.lang.Thread.run(Thread.java:595)
Caused by: org.apache.maven.plugin.CompilationFailureException: Compilation failure
<http://hudson.zones.apache.org/hudson/job/CXF-2.2.x-JDK15/org.apache.cxf$cxf-rt-transports-http-osgi/ws/src/main/java/org/apache/cxf/transport/http_osgi/OsgiDestination.java>:[59,8]
cannot find symbol
symbol  : constructor AbstractHTTPDestination(org.apache.cxf.Bus,org.apache.cxf.service.model.EndpointInfo,boolean)
location: class org.apache.cxf.transport.http.AbstractHTTPDestination


	at org.apache.maven.plugin.AbstractCompilerMojo.execute(AbstractCompilerMojo.java:516)
	at org.apache.maven.plugin.CompilerMojo.execute(CompilerMojo.java:114)
	at org.apache.maven.plugin.DefaultPluginManager.executeMojo(DefaultPluginManager.java:490)
	at hudson.maven.agent.PluginManagerInterceptor.executeMojo(PluginManagerInterceptor.java:182)
	at org.apache.maven.lifecycle.DefaultLifecycleExecutor.executeGoals(DefaultLifecycleExecutor.java:694)
	... 28 more
[INFO] ------------------------------------------------------------------------
[INFO] Total time: 17 minutes 21 seconds
[INFO] Finished at: Tue Sep 29 17:29:09 UTC 2009
[INFO] Final Memory: 104M/187M
[INFO] ------------------------------------------------------------------------


Mime
View raw message