cxf-notifications mailing list archives

Site index · List index
Message view « Date » · « Thread »
Top « Date » · « Thread »
From Apache Hudson Server <hud...@hudson.zones.apache.org>
Subject Build failed in Hudson: CXF-Trunk-JDK16 » Apache CXF Command Line Tools Common #138
Date Mon, 31 Aug 2009 05:08:03 GMT
See http://hudson.zones.apache.org/hudson/job/CXF-Trunk-JDK16/org.apache.cxf$cxf-tools-common/138/

------------------------------------------
[INFO] ------------------------------------------------------------------------
[INFO] Building Apache CXF Command Line Tools Common
[INFO]    task-segment: [clean, install]
[INFO] ------------------------------------------------------------------------
[INFO] [clean:clean]
[INFO] Deleting file set: http://hudson.zones.apache.org/hudson/job/CXF-Trunk-JDK16/org.apache.cxf$cxf-tools-common/ws/target
 (included: [**], excluded: [])
[INFO] [checkstyle:checkstyle {execution: validate}]
[INFO] Starting audit...
Audit done.

[INFO] Preparing pmd:check
[HUDSON] Archiving http://hudson.zones.apache.org/hudson/job/CXF-Trunk-JDK16/org.apache.cxf$cxf-tools-common/ws/pom.xml
 to /export/home/hudson/hudson/jobs/CXF-Trunk-JDK16/modules/org.apache.cxf$cxf-tools-common/builds/2009-08-31_05-02-27/archive/org.apache.cxf/cxf-tools-common/2.3.0-SNAPSHOT/pom.xml
[INFO] [pmd:pmd]
[HUDSON] Archiving http://hudson.zones.apache.org/hudson/job/CXF-Trunk-JDK16/org.apache.cxf$cxf-tools-common/ws/pom.xml
 to /export/home/hudson/hudson/jobs/CXF-Trunk-JDK16/modules/org.apache.cxf$cxf-tools-common/builds/2009-08-31_05-02-27/archive/org.apache.cxf/cxf-tools-common/2.3.0-SNAPSHOT/pom.xml
[INFO] [pmd:check {execution: validate}]
[INFO] 
[INFO] [cxf-xml2fastinfoset:xml2fastinfoset {execution: xml2fastinfoset}]
[INFO] [remote-resources:process {execution: default}]
[INFO] [resources:resources]
[INFO] Using 'UTF-8' encoding to copy filtered resources.
[INFO] Copying 12 resources
[INFO] Copying 1 resource
[INFO] skip non existing resourceDirectory http://hudson.zones.apache.org/hudson/job/CXF-Trunk-JDK16/org.apache.cxf$cxf-tools-common/ws/src/main/resources-filtered

[INFO] skip non existing resourceDirectory http://hudson.zones.apache.org/hudson/job/CXF-Trunk-JDK16/org.apache.cxf$cxf-tools-common/ws/target/generated/src/main/resources

[INFO] Copying 3 resources
[INFO] [compiler:compile]
[INFO] Compiling 73 source files to http://hudson.zones.apache.org/hudson/job/CXF-Trunk-JDK16/org.apache.cxf$cxf-tools-common/ws/target/classes

[HUDSON] Archiving http://hudson.zones.apache.org/hudson/job/CXF-Trunk-JDK16/org.apache.cxf$cxf-tools-common/ws/pom.xml
 to /export/home/hudson/hudson/jobs/CXF-Trunk-JDK16/modules/org.apache.cxf$cxf-tools-common/builds/2009-08-31_05-02-27/archive/org.apache.cxf/cxf-tools-common/2.3.0-SNAPSHOT/pom.xml
[INFO] ------------------------------------------------------------------------
[ERROR] BUILD FAILURE
[INFO] ------------------------------------------------------------------------
[INFO] Compilation failure

http://hudson.zones.apache.org/hudson/job/CXF-Trunk-JDK16/org.apache.cxf$cxf-tools-common/ws/src/main/java/org/apache/cxf/tools/common/ToolTestBase.java
:[27,26] package org.apache.cxf.test does not exist

http://hudson.zones.apache.org/hudson/job/CXF-Trunk-JDK16/org.apache.cxf$cxf-tools-common/ws/src/main/java/org/apache/cxf/tools/common/ToolTestBase.java
:[31,43] cannot find symbol
symbol: class AbstractCXFTest
public abstract class ToolTestBase extends AbstractCXFTest {

http://hudson.zones.apache.org/hudson/job/CXF-Trunk-JDK16/org.apache.cxf$cxf-tools-common/ws/src/main/java/org/apache/cxf/tools/common/ToolTestBase.java
:[64,31] cannot find symbol
symbol  : method getClass()
location: class org.apache.cxf.tools.common.ToolTestBase


[INFO] ------------------------------------------------------------------------
[INFO] Trace
org.apache.maven.BuildFailureException: Compilation failure
	at org.apache.maven.lifecycle.DefaultLifecycleExecutor.executeGoals(DefaultLifecycleExecutor.java:579)
	at org.apache.maven.lifecycle.DefaultLifecycleExecutor.executeGoalWithLifecycle(DefaultLifecycleExecutor.java:499)
	at org.apache.maven.lifecycle.DefaultLifecycleExecutor.executeGoal(DefaultLifecycleExecutor.java:478)
	at org.apache.maven.lifecycle.DefaultLifecycleExecutor.executeGoalAndHandleFailures(DefaultLifecycleExecutor.java:330)
	at org.apache.maven.lifecycle.DefaultLifecycleExecutor.executeTaskSegments(DefaultLifecycleExecutor.java:291)
	at org.apache.maven.lifecycle.DefaultLifecycleExecutor.execute(DefaultLifecycleExecutor.java:142)
	at org.apache.maven.lifecycle.LifecycleExecutorInterceptor.execute(LifecycleExecutorInterceptor.java:65)
	at org.apache.maven.DefaultMaven.doExecute(DefaultMaven.java:336)
	at org.apache.maven.DefaultMaven.execute(DefaultMaven.java:129)
	at org.apache.maven.cli.MavenCli.main(MavenCli.java:287)
	at sun.reflect.NativeMethodAccessorImpl.invoke0(Native Method)
	at sun.reflect.NativeMethodAccessorImpl.invoke(NativeMethodAccessorImpl.java:39)
	at sun.reflect.DelegatingMethodAccessorImpl.invoke(DelegatingMethodAccessorImpl.java:25)
	at java.lang.reflect.Method.invoke(Method.java:597)
	at org.codehaus.classworlds.Launcher.launchEnhanced(Launcher.java:315)
	at org.codehaus.classworlds.Launcher.launch(Launcher.java:255)
	at hudson.maven.agent.Main.launch(Main.java:158)
	at hudson.maven.MavenBuilder.call(MavenBuilder.java:162)
	at hudson.maven.MavenModuleSetBuild$Builder.call(MavenModuleSetBuild.java:579)
	at hudson.maven.MavenModuleSetBuild$Builder.call(MavenModuleSetBuild.java:525)
	at hudson.remoting.UserRequest.perform(UserRequest.java:69)
	at hudson.remoting.UserRequest.perform(UserRequest.java:23)
	at hudson.remoting.Request$2.run(Request.java:213)
	at java.util.concurrent.Executors$RunnableAdapter.call(Executors.java:441)
	at java.util.concurrent.FutureTask$Sync.innerRun(FutureTask.java:303)
	at java.util.concurrent.FutureTask.run(FutureTask.java:138)
	at java.util.concurrent.ThreadPoolExecutor$Worker.runTask(ThreadPoolExecutor.java:886)
	at java.util.concurrent.ThreadPoolExecutor$Worker.run(ThreadPoolExecutor.java:908)
	at java.lang.Thread.run(Thread.java:619)
Caused by: org.apache.maven.plugin.CompilationFailureException: Compilation failure
	at org.apache.maven.plugin.AbstractCompilerMojo.execute(AbstractCompilerMojo.java:516)
	at org.apache.maven.plugin.CompilerMojo.execute(CompilerMojo.java:114)
	at org.apache.maven.plugin.DefaultPluginManager.executeMojo(DefaultPluginManager.java:451)
	at hudson.maven.agent.PluginManagerInterceptor.executeMojo(PluginManagerInterceptor.java:182)
	at org.apache.maven.lifecycle.DefaultLifecycleExecutor.executeGoals(DefaultLifecycleExecutor.java:558)
	... 28 more
[INFO] ------------------------------------------------------------------------
[INFO] Total time: 4 minutes 33 seconds
[INFO] Finished at: Mon Aug 31 05:07:21 UTC 2009
[INFO] Final Memory: 135M/201M
[INFO] ------------------------------------------------------------------------


Mime
View raw message