cxf-notifications mailing list archives

Site index · List index
Message view « Date » · « Thread »
Top « Date » · « Thread »
From Apache Hudson Server <hud...@hudson.zones.apache.org>
Subject Build failed in Hudson: CXF-DOSGi » CXF Distribution Software Bundle #65
Date Sat, 20 Jun 2009 19:37:39 GMT
See http://hudson.zones.apache.org/hudson/job/CXF-DOSGi/org.apache.cxf.dosgi$cxf-dosgi-ri-dsw-cxf/65/

------------------------------------------
[INFO] ------------------------------------------------------------------------
[INFO] Building CXF Distribution Software Bundle
[INFO]    task-segment: [clean, install]
[INFO] ------------------------------------------------------------------------
[INFO] [clean:clean]
[INFO] Deleting directory http://hudson.zones.apache.org/hudson/job/CXF-DOSGi/org.apache.cxf.dosgi$cxf-dosgi-ri-dsw-cxf/ws/target

[INFO] snapshot org.apache.cxf:cxf-bundle-minimal:2.2.3-SNAPSHOT: checking for updates from
apache.snapshots
[INFO] snapshot org.apache.cxf:cxf-bundle-minimal:2.2.3-SNAPSHOT: checking for updates from
springframework.org
17K downloaded
[INFO] snapshot org.apache.cxf:cxf-bundle-parent:2.2.3-SNAPSHOT: checking for updates from
apache.snapshots
[INFO] snapshot org.apache.cxf:cxf-bundle-parent:2.2.3-SNAPSHOT: checking for updates from
springframework.org
4K downloaded
[INFO] snapshot org.apache.cxf:cxf-parent:2.2.3-SNAPSHOT: checking for updates from apache.snapshots
[INFO] snapshot org.apache.cxf:cxf-parent:2.2.3-SNAPSHOT: checking for updates from springframework.org
57K downloaded
3220K downloaded
[INFO] [remote-resources:process {execution: default}]
[INFO] [resources:resources]
[INFO] Using default encoding to copy filtered resources.
[INFO] [compiler:compile]
[INFO] Compiling 36 source files to http://hudson.zones.apache.org/hudson/job/CXF-DOSGi/org.apache.cxf.dosgi$cxf-dosgi-ri-dsw-cxf/ws/target/classes

[HUDSON] Archiving http://hudson.zones.apache.org/hudson/job/CXF-DOSGi/org.apache.cxf.dosgi$cxf-dosgi-ri-dsw-cxf/ws/pom.xml
 to /export/home/hudson/hudson/jobs/CXF-DOSGi/modules/org.apache.cxf.dosgi$cxf-dosgi-ri-dsw-cxf/builds/2009-06-20_19-36-52/archive/org.apache.cxf.dosgi/cxf-dosgi-ri-dsw-cxf/1.1-SNAPSHOT/pom.xml
[INFO] ------------------------------------------------------------------------
[ERROR] BUILD FAILURE
[INFO] ------------------------------------------------------------------------
[INFO] Compilation failure

http://hudson.zones.apache.org/hudson/job/CXF-DOSGi/org.apache.cxf.dosgi$cxf-dosgi-ri-dsw-cxf/ws/src/main/java/org/apache/cxf/dosgi/dsw/handlers/JaxRSPojoConfigurationTypeHandler.java
:[73,17] cannot find symbol
symbol  : method setModelBeansWithServiceClass(java.util.List<org.apache.cxf.jaxrs.model.UserResource>,java.lang.Class<capture#112
of ?>)
location: class org.apache.cxf.jaxrs.client.JAXRSClientFactoryBean

http://hudson.zones.apache.org/hudson/job/CXF-DOSGi/org.apache.cxf.dosgi$cxf-dosgi-ri-dsw-cxf/ws/src/main/java/org/apache/cxf/dosgi/dsw/handlers/JaxRSPojoConfigurationTypeHandler.java
:[112,16] cannot find symbol
symbol  : method setModelBeansWithServiceClass(java.util.List<org.apache.cxf.jaxrs.model.UserResource>,java.lang.Class<capture#980
of ?>)
location: class org.apache.cxf.jaxrs.JAXRSServerFactoryBean

http://hudson.zones.apache.org/hudson/job/CXF-DOSGi/org.apache.cxf.dosgi$cxf-dosgi-ri-dsw-cxf/ws/src/main/java/org/apache/cxf/dosgi/dsw/handlers/JaxRSHttpServiceConfigurationTypeHandler.java
:[80,16] cannot find symbol
symbol  : method setModelBeansWithServiceClass(java.util.List<org.apache.cxf.jaxrs.model.UserResource>,java.lang.Class<capture#689
of ?>)
location: class org.apache.cxf.jaxrs.JAXRSServerFactoryBean


[INFO] ------------------------------------------------------------------------
[INFO] Trace
org.apache.maven.BuildFailureException: Compilation failure
	at org.apache.maven.lifecycle.DefaultLifecycleExecutor.executeGoals(DefaultLifecycleExecutor.java:579)
	at org.apache.maven.lifecycle.DefaultLifecycleExecutor.executeGoalWithLifecycle(DefaultLifecycleExecutor.java:499)
	at org.apache.maven.lifecycle.DefaultLifecycleExecutor.executeGoal(DefaultLifecycleExecutor.java:478)
	at org.apache.maven.lifecycle.DefaultLifecycleExecutor.executeGoalAndHandleFailures(DefaultLifecycleExecutor.java:330)
	at org.apache.maven.lifecycle.DefaultLifecycleExecutor.executeTaskSegments(DefaultLifecycleExecutor.java:291)
	at org.apache.maven.lifecycle.DefaultLifecycleExecutor.execute(DefaultLifecycleExecutor.java:142)
	at org.apache.maven.lifecycle.LifecycleExecutorInterceptor.execute(LifecycleExecutorInterceptor.java:65)
	at org.apache.maven.DefaultMaven.doExecute(DefaultMaven.java:336)
	at org.apache.maven.DefaultMaven.execute(DefaultMaven.java:129)
	at org.apache.maven.cli.MavenCli.main(MavenCli.java:287)
	at sun.reflect.NativeMethodAccessorImpl.invoke0(Native Method)
	at sun.reflect.NativeMethodAccessorImpl.invoke(NativeMethodAccessorImpl.java:39)
	at sun.reflect.DelegatingMethodAccessorImpl.invoke(DelegatingMethodAccessorImpl.java:25)
	at java.lang.reflect.Method.invoke(Method.java:597)
	at org.codehaus.classworlds.Launcher.launchEnhanced(Launcher.java:315)
	at org.codehaus.classworlds.Launcher.launch(Launcher.java:255)
	at hudson.maven.agent.Main.launch(Main.java:158)
	at hudson.maven.MavenBuilder.call(MavenBuilder.java:162)
	at hudson.maven.MavenModuleSetBuild$Builder.call(MavenModuleSetBuild.java:579)
	at hudson.maven.MavenModuleSetBuild$Builder.call(MavenModuleSetBuild.java:525)
	at hudson.remoting.UserRequest.perform(UserRequest.java:69)
	at hudson.remoting.UserRequest.perform(UserRequest.java:23)
	at hudson.remoting.Request$2.run(Request.java:213)
	at java.util.concurrent.Executors$RunnableAdapter.call(Executors.java:441)
	at java.util.concurrent.FutureTask$Sync.innerRun(FutureTask.java:303)
	at java.util.concurrent.FutureTask.run(FutureTask.java:138)
	at java.util.concurrent.ThreadPoolExecutor$Worker.runTask(ThreadPoolExecutor.java:886)
	at java.util.concurrent.ThreadPoolExecutor$Worker.run(ThreadPoolExecutor.java:908)
	at java.lang.Thread.run(Thread.java:619)
Caused by: org.apache.maven.plugin.CompilationFailureException: Compilation failure
	at org.apache.maven.plugin.AbstractCompilerMojo.execute(AbstractCompilerMojo.java:516)
	at org.apache.maven.plugin.CompilerMojo.execute(CompilerMojo.java:114)
	at org.apache.maven.plugin.DefaultPluginManager.executeMojo(DefaultPluginManager.java:451)
	at hudson.maven.agent.PluginManagerInterceptor.executeMojo(PluginManagerInterceptor.java:182)
	at org.apache.maven.lifecycle.DefaultLifecycleExecutor.executeGoals(DefaultLifecycleExecutor.java:558)
	... 28 more
[INFO] ------------------------------------------------------------------------
[INFO] Total time: 29 seconds
[INFO] Finished at: Sat Jun 20 19:37:27 UTC 2009
[INFO] Final Memory: 47M/95M
[INFO] ------------------------------------------------------------------------
Waiting for Hudson to finish collecting data


Mime
View raw message