cxf-notifications mailing list archives

Site index · List index
Message view « Date » · « Thread »
Top « Date » · « Thread »
From Apache Hudson Server <hud...@hudson.zones.apache.org>
Subject Build failed in Hudson: CXF-2.1.x-JDK15 » Apache CXF System Tests #115
Date Thu, 21 May 2009 20:45:38 GMT
See http://hudson.zones.apache.org/hudson/job/CXF-2.1.x-JDK15/org.apache.cxf$cxf-systests/115/

------------------------------------------
[...truncated 248 lines...]
May 21, 2009 2:06:57 PM org.apache.cxf.tools.corba.processors.wsdl.WSDLToCorbaHelper processContainerAsMembers
WARNING: Unsupported Element Found in CORBA Binding Generation:{http://apache.org/type_test/doc}y
May 21, 2009 2:06:57 PM org.apache.cxf.tools.corba.processors.wsdl.WSDLToCorbaHelper processAttributesAsMembers
WARNING: Unsupported Attribute Found in CORBA Binding Generation:{http://apache.org/type_test/types1}attribUnion
SimpleType Union Not Supported in CORBA Binding
May 21, 2009 2:06:57 PM org.apache.cxf.tools.corba.processors.wsdl.WSDLToCorbaHelper processContainerAsMembers
WARNING: Unsupported Element Found in CORBA Binding Generation:{http://apache.org/type_test/types1}varUnion
May 21, 2009 2:06:57 PM org.apache.cxf.tools.corba.processors.wsdl.WSDLToCorbaHelper processAttributesAsMembers
WARNING: Unsupported Attribute Found in CORBA Binding Generation:{http://apache.org/type_test/types1}attribUnion
SimpleType Union Not Supported in CORBA Binding
May 21, 2009 2:06:57 PM org.apache.cxf.tools.corba.processors.wsdl.WSDLToCorbaHelper processContainerAsMembers
WARNING: Unsupported Element Found in CORBA Binding Generation:{http://apache.org/type_test/types1}varUnion
May 21, 2009 2:06:57 PM org.apache.cxf.tools.corba.processors.wsdl.WSDLToCorbaHelper processAttributesAsMembers
WARNING: Unsupported Attribute Found in CORBA Binding Generation:{http://apache.org/type_test/types1}attribUnion
SimpleType Union Not Supported in CORBA Binding
May 21, 2009 2:06:57 PM org.apache.cxf.tools.corba.processors.wsdl.WSDLToCorbaHelper processContainerAsMembers
WARNING: Unsupported Element Found in CORBA Binding Generation:{http://apache.org/type_test/types1}varUnion
May 21, 2009 2:06:57 PM org.apache.cxf.tools.corba.processors.wsdl.WSDLToCorbaHelper processAttributesAsMembers
WARNING: Unsupported Attribute Found in CORBA Binding Generation:{http://apache.org/type_test/types1}attribList
May 21, 2009 2:06:57 PM org.apache.cxf.tools.corba.processors.wsdl.WSDLToCorbaHelper processAttributesAsMembers
WARNING: Unsupported Attribute Found in CORBA Binding Generation:{http://apache.org/type_test/types1}attribList
May 21, 2009 2:06:57 PM org.apache.cxf.tools.corba.processors.wsdl.WSDLToCorbaHelper processAttributesAsMembers
WARNING: Unsupported Attribute Found in CORBA Binding Generation:{http://apache.org/type_test/types1}attribList
SimpleType Union Not Supported in CORBA Binding
May 21, 2009 2:06:57 PM org.apache.cxf.tools.corba.processors.wsdl.WSDLToCorbaHelper processContainerAsMembers
WARNING: Unsupported Element Found in CORBA Binding Generation:{http://apache.org/type_test/doc}x
SimpleType Union Not Supported in CORBA Binding
May 21, 2009 2:06:57 PM org.apache.cxf.tools.corba.processors.wsdl.WSDLToCorbaHelper processContainerAsMembers
WARNING: Unsupported Element Found in CORBA Binding Generation:{http://apache.org/type_test/doc}y
SimpleType Union Not Supported in CORBA Binding
May 21, 2009 2:06:57 PM org.apache.cxf.tools.corba.processors.wsdl.WSDLToCorbaHelper processContainerAsMembers
WARNING: Unsupported Element Found in CORBA Binding Generation:{http://apache.org/type_test/doc}return
SimpleType Union Not Supported in CORBA Binding
May 21, 2009 2:06:57 PM org.apache.cxf.tools.corba.processors.wsdl.WSDLToCorbaHelper processContainerAsMembers
WARNING: Unsupported Element Found in CORBA Binding Generation:{http://apache.org/type_test/doc}y
SimpleType Union Not Supported in CORBA Binding
May 21, 2009 2:06:57 PM org.apache.cxf.tools.corba.processors.wsdl.WSDLToCorbaHelper processContainerAsMembers
WARNING: Unsupported Element Found in CORBA Binding Generation:{http://apache.org/type_test/doc}z
SimpleType Union Not Supported in CORBA Binding
May 21, 2009 2:06:57 PM org.apache.cxf.tools.corba.processors.wsdl.WSDLToCorbaHelper processContainerAsMembers
WARNING: Unsupported Element Found in CORBA Binding Generation:{http://apache.org/type_test/doc}x
SimpleType Union Not Supported in CORBA Binding
May 21, 2009 2:06:57 PM org.apache.cxf.tools.corba.processors.wsdl.WSDLToCorbaHelper processContainerAsMembers
WARNING: Unsupported Element Found in CORBA Binding Generation:{http://apache.org/type_test/doc}y
May 21, 2009 2:06:57 PM org.apache.cxf.tools.corba.processors.wsdl.WSDLToCorbaHelper processAttributesAsMembers
WARNING: class org.apache.ws.commons.schema.XmlSchemaAttributeGroupRef not supported in CORBA
binding.  Skipping.
May 21, 2009 2:06:57 PM org.apache.cxf.tools.corba.processors.wsdl.WSDLToCorbaHelper processAttributesAsMembers
WARNING: class org.apache.ws.commons.schema.XmlSchemaAttributeGroupRef not supported in CORBA
binding.  Skipping.
SimpleType Union Not Supported in CORBA Binding
May 21, 2009 2:06:57 PM org.apache.cxf.tools.corba.processors.wsdl.WSDLToCorbaHelper processContainerAsMembers
WARNING: Unsupported Element Found in CORBA Binding Generation:{http://apache.org/type_test/doc}return
SimpleType Union Not Supported in CORBA Binding
May 21, 2009 2:06:57 PM org.apache.cxf.tools.corba.processors.wsdl.WSDLToCorbaHelper processContainerAsMembers
WARNING: Unsupported Element Found in CORBA Binding Generation:{http://apache.org/type_test/doc}y
SimpleType Union Not Supported in CORBA Binding
May 21, 2009 2:06:57 PM org.apache.cxf.tools.corba.processors.wsdl.WSDLToCorbaHelper processContainerAsMembers
WARNING: Unsupported Element Found in CORBA Binding Generation:{http://apache.org/type_test/doc}z
SimpleType Union Not Supported in CORBA Binding
May 21, 2009 2:06:57 PM org.apache.cxf.tools.corba.processors.wsdl.WSDLToCorbaHelper processAttributesAsMembers
WARNING: Unsupported Attribute Found in CORBA Binding Generation:{http://apache.org/type_test/types1}attribList
May 21, 2009 2:06:57 PM org.apache.cxf.tools.corba.processors.wsdl.WSDLToCorbaHelper processAttributesAsMembers
WARNING: Unsupported Attribute Found in CORBA Binding Generation:{http://apache.org/type_test/types1}attribUnion
SimpleType Union Not Supported in CORBA Binding
May 21, 2009 2:06:57 PM org.apache.cxf.tools.corba.processors.wsdl.WSDLToCorbaHelper processContainerAsMembers
WARNING: Unsupported Element Found in CORBA Binding Generation:{http://apache.org/type_test/types1}varUnion
SimpleType Union Not Supported in CORBA Binding
SimpleType Union Not Supported in CORBA Binding
SimpleType Union Not Supported in CORBA Binding
SimpleType Union Not Supported in CORBA Binding
SimpleType Union Not Supported in CORBA Binding
SimpleType Union Not Supported in CORBA Binding
SimpleType Union Not Supported in CORBA Binding
May 21, 2009 2:06:57 PM org.apache.cxf.tools.corba.processors.wsdl.WSDLToCorbaBinding addBindingOperations
WARNING: Operation testNMTOKENS not mapped to CORBA binding.
SimpleType Union Not Supported in CORBA Binding
May 21, 2009 2:06:57 PM org.apache.cxf.tools.corba.processors.wsdl.WSDLToCorbaBinding addBindingOperations
WARNING: Operation testSimpleUnionList not mapped to CORBA binding.
SimpleType Union Not Supported in CORBA Binding
May 21, 2009 2:06:57 PM org.apache.cxf.tools.corba.processors.wsdl.WSDLToCorbaBinding addBindingOperations
WARNING: Operation testAnonUnionList not mapped to CORBA binding.
SimpleType Union Not Supported in CORBA Binding
May 21, 2009 2:06:58 PM org.apache.cxf.tools.corba.processors.wsdl.WSDLToCorbaBinding addBindingOperations
WARNING: Operation testSimpleUnion not mapped to CORBA binding.
SimpleType Union Not Supported in CORBA Binding
May 21, 2009 2:06:58 PM org.apache.cxf.tools.corba.processors.wsdl.WSDLToCorbaBinding addBindingOperations
WARNING: Operation testUnionWithAnonEnum not mapped to CORBA binding.
SimpleType Union Not Supported in CORBA Binding
May 21, 2009 2:06:58 PM org.apache.cxf.tools.corba.processors.wsdl.WSDLToCorbaBinding addBindingOperations
WARNING: Operation testUnionWithStringList not mapped to CORBA binding.
SimpleType Union Not Supported in CORBA Binding
May 21, 2009 2:06:58 PM org.apache.cxf.tools.corba.processors.wsdl.WSDLToCorbaBinding addBindingOperations
WARNING: Operation testUnionWithStringListRestriction not mapped to CORBA binding.
SimpleType Union Not Supported in CORBA Binding
May 21, 2009 2:06:58 PM org.apache.cxf.tools.corba.processors.wsdl.WSDLToCorbaBinding addBindingOperations
WARNING: Operation testUnionWithAnonList not mapped to CORBA binding.
May 21, 2009 2:06:58 PM org.apache.cxf.tools.corba.processors.wsdl.WSDLToCorbaHelper processAttributesAsMembers
WARNING: Unsupported Attribute Found in CORBA Binding Generation:{http://apache.org/type_test/types1}attribList
May 21, 2009 2:06:58 PM org.apache.cxf.tools.corba.processors.wsdl.WSDLToCorbaHelper processAttributesAsMembers
WARNING: Unsupported Attribute Found in CORBA Binding Generation:{http://apache.org/type_test/types1}attribList
May 21, 2009 2:06:58 PM org.apache.cxf.tools.corba.processors.wsdl.WSDLToCorbaHelper processAttributesAsMembers
WARNING: Unsupported Attribute Found in CORBA Binding Generation:{http://apache.org/type_test/types1}attribList
May 21, 2009 2:06:58 PM org.apache.cxf.tools.corba.processors.wsdl.WSDLToCorbaHelper processAttributesAsMembers
WARNING: Unsupported Attribute Found in CORBA Binding Generation:{http://apache.org/type_test/types1}attribList
May 21, 2009 2:06:58 PM org.apache.cxf.tools.corba.processors.wsdl.WSDLToCorbaHelper processAttributesAsMembers
WARNING: Unsupported Attribute Found in CORBA Binding Generation:{http://apache.org/type_test/types1}attribList
May 21, 2009 2:06:58 PM org.apache.cxf.tools.corba.processors.wsdl.WSDLToCorbaHelper processAttributesAsMembers
WARNING: Unsupported Attribute Found in CORBA Binding Generation:{http://apache.org/type_test/types1}attribUnion
SimpleType Union Not Supported in CORBA Binding
May 21, 2009 2:06:58 PM org.apache.cxf.tools.corba.processors.wsdl.WSDLToCorbaHelper processContainerAsMembers
WARNING: Unsupported Element Found in CORBA Binding Generation:{http://apache.org/type_test/types1}varUnion
May 21, 2009 2:06:58 PM org.apache.cxf.tools.corba.processors.wsdl.WSDLToCorbaHelper processAttributesAsMembers
WARNING: Unsupported Attribute Found in CORBA Binding Generation:{http://apache.org/type_test/types1}attribUnion
SimpleType Union Not Supported in CORBA Binding
May 21, 2009 2:06:58 PM org.apache.cxf.tools.corba.processors.wsdl.WSDLToCorbaHelper processContainerAsMembers
WARNING: Unsupported Element Found in CORBA Binding Generation:{http://apache.org/type_test/types1}varUnion
May 21, 2009 2:06:58 PM org.apache.cxf.tools.corba.processors.wsdl.WSDLToCorbaHelper processAttributesAsMembers
WARNING: Unsupported Attribute Found in CORBA Binding Generation:{http://apache.org/type_test/types1}attribUnion
SimpleType Union Not Supported in CORBA Binding
May 21, 2009 2:06:58 PM org.apache.cxf.tools.corba.processors.wsdl.WSDLToCorbaHelper processContainerAsMembers
WARNING: Unsupported Element Found in CORBA Binding Generation:{http://apache.org/type_test/types1}varUnion
May 21, 2009 2:06:58 PM org.apache.cxf.tools.corba.processors.wsdl.WSDLToCorbaHelper processAttributesAsMembers
WARNING: Unsupported Attribute Found in CORBA Binding Generation:{http://apache.org/type_test/types1}attribUnion
SimpleType Union Not Supported in CORBA Binding
May 21, 2009 2:06:58 PM org.apache.cxf.tools.corba.processors.wsdl.WSDLToCorbaHelper processContainerAsMembers
WARNING: Unsupported Element Found in CORBA Binding Generation:{http://apache.org/type_test/types1}varUnion
May 21, 2009 2:06:58 PM org.apache.cxf.tools.corba.processors.wsdl.WSDLToCorbaHelper processAttributesAsMembers
WARNING: Unsupported Attribute Found in CORBA Binding Generation:{http://apache.org/type_test/types1}attribUnion
SimpleType Union Not Supported in CORBA Binding
May 21, 2009 2:06:58 PM org.apache.cxf.tools.corba.processors.wsdl.WSDLToCorbaHelper processContainerAsMembers
WARNING: Unsupported Element Found in CORBA Binding Generation:{http://apache.org/type_test/types1}varUnion
SimpleType Union Not Supported in CORBA Binding
May 21, 2009 2:06:58 PM org.apache.cxf.tools.corba.processors.wsdl.WSDLToCorbaBinding addBindingOperations
WARNING: Operation testUnionSimpleContent not mapped to CORBA binding.
May 21, 2009 2:06:58 PM org.apache.cxf.tools.corba.processors.wsdl.WSDLToCorbaHelper processAttributesAsMembers
WARNING: class org.apache.ws.commons.schema.XmlSchemaAttributeGroupRef not supported in CORBA
binding.  Skipping.
May 21, 2009 2:06:58 PM org.apache.cxf.tools.corba.processors.wsdl.WSDLToCorbaHelper processAttributesAsMembers
WARNING: class org.apache.ws.commons.schema.XmlSchemaAttributeGroupRef not supported in CORBA
binding.  Skipping.
May 21, 2009 2:06:58 PM org.apache.cxf.tools.corba.processors.wsdl.WSDLToCorbaHelper processAttributesAsMembers
WARNING: class org.apache.ws.commons.schema.XmlSchemaAttributeGroupRef not supported in CORBA
binding.  Skipping.
May 21, 2009 2:06:58 PM org.apache.cxf.tools.corba.processors.wsdl.WSDLToCorbaHelper processAttributesAsMembers
WARNING: class org.apache.ws.commons.schema.XmlSchemaAttributeGroupRef not supported in CORBA
binding.  Skipping.
May 21, 2009 2:06:58 PM org.apache.cxf.tools.corba.processors.wsdl.WSDLToCorbaHelper processAttributesAsMembers
WARNING: class org.apache.ws.commons.schema.XmlSchemaAttributeGroupRef not supported in CORBA
binding.  Skipping.
May 21, 2009 2:06:58 PM org.apache.cxf.tools.corba.processors.wsdl.WSDLToCorbaHelper processAttributesAsMembers
WARNING: class org.apache.ws.commons.schema.XmlSchemaAttributeGroupRef not supported in CORBA
binding.  Skipping.
May 21, 2009 2:06:58 PM org.apache.cxf.tools.corba.processors.wsdl.WSDLToCorbaHelper processAttributesAsMembers
WARNING: class org.apache.ws.commons.schema.XmlSchemaAttributeGroupRef not supported in CORBA
binding.  Skipping.
May 21, 2009 2:06:58 PM org.apache.cxf.tools.corba.processors.wsdl.WSDLToCorbaHelper processAttributesAsMembers
WARNING: class org.apache.ws.commons.schema.XmlSchemaAttributeGroupRef not supported in CORBA
binding.  Skipping.
May 21, 2009 2:06:58 PM org.apache.cxf.tools.corba.processors.wsdl.WSDLToCorbaHelper processAttributesAsMembers
WARNING: class org.apache.ws.commons.schema.XmlSchemaAttributeGroupRef not supported in CORBA
binding.  Skipping.
May 21, 2009 2:06:58 PM org.apache.cxf.tools.corba.processors.wsdl.WSDLToCorbaHelper processAttributesAsMembers
WARNING: class org.apache.ws.commons.schema.XmlSchemaAttributeGroupRef not supported in CORBA
binding.  Skipping.
May 21, 2009 2:06:58 PM org.apache.cxf.tools.corba.processors.wsdl.WSDLToCorbaHelper processContainerAsMembers
WARNING: Unknown particle type org.apache.ws.commons.schema.XmlSchemaGroupRef
May 21, 2009 2:06:58 PM org.apache.cxf.tools.corba.processors.wsdl.WSDLToCorbaHelper processContainerAsMembers
WARNING: Unknown particle type org.apache.ws.commons.schema.XmlSchemaGroupRef
May 21, 2009 2:06:58 PM org.apache.cxf.tools.corba.processors.wsdl.WSDLToCorbaHelper processContainerAsMembers
WARNING: Unknown particle type org.apache.ws.commons.schema.XmlSchemaGroupRef
May 21, 2009 2:06:58 PM org.apache.cxf.tools.corba.processors.wsdl.WSDLToCorbaHelper processContainerAsMembers
WARNING: Unknown particle type org.apache.ws.commons.schema.XmlSchemaGroupRef
May 21, 2009 2:06:58 PM org.apache.cxf.tools.corba.processors.wsdl.WSDLToCorbaHelper processContainerAsMembers
WARNING: Unknown particle type org.apache.ws.commons.schema.XmlSchemaGroupRef
May 21, 2009 2:06:58 PM org.springframework.context.support.AbstractApplicationContext doClose
INFO: Closing org.apache.cxf.bus.spring.BusApplicationContext@47795e: display name [org.apache.cxf.bus.spring.BusApplicationContext@47795e];
startup date [Thu May 21 14:06:55 PDT 2009]; root of context hierarchy
May 21, 2009 2:06:58 PM org.springframework.beans.factory.support.DefaultSingletonBeanRegistry
destroySingletons
INFO: Destroying singletons in org.springframework.beans.factory.support.DefaultListableBeanFactory@1d12bd9:
defining beans [cxf,org.apache.cxf.bus.spring.BusApplicationListener,org.apache.cxf.bus.spring.BusWiringBeanFactoryPostProcessor,org.apache.cxf.bus.spring.Jsr250BeanPostProcessor,org.apache.cxf.bus.spring.BusExtensionPostProcessor,org.apache.cxf.resource.ResourceManager,org.apache.cxf.configuration.Configurer,org.apache.cxf.binding.BindingFactoryManager,org.apache.cxf.transport.DestinationFactoryManager,org.apache.cxf.transport.ConduitInitiatorManager,org.apache.cxf.wsdl.WSDLManager,org.apache.cxf.phase.PhaseManager,org.apache.cxf.workqueue.WorkQueueManager,org.apache.cxf.buslifecycle.BusLifeCycleManager,org.apache.cxf.endpoint.ServerRegistry,org.apache.cxf.endpoint.ServerLifeCycleManager,org.apache.cxf.endpoint.ClientLifeCycleManager,org.apache.cxf.transports.http.QueryHandlerRegistry,org.apache.cxf.endpoint.EndpointResolverRegistry,org.apache.cxf.headers.HeaderManager,org.apache.cxf.catalog.OASISCatalogManager,org.apache.cxf.endpoint.ServiceContractResolverRegistry,org.apache.cxf.binding.corba.CorbaBindingFactory,org.apache.cxf.binding.corba.wsdl.WSDLExtensionRegister,org.apache.cxf.jaxws.context.WebServiceContextResourceResolver,org.apache.cxf.jaxws.context.WebServiceContextImpl,org.apache.cxf.binding.soap.SoapBindingFactory,org.apache.cxf.binding.soap.SoapTransportFactory,org.apache.cxf.binding.soap.customEditorConfigurer,org.apache.cxf.binding.xml.XMLBindingFactory,org.apache.cxf.ws.addressing.policy.AddressingAssertionBuilder,org.apache.cxf.ws.addressing.policy.AddressingPolicyInterceptorProvider,org.apache.cxf.ws.addressing.policy.UsingAddressingAssertionBuilder,org.apache.cxf.management.InstrumentationManager,org.apache.cxf.binding.jbi.JBIBindingFactory,org.apache.cxf.transport.jbi.JBITransportFactory,org.apache.cxf.binding.http.HttpBindingFactory,org.apache.cxf.transport.http.policy.HTTPClientAssertionBuilder,org.apache.cxf.transport.http.policy.HTTPServerAssertionBuilder,org.apache.cxf.transport.http.policy.NoOpPolicyInterceptorProvider,org.apache.cxf.transport.http.ClientOnlyHTTPTransportFactory,org.apache.cxf.transport.http_jetty.JettyHTTPTransportFactory,org.apache.cxf.transport.local.LocalTransportFactory,org.apache.cxf.transport.jms.JMSTransportFactory,org.apache.cxf.ws.rm.RMManager,org.apache.cxf.ws.rm.policy.RMPolicyInterceptorProvider,org.apache.cxf.ws.rm.RMAssertionBuilder,org.apache.cxf.ws.policy.AssertionBuilderRegistry,org.apache.cxf.ws.policy.PolicyConstants,org.apache.cxf.ws.policy.PolicyInterceptorProviderRegistry,org.apache.cxf.ws.policy.attachment.external.DomainExpressionBuilderRegistry,org.apache.cxf.ws.policy.attachment.external.EndpointReferenceDomainExpressionBuilder,org.apache.cxf.ws.policy.PolicyBuilder,org.apache.cxf.ws.policy.PolicyEngine,org.apache.cxf.ws.policy.attachment.wsdl11.Wsdl11AttachmentPolicyProvider,org.apache.cxf.ws.policy.attachment.ServiceModelPolicyProvider,org.apache.cxf.ws.policy.mtom.MTOMAssertionBuilder,org.apache.cxf.ws.policy.mtom.MTOMPolicyInterceptorProvider,org.apache.cxf.jaxrs.JAXRSBindingFactory];
root of factory hierarchy
[INFO] [resources:copy-resources {execution: copy-test-resources}]
[INFO] Using 'UTF-8' encoding to copy filtered resources.
[INFO] Copying 54 resources
[INFO] [resources:testResources]
[INFO] Using 'UTF-8' encoding to copy filtered resources.
[INFO] Copying 230 resources
[INFO] Copying 41 resources
[INFO] Copying 134 resources
[INFO] Copying 2 resources
[INFO] Copying 3 resources
[INFO] [compiler:testCompile]
[INFO] Compiling 541 source files to http://hudson.zones.apache.org/hudson/job/CXF-2.1.x-JDK15/org.apache.cxf$cxf-systests/ws/target/test-classes

[HUDSON] Archiving http://hudson.zones.apache.org/hudson/job/CXF-2.1.x-JDK15/org.apache.cxf$cxf-systests/ws/pom.xml
 to /export/home/hudson/hudson/jobs/CXF-2.1.x-JDK15/modules/org.apache.cxf$cxf-systests/builds/2009-05-21_20-23-01/archive/org.apache.cxf/cxf-systests/2.1.6-SNAPSHOT/pom.xml
[INFO] ------------------------------------------------------------------------
[ERROR] BUILD FAILURE
[INFO] ------------------------------------------------------------------------
[INFO] Compilation failure
http://hudson.zones.apache.org/hudson/job/CXF-2.1.x-JDK15/org.apache.cxf$cxf-systests/ws/src/test/java/org/apache/cxf/systest/dispatch/DispatchClientServerTest.java
:[328,17] cannot find symbol
symbol  : class ExecutionException
location: class org.apache.cxf.systest.dispatch.DispatchClientServerTest



http://hudson.zones.apache.org/hudson/job/CXF-2.1.x-JDK15/org.apache.cxf$cxf-systests/ws/src/test/java/org/apache/cxf/systest/dispatch/DispatchClientServerTest.java
:[328,17] cannot find symbol
symbol  : class ExecutionException
location: class org.apache.cxf.systest.dispatch.DispatchClientServerTest


[INFO] ------------------------------------------------------------------------
[INFO] Trace
org.apache.maven.BuildFailureException: Compilation failure
http://hudson.zones.apache.org/hudson/job/CXF-2.1.x-JDK15/org.apache.cxf$cxf-systests/ws/src/test/java/org/apache/cxf/systest/dispatch/DispatchClientServerTest.java
:[328,17] cannot find symbol
symbol  : class ExecutionException
location: class org.apache.cxf.systest.dispatch.DispatchClientServerTest


	at org.apache.maven.lifecycle.DefaultLifecycleExecutor.executeGoals(DefaultLifecycleExecutor.java:579)
	at org.apache.maven.lifecycle.DefaultLifecycleExecutor.executeGoalWithLifecycle(DefaultLifecycleExecutor.java:499)
	at org.apache.maven.lifecycle.DefaultLifecycleExecutor.executeGoal(DefaultLifecycleExecutor.java:478)
	at org.apache.maven.lifecycle.DefaultLifecycleExecutor.executeGoalAndHandleFailures(DefaultLifecycleExecutor.java:330)
	at org.apache.maven.lifecycle.DefaultLifecycleExecutor.executeTaskSegments(DefaultLifecycleExecutor.java:291)
	at org.apache.maven.lifecycle.DefaultLifecycleExecutor.execute(DefaultLifecycleExecutor.java:142)
	at org.apache.maven.lifecycle.LifecycleExecutorInterceptor.execute(LifecycleExecutorInterceptor.java:65)
	at org.apache.maven.DefaultMaven.doExecute(DefaultMaven.java:336)
	at org.apache.maven.DefaultMaven.execute(DefaultMaven.java:129)
	at org.apache.maven.cli.MavenCli.main(MavenCli.java:287)
	at sun.reflect.NativeMethodAccessorImpl.invoke0(Native Method)
	at sun.reflect.NativeMethodAccessorImpl.invoke(NativeMethodAccessorImpl.java:39)
	at sun.reflect.DelegatingMethodAccessorImpl.invoke(DelegatingMethodAccessorImpl.java:25)
	at java.lang.reflect.Method.invoke(Method.java:585)
	at org.codehaus.classworlds.Launcher.launchEnhanced(Launcher.java:315)
	at org.codehaus.classworlds.Launcher.launch(Launcher.java:255)
	at hudson.maven.agent.Main.launch(Main.java:158)
	at hudson.maven.MavenBuilder.call(MavenBuilder.java:162)
	at hudson.maven.MavenModuleSetBuild$Builder.call(MavenModuleSetBuild.java:579)
	at hudson.maven.MavenModuleSetBuild$Builder.call(MavenModuleSetBuild.java:525)
	at hudson.remoting.UserRequest.perform(UserRequest.java:69)
	at hudson.remoting.UserRequest.perform(UserRequest.java:23)
	at hudson.remoting.Request$2.run(Request.java:213)
	at java.util.concurrent.Executors$RunnableAdapter.call(Executors.java:417)
	at java.util.concurrent.FutureTask$Sync.innerRun(FutureTask.java:269)
	at java.util.concurrent.FutureTask.run(FutureTask.java:123)
	at java.util.concurrent.ThreadPoolExecutor$Worker.runTask(ThreadPoolExecutor.java:650)
	at java.util.concurrent.ThreadPoolExecutor$Worker.run(ThreadPoolExecutor.java:675)
	at java.lang.Thread.run(Thread.java:595)
Caused by: org.apache.maven.plugin.CompilationFailureException: Compilation failure
http://hudson.zones.apache.org/hudson/job/CXF-2.1.x-JDK15/org.apache.cxf$cxf-systests/ws/src/test/java/org/apache/cxf/systest/dispatch/DispatchClientServerTest.java
:[328,17] cannot find symbol
symbol  : class ExecutionException
location: class org.apache.cxf.systest.dispatch.DispatchClientServerTest


	at org.apache.maven.plugin.AbstractCompilerMojo.execute(AbstractCompilerMojo.java:516)
	at org.apache.maven.plugin.TestCompilerMojo.execute(TestCompilerMojo.java:102)
	at org.apache.maven.plugin.DefaultPluginManager.executeMojo(DefaultPluginManager.java:451)
	at hudson.maven.agent.PluginManagerInterceptor.executeMojo(PluginManagerInterceptor.java:182)
	at org.apache.maven.lifecycle.DefaultLifecycleExecutor.executeGoals(DefaultLifecycleExecutor.java:558)
	... 28 more
[INFO] ------------------------------------------------------------------------
[INFO] Total time: 22 minutes 30 seconds
[INFO] Finished at: Thu May 21 14:07:09 PDT 2009
[INFO] Final Memory: 104M/167M
[INFO] ------------------------------------------------------------------------


Mime
View raw message